{"text_format":"1","workbook":"xlsx","n_sheets":9,"sheets":["Copyright","Cover","Instruction","All Result","Sheet1","FW nonmetal nonplant","FW nonmetal nonplant_WS","FW nonmetal plant","FW nonmetal plant_WS"],"not_rendered":{"charts":0,"images":0,"macros":1,"external_links":0,"defined_names":4,"comments":3,"pivot_tables":0},"unopened":[],"bounds":{"document_bytes":16777216,"sheet_cells":100000,"rows_first":2000,"rows_last":500,"rows_between":2000,"halvings":0,"cell_chars":16384,"cell_head_chars":4096},"cells_cut":0,"cells_raw":0,"read":"whole","date_system":"1900"}

{"sheet":"Copyright","index":0,"n_rows":0,"n_cols":0,"rows_kept":0,"cut":false,"hidden":false,"merged":[]}

{"sheet":"Cover","index":1,"n_rows":20,"n_cols":7,"rows_kept":20,"cut":false,"hidden":false,"merged":[[18,6,18,8],[14,6,14,8],[13,6,13,8],[4,4,4,10],[9,6,9,8],[12,6,12,8],[5,5,6,9]]}
[]
[]
[]
[]
[null,null,null,null,"Ecotoxicity Data Quality Assessment Method V2.4"]
[null,null,null,null,null,"To be used to assess the quality of data used for the Australian and New Zealand Guidelines for Fresh and Marine Water Quality (including sediment) and the Australian National Environment Protection (Assessment of Site Contamination) Measure"]
[]
[]
[]
[null,null,null,null,null,null,"Developed by "]
{"$rows_left_out":11}
{"sheet":"Instruction","index":2,"n_rows":21,"n_cols":10,"rows_kept":21,"cut":false,"hidden":false,"merged":[[27,6,27,16],[14,6,14,7],[5,4,5,7]]}
[]
[]
[null,"Click here to see \"All Result\" -->","All Result"]
[]
[]
[null,null,null,null,"Freshwater "]
[]
[null,"Tabs contain questionaries -->           ","Freshwater/metal/nonplant",null,"Freshwater/non-metal/non-plant ",null,null,"Freshwater/metal/plant",null,"Freshwater/non-metal/plant"]
[]
[]
{"$rows_left_out":12}
{"sheet":"All Result","index":3,"n_rows":47,"n_cols":32,"rows_kept":47,"cut":false,"hidden":false,"merged":[]}
["Chemical:","Sulfometuron-methyl"]
["Medium:","Freshwater"]
[{"$f":"'FW nonmetal plant'!C2","v":"Category"},{"$f":"'FW nonmetal plant'!C3","v":"Paper and data unique identifier(eg. 1-1,10-150)"},{"$f":"'FW nonmetal plant'!C70","v":"Total score"},{"$f":"'FW nonmetal plant'!C72","v":"Quality Score"},"Comment ",{"$f":"'FW nonmetal plant'!G3","v":"Species (Scientific name)"},{"$f":"'FW nonmetal plant'!G4","v":"Lifestage"},{"$f":"'FW nonmetal plant'!G5","v":"Exposure duration"},{"$f":"'FW nonmetal plant'!G6","v":"Measure of toxicity"},{"$f":"'FW nonmetal plant'!G7","v":"Toxicity endpoint"},{"$f":"'FW nonmetal plant'!G8","v":"Toxicity value"},{"$f":"'FW nonmetal plant'!J2","v":"Taxonomic group"},{"$f":"'FW nonmetal plant'!J3","v":"Phylum"},{"$f":"'FW nonmetal plant'!J4","v":"Class"},{"$f":"'FW nonmetal plant'!J5","v":"Media"},{"$f":"'FW nonmetal plant'!J6","v":"Temperature "},{"$f":"'FW nonmetal plant'!J7","v":"Acute Or Chronic "},{"$f":"'FW nonmetal plant'!J8","v":"PH"},{"$f":"#REF!","v":{"$error":"#REF!"}},{"$f":"#REF!","v":{"$error":"#REF!"}},{"$f":"#REF!","v":{"$error":"#REF!"}},null,null,null,null,null,null,null,null,null,null,"Olivia Formulation Check"]
["Freshwater/non-metal/non- plant","692-1",65,0.7142857142857143,"The highest possible grade for this datum is acceptable.","Alonella sp. ","N.A.","48 hrs","LC50","Mortality","802 mg/L","Microinvertebrate","Arthropoda","Branchiopoda","Aged tap water","20-22oC","Acute ","8.0-8.5","N.A.","Naqvi, S.M. and R.H. Hawkins. 1989. Responses and LC50 values for selected microcrustaceans exposed to Spartan, Malathion, Sonar, Weedtrine-D and Oust Pesticides. Bulletin of Environmental Contamination and Toxicology 43: 386-393","692"]
["Freshwater/non-metal/plant","764-1",63,0.71590909090909094,"The highest possible grade for this datum is acceptable.","Anabaena flos-aquae","N.A.","5 days","NOEL","Growth","14 ug/L","Cyanobacteria","Cyanobacteria","Nutrient medium","N.A.","N.A.","Chronic","N.A.","N.A.","Thomspon S. 1994. Sulfometuron methyl (DPX-T5648): Influence on growth and reproduction of three select algal species: Lab Project Number: AMR 2892-93: 112A-121. (Unpublished study prepared by Wildlife International Ltd, Easton, MD and Haskell Laboratory for Toxicology and INdustrial Medicine, E.I. du Pont de Nemours and Co, Inc., Neward, DE). 58 p. MRID","764"]
["Freshwater/non-metal/plant","3605-1",53,0.60227272727272729,"The highest possible grade for this datum is acceptable.","Anabaena flos-aquae","N.A.","5 days","EC50","Growth","73 ug/L","Cyanobacteria","Cyanobacteria","N.A.","N.A.","N.A.","Chronic","N.A.","N.A.","USDA Integrated Pest Management (IPM) Database. Accessed November 2019","3605"]
["Freshwater/non-metal/plant","3605-2",53,0.60227272727272729,"The highest possible grade for this datum is acceptable.","Anabaena flos-aquae","N.A.","5 days","NOEC","Growth","14 ug/L","Cyanobacteria","Cyanobacteria","N.A.","N.A.","N.A.","Chronic","N.A.","N.A.","USDA Integrated Pest Management (IPM) Database. Accessed November 2019","3605"]
["Freshwater/non-metal/non- plant","693-1",67,0.73626373626373631,"","Ceriodaphnia dubia","Neonate","48 hrs","LC50","Mortality","200 ug/L","Microinvertebrate","Arthropoda","Branchiopoda","Moderately hard water","24-26oC","Acute ","8.0-8.5","N.A.","Tatum, V.L., D.L. Borton, W.R. Streblow, J. Louch and J.P. Shepard. 2012. Acute toxicity of commonly used forestry herbicide mixtures to Ceriodaphnia dubia and Pimephales promelas. Environmental Toxicology 27: 671-684","693"]
["Freshwater/non-metal/non- plant","692-2",65,0.7142857142857143,"The highest possible grade for this datum is acceptable.","Cyrpia sp. ","N.A.","48 hrs","LC50","Mortality","2241 mg/L","Microinvertebrate","Arthropoda","Ostracoda","Aged tap water","20-22oC","Acute ","8.0-8.5","N.A.","Naqvi, S.M. and R.H. Hawkins. 1989. Responses and LC50 values for selected microcrustaceans exposed to Spartan, Malathion, Sonar, Weedtrine-D and Oust Pesticides. Bulletin of Environmental Contamination and Toxicology 43: 386-393","692"]
["Freshwater/non-metal/non- plant","3600-1",62,0.68131868131868134,"","Daphnia magna","Not stated","48 hrs","EC50","Immobilisation","12500 ug/L","Macroinvertebrate","Arthropoda","Branchiopoda","Not stated","Not stated","Acute ","Not stated","N.A.","USDA Integrated Pest Management (IPM) Database. Accessed November 2019","3600"]
{"$rows_left_out":38}
{"sheet":"Sheet1","index":4,"n_rows":70,"n_cols":29,"rows_kept":70,"cut":false,"hidden":true,"merged":[]}
[]
[{"$f":"#REF!","v":{"$error":"#REF!"}},{"$f":"#REF!","v":{"$error":"#REF!"}},{"$f":"#REF!","v":{"$error":"#REF!"}},{"$f":"#REF!","v":{"$error":"#REF!"}},{"$f":"#REF!","v":{"$error":"#REF!"}},{"$f":"#REF!","v":{"$error":"#REF!"}},{"$f":"#REF!","v":{"$error":"#REF!"}},{"$f":"#REF!","v":{"$error":"#REF!"}},{"$f":"#REF!","v":{"$error":"#REF!"}},{"$f":"#REF!","v":{"$error":"#REF!"}},{"$f":"#REF!","v":{"$error":"#REF!"}},{"$f":"#REF!","v":{"$error":"#REF!"}},{"$f":"#REF!","v":{"$error":"#REF!"}},{"$f":"#REF!","v":{"$error":"#REF!"}},{"$f":"#REF!","v":{"$error":"#REF!"}},{"$f":"#REF!","v":{"$error":"#REF!"}},{"$f":"#REF!","v":{"$error":"#REF!"}},{"$f":"#REF!","v":{"$error":"#REF!"}},{"$f":"#REF!","v":{"$error":"#REF!"}},{"$f":"#REF!","v":{"$error":"#REF!"}},{"$f":"#REF!","v":{"$error":"#REF!"}},{"$f":"#REF!","v":{"$error":"#REF!"}},{"$f":"#REF!","v":{"$error":"#REF!"}},{"$f":"#REF!","v":{"$error":"#REF!"}},{"$f":"#REF!","v":{"$error":"#REF!"}},{"$f":"#REF!","v":{"$error":"#REF!"}}]
[{"$f":"#REF!","v":{"$error":"#REF!"}},{"$f":"#REF!","v":{"$error":"#REF!"}},{"$f":"#REF!","v":{"$error":"#REF!"}},{"$f":"#REF!","v":{"$error":"#REF!"}}]
[{"$f":"#REF!","v":{"$error":"#REF!"}},{"$f":"#REF!","v":{"$error":"#REF!"}},{"$f":"#REF!","v":{"$error":"#REF!"}},{"$f":"#REF!","v":{"$error":"#REF!"}},{"$f":"#REF!","v":{"$error":"#REF!"}},{"$f":"#REF!","v":{"$error":"#REF!"}},{"$f":"#REF!","v":{"$error":"#REF!"}},{"$f":"#REF!","v":{"$error":"#REF!"}},{"$f":"#REF!","v":{"$error":"#REF!"}},{"$f":"#REF!","v":{"$error":"#REF!"}},{"$f":"#REF!","v":{"$error":"#REF!"}},{"$f":"#REF!","v":{"$error":"#REF!"}},{"$f":"#REF!","v":{"$error":"#REF!"}},{"$f":"#REF!","v":{"$error":"#REF!"}},{"$f":"#REF!","v":{"$error":"#REF!"}},{"$f":"#REF!","v":{"$error":"#REF!"}},{"$f":"#REF!","v":{"$error":"#REF!"}},{"$f":"#REF!","v":{"$error":"#REF!"}},{"$f":"#REF!","v":{"$error":"#REF!"}},{"$f":"#REF!","v":{"$error":"#REF!"}},{"$f":"#REF!","v":{"$error":"#REF!"}},{"$f":"#REF!","v":{"$error":"#REF!"}},{"$f":"#REF!","v":{"$error":"#REF!"}},{"$f":"#REF!","v":{"$error":"#REF!"}},{"$f":"#REF!","v":{"$error":"#REF!"}},{"$f":"#REF!","v":{"$error":"#REF!"}}]
["Answers",{"$f":"IF(#REF!=0,\"\",#REF!)","v":{"$error":"#REF!"}},{"$f":"IF(#REF!=0,\"\",#REF!)","v":{"$error":"#REF!"}},{"$f":"IF(#REF!=0,\"\",#REF!)","v":{"$error":"#REF!"}},{"$f":"IF(#REF!=0,\"\",#REF!)","v":{"$error":"#REF!"}},{"$f":"IF(#REF!=0,\"\",#REF!)","v":{"$error":"#REF!"}},{"$f":"IF(#REF!=0,\"\",#REF!)","v":{"$error":"#REF!"}},{"$f":"IF(#REF!=0,\"\",#REF!)","v":{"$error":"#REF!"}},{"$f":"IF(#REF!=0,\"\",#REF!)","v":{"$error":"#REF!"}},{"$f":"IF(#REF!=0,\"\",#REF!)","v":{"$error":"#REF!"}},{"$f":"IF(#REF!=0,\"\",#REF!)","v":{"$error":"#REF!"}},{"$f":"IF(#REF!=0,\"\",#REF!)","v":{"$error":"#REF!"}},{"$f":"IF(#REF!=0,\"\",#REF!)","v":{"$error":"#REF!"}},{"$f":"IF(#REF!=0,\"\",#REF!)","v":{"$error":"#REF!"}},{"$f":"IF(#REF!=0,\"\",#REF!)","v":{"$error":"#REF!"}},{"$f":"IF(#REF!=0,\"\",#REF!)","v":{"$error":"#REF!"}},{"$f":"IF(#REF!=0,\"\",#REF!)","v":{"$error":"#REF!"}},{"$f":"IF(#REF!=0,\"\",#REF!)","v":{"$error":"#REF!"}},{"$f":"IF(#REF!=0,\"\",#REF!)","v":{"$error":"#REF!"}},{"$f":"IF(#REF!=0,\"\",#REF!)","v":{"$error":"#REF!"}},{"$f":"IF(#REF!=0,\"\",#REF!)","v":{"$error":"#REF!"}},{"$f":"IF(#REF!=0,\"\",#REF!)","v":{"$error":"#REF!"}},{"$f":"IF(#REF!=0,\"\",#REF!)","v":{"$error":"#REF!"}},{"$f":"IF(#REF!=0,\"\",#REF!)","v":{"$error":"#REF!"}}]
[{"$f":"#REF!","v":{"$error":"#REF!"}},{"$f":"#REF!","v":{"$error":"#REF!"}},{"$f":"#REF!","v":{"$error":"#REF!"}},{"$f":"#REF!","v":{"$error":"#REF!"}},{"$f":"#REF!","v":{"$error":"#REF!"}},{"$f":"#REF!","v":{"$error":"#REF!"}},{"$f":"#REF!","v":{"$error":"#REF!"}},{"$f":"#REF!","v":{"$error":"#REF!"}}]
[{"$f":"#REF!","v":{"$error":"#REF!"}},{"$f":"#REF!","v":{"$error":"#REF!"}},{"$f":"#REF!","v":{"$error":"#REF!"}},{"$f":"#REF!","v":{"$error":"#REF!"}},{"$f":"#REF!","v":{"$error":"#REF!"}},{"$f":"IF(#REF!=0,\"\",#REF!)","v":{"$error":"#REF!"}},{"$f":"IF(#REF!=0,\"\",#REF!)","v":{"$error":"#REF!"}},{"$f":"IF(#REF!=0,\"\",#REF!)","v":{"$error":"#REF!"}}]
[]
[]
[]
{"$rows_left_out":61}
{"sheet":"FW nonmetal nonplant","index":5,"n_rows":111,"n_cols":53,"rows_kept":111,"cut":false,"hidden":false,"merged":[[3,4,7,4],[9,2,9,4],[11,2,13,2],[11,7,13,7],[14,2,16,2],[14,7,16,7],[17,2,19,2],[17,7,19,7],[20,2,21,2],[20,7,21,7],[22,2,24,2],[22,7,24,7],[25,2,27,2],[25,7,27,7],[28,2,30,2],[28,7,30,7],[31,2,33,2],[31,7,33,7],[34,2,36,2],[34,7,36,7],[37,2,39,2],[37,7,39,7],[40,2,42,2],[40,7,42,7],[43,2,45,2],[43,7,45,7],[46,2,48,2],[46,7,48,7],[49,2,51,2],[49,7,51,7],[65,2,68,2],[65,7,68,7],[59,7,61,7],[52,2,54,2],[52,7,54,7],[56,7,58,7],[62,2,64,2],[62,7,64,7]]}
[null,1,"Fill in the blank cells below, based on information provided in the paper being assessed. You can either pick an option from the dropdown list or add the appropriate detail using the 'Add to list' button. ",null,null,null,null,null,null,null,null,null,null,null,"* All the text in RED are used for drop down list ,make changes with caution."]
[null,null,"Category",{"$f":"IF(AF3=\"\",0,1)","v":1},"Freshwater/non-metal/non- plant",{"$f":"IF(E3=\"\",0,1)","v":1},"Citation No.",{"$f":"IF(ISERROR(FIND(\"-\",E3)),E3,LEFT(E3,FIND(\"-\",E3)-1))","v":"691"},null,"Taxonomic group",null,null,null,null,"Species",null,null,"Lifestage",null,null,"Exposure duration",null,null,"Measure of toxicity",null,null,"Toxicity endpoint",null,null,"Taxonomic group",null,null,"Phylum",null,null,"Class",null,null,"Media",null,null,"Temperature ",null,null,"Acute Or Chronic",null,null,"PH",null,null,"Salinity/Comdictivity"]
[null,null,"Paper and data unique identifier(eg. 1-1,10-150)",{"$f":"IF(AI3=\"\",0,1)","v":1},"691-7",{"$f":"IF(E4=\"\",0,1)","v":1},"Species (Scientific name)",null,null,"Phylum",null,null,null,null,"Acanthocyclops robustus",91,{"$f":"IF(P3=0,\"\",INDEX(O3:O102,P3))","v":"Xenopus laevis"},"<120 days post h atch",23,{"$f":"IF(S3=0,\"\",INDEX(R3:R102,S3))","v":"embryo"},"10 day",43,{"$f":"IF(V3=0,\"\",INDEX(U3:U102,V3))","v":"96 hrs"},"EC10",3,{"$f":"IF(Y3=0,\"\",INDEX(X3:X102,Y3))","v":"EC50"},"ability to cling",13,{"$f":"IF(AB3=0,\"\",INDEX(AA3:AA102,AB3))","v":"Development"},"Amphibian",1,{"$f":"IF(AE3=0,\"\",INDEX(AD3:AD102,AE3))","v":"Amphibian"},"\tChytridiomycota",9,{"$f":"IF(AH3=0,\"\",INDEX(AG3:AG102,AH3))","v":"Chordata"},"\tOstracoda",4,{"$f":"IF(AK3=0,\"\",INDEX(AJ3:AJ102,AK3))","v":"Amphibia"},"algaltoxkit",53,{"$f":"IF(AN3=0,\"\",INDEX(AM3:AM102,AN3))","v":"FETAX Solution"},8,75,{"$f":"IF(AQ3=0,\"\",INDEX(AP3:AP102,AQ3))","v":"19-21oC"},"7.378-8.33",3,{"$f":"IF(AT3=0,\"\",INDEX(AS3:AS102,AT3))","v":"Acute "},7,40,{"$f":"IF(AW3=0,\"\",INDEX(AV3:AV102,AW3))","v":"7.8-8.0"},null,null,"N.A."]
[null,null,"Citation",{"$f":"IF(AL3=\"\",0,1)","v":1},"Fort, D.J., R. Rogers, H. Copley, L. Bruning, E.L. Stover and D. Rapaport. 1999. Effect of sulfometuron methyl and nicosulfuron on development and metamorphosis in Xenopus laevis: Impact of Purity. Environmental Toxicology and Chemistry 18: 2934-2940",{"$f":"IF(H8=\"\",0,1)","v":1},"Lifestage",null,null,"Class",null,null,null,null,"Aedes aegypti",null,null,"<24h neonate f2 ",null,null,"11 hour",null,null,"EC50",null,null,"ability to swim",null,null,"Bacteria",null,null,"\tOomycota",null,null,"\tSordariomycetes",null,null,"artificial system water",null,null,10,null,null,"7.78-8.33",null,null,7.5]
[null,null,null,{"$f":"IF(AO3=\"\",0,1)","v":1},null,{"$f":"IF(W3=\"\",0,1)","v":1},"Exposure duration",null,null,"Media",null,null,null,null,"Aedes albopictus",null,null,"<24hr neonate",null,null,"1-2 weeks",null,null,"EC50",null,null,"ability to thrash when prodded",null,null,"Chordata",null,null,"\tRotifera",null,null,"Actinopterygii",null,null,"ATSM hardwater",null,null,12,null,null,"Acute ",null,null,7.5]
[null,null,null,{"$f":"IF(AR3=\"\",0,1)","v":1},null,{"$f":"IF(Q3=\"\",0,1)","v":1},"Measure of toxicity",null,null,"Temperature ",null,null,null,null,"Aedes albopictus",null,null,">23 days",null,null,"120hpf",null,null,"hatchability",null,null,"ability to walk/crawl",null,null,"Chromista",null,null,"Actinopterygii",null,null,"Amphibia",null,null,"Bore water",null,null,12,null,null,"Chronic",null,null,7.66]
[null,null,null,{"$f":"IF(AU3=\"\",0,1)","v":1},null,{"$f":"IF(T3=\"\",0,1)","v":1},"Toxicity endpoint",null,null,"Acute Or Chronic ",null,null,null,null,"Aedes albopictus HAmAal strain",null,null,">6 month ",null,null,"13 days",null,null,"IC25",null,null,"activity",null,null,"Fish",null,null,"Arthropoda",null,null,"Bivalvia",null,null,"CBS culture collection",null,null,12,null,null,"N.A.",null,null,7.67]
[null,null,null,null,null,{"$f":"IF(W3=\"\",0,1)","v":1},"Toxicity value","4200 ug/L",null,"PH",null,null,null,null,"Aedes albopictus Ikaken strain",null,null,"1 month",null,null,"14 days",null,null,"LC10",null,null,"Body length",null,null,"Fish",null,null,"Ascomycota",null,null,"Branchiopoda",null,null,"Clean river water",null,null,13,null,null,null,null,null,7.8]
[null,2,"Select the appropriate answer option to each question. Comments can be added to the cells in column H.",null,null,{"$f":"IF(Z3=\"\",0,1)","v":1},null,null,null,"Salinity/Conductivity","N.A.",null,null,null,"Aedes albopictus MAmAal strain",null,null,"1 year old",null,null,"19 days",null,null,"LC100",null,null,"Body weight",null,null,"Flagellate",null,null,"Basidiomycota",null,null,"Chlorophyceae  ",null,null,"Clean river watrer",null,null,13,null,null,null,null,null,8.1]
[null,"*","If the selected answer option does not work try clicking on any other cell first and then click back on the answer option again.",null,null,{"$f":"IF(AC3=\"\",0,1)","v":1},null,null,null,null,null,null,null,null,"Aedes albopictus SFmAal strain",null,null,"1st instar larvae",null,null,"21 day",null,null,"LC50",null,null,"Brood size",null,null,"Fungi",null,null,"Chlorophyta",null,null,"Chytridiomycetes",null,null,"Daphtoxkit",null,null,13,null,null,null,null,null,"6.5-7"]
{"$rows_left_out":102}
{"sheet":"FW nonmetal nonplant_WS","index":6,"n_rows":87,"n_cols":24,"rows_kept":87,"cut":false,"hidden":false,"merged":[]}
[]
["Question No.",1,2,3,4,5,6,7,8,9,10,11,12,13,14,15,16.100000000000001,16.600000000000001,17,18,"Total Score","Quality Score",null,"Comment "]
["Short Questions","Duration of the exposure ","Biological endpoint","Biological effect stated or not","Biological effect quantified or not","Appropriate controls","Control & contaminant concentration","Test acceptability criteria","Characteristics of the test organism"," Type of test media","Type of exposure","Contaminant concentrations","Parallel reference toxicant toxicity tests","Concentration–response relationship","Determine the toxicity","NOEC/LOEC or LC/EC/BEC","pH","Dissolved oxygen","Temperature","Grade or purity"]
["Category","Freshwater/non-metal/non- plant","Paper and data unique identifier(eg. 1-1,10-150)","692-1"]
["Scores",10,5,5,5,5,5,0,0,5,4,0,0,4,4,4,3,0,3,3,65,0.7142857142857143,null,"The highest possible grade for this datum is acceptable."]
["Answers","2 days - 48 hours","Survival","LC50","LC50","Aged tap water controls ","Triplicate","Not stated","Not stated (Lake collected organisms)","Aged tap water","Static","Not stated","Not stated","Table 1","Probit analysis program","p < 0.05","8-8.5","Not stated","6.6-7.5","Oust - 93% AI"]
["Category","Freshwater/non-metal/non- plant","Paper and data unique identifier(eg. 1-1,10-150)","692-2"]
["Scores",10,5,5,5,5,5,0,0,5,4,0,0,4,4,4,3,0,3,3,65,0.7142857142857143,null,"The highest possible grade for this datum is acceptable."]
["Answers","2 days - 48 hours","Survival","LC50","LC50","Aged tap water controls ","Triplicate","Not stated","Not stated (Lake collected organisms)","Aged tap water","Static","Not stated","Not stated","Table 1","Probit analysis program","p < 0.05","8-8.5","Not stated","6.6-7.5","Oust - 93% AI"]
["Category","Freshwater/non-metal/non- plant","Paper and data unique identifier(eg. 1-1,10-150)","692-3"]
{"$rows_left_out":78}
{"sheet":"FW nonmetal plant","index":7,"n_rows":79,"n_cols":53,"rows_kept":79,"cut":false,"hidden":false,"merged":[[3,4,7,4],[9,2,9,4],[11,2,13,2],[11,7,13,7],[14,2,16,2],[14,7,16,7],[17,2,19,2],[17,7,19,7],[20,2,21,2],[20,7,21,7],[22,2,24,2],[22,7,24,7],[25,2,27,2],[25,7,27,7],[28,2,30,2],[28,7,30,7],[31,2,33,2],[31,7,33,7],[34,2,36,2],[34,7,36,7],[37,2,39,2],[37,7,39,7],[40,2,42,2],[40,7,42,7],[43,2,45,2],[43,7,45,7],[46,2,48,2],[46,7,48,7],[49,2,51,2],[49,7,51,7],[60,2,62,2],[60,7,62,7],[63,2,66,2],[63,7,66,7],[52,2,54,2],[52,7,54,7],[56,2,59,2],[56,7,59,7]]}
[null,1,"Fill in the blank cells below, based on information provided in the paper being assessed. You can either pick an option from the dropdown list or add the appropriate detail using the 'Add to list' button. ",null,null,null,null,null,null,null,null,null,null,null,"* All the text in RED are used for drop down list ,make changes with caution."]
[null,null,"Category",{"$f":"IF(AF3=\"\",0,1)","v":1},"Freshwater/non-metal/plant",{"$f":"IF(E3=\"\",0,1)","v":1},"Citation No.",{"$f":"IF(ISERROR(FIND(\"-\",E3)),E3,LEFT(E3,FIND(\"-\",E3)-1))","v":"3607"},null,"Taxonomic group",null,null,null,null,"Species",null,null,"Lifestage",null,null,"Exposure duration",null,null,"Measure of toxicity",null,null,"Toxicity endpoint",null,null,"Taxonomic group",null,null,"Phylum",null,null,"Class",null,null,"Media",null,null,"Temperature ",null,null,"Acute Or Chronic",null,null,"PH",null,null,"Salinity/Conductivity"]
[null,null,"Paper and data unique identifier(eg. 1-1,10-150)",{"$f":"IF(AI3=\"\",0,1)","v":1},"3607-2",{"$f":"IF(E4=\"\",0,1)","v":1},"Species (Scientific name)",null,null,"Phylum",null,null,null,null,"Aedes albopictus",28,{"$f":"IF(P3=0,\"\",INDEX(O3:O100,P3))","v":"Lemna gibba"},"1 month",6,{"$f":"IF(S3=0,\"\",INDEX(R3:R100,S3))","v":"N.A."},"11 hours",13,{"$f":"IF(V3=0,\"\",INDEX(U3:U100,V3))","v":"14 days"},"EC1",8,{"$f":"IF(Y3=0,\"\",INDEX(X3:X100,Y3))","v":"NOEC"},"cartenoid conc. ",15,{"$f":"IF(AB3=0,\"\",INDEX(AA3:AA100,AB3))","v":"Growth"},"Cyano",3,{"$f":"IF(AE3=0,\"\",INDEX(AD3:AD100,AE3))","v":"Macrophyte"},"Chlorophyta",4,{"$f":"IF(AH3=0,\"\",INDEX(AG3:AG100,AH3))","v":"Tracheophyta"},"Branchiopoda",4,{"$f":"IF(AK3=0,\"\",INDEX(AJ3:AJ102,AK3))","v":"Liliopsida"},"AAP",8,{"$f":"IF(AN3=0,\"\",INDEX(AM3:AM100,AN3))","v":"N.A."},20,13,{"$f":"IF(AQ3=0,\"\",INDEX(AP3:AP100,AQ3))","v":"N.A."},"Acute ",2,{"$f":"IF(AT3=0,\"\",INDEX(AS3:AS100,AT3))","v":"Chronic"},5.5,9,{"$f":"IF(AW3=0,\"\",INDEX(AV3:AV100,AW3))","v":"N.A."},"30 ppt",null,"N.A."]
[null,null,"Citation",{"$f":"IF(AL3=\"\",0,1)","v":1},"USDA Integrated Pest Management (IPM) Database. Accessed November 2019",{"$f":"IF(AX3=\"\",0,1)","v":1},"Lifestage",null,null,"Class",null,null,null,null,"Anabaena flos-aquae",null,null,"1 year old",null,null,"13 days ",null,null,"EC20",null,null,"Chlorophyll a conc. ",null,null,"Fish",null,null,"Cyanobacteria",null,null,"Chlorophyceae",null,null,"algaltoxkit",null,null,21,null,null,"Chronic",null,null,6.7,null,null,"150 uS/cm"]
[null,null,null,{"$f":"IF(AO3=\"\",0,1)","v":1},null,{"$f":"IF(H8=\"\",0,1)","v":1},"Exposure duration",null,null,"Media",null,null,null,null,"Australian Bass",null,null,"Exponential growth phase",null,null,"24 hr",null,null,"EC50",null,null,"Chlorophyll b conc. ",null,null,"Macrophyte",null,null,"N.A.",null,null,"Chlorophyceae",null,null,"Freshwater",null,null,22,null,null,"Chronic",null,null,6.9,null,null,"N.A."]
[null,null,null,{"$f":"IF(AR3=\"\",0,1)","v":1},null,{"$f":"IF(Q3=\"\",0,1)","v":1},"Measure of toxicity",null,null,"Temperature ",null,null,null,null,"Chlorella pyrenoidosa",null,null,"Exponential growth phase",null,null,"3 days",null,null,"EC80",null,null,"Growth inhibition",null,null,"Microalga",null,null,"Tracheophyta",null,null,"Liliopsida",null,null,"HB4",null,null,28,null,null,"N.A.",null,null,7.5]
[null,null,null,{"$f":"IF(AU3=\"\",0,1)","v":1},null,{"$f":"IF(T3=\"\",0,1)","v":1},"Toxicity endpoint",null,null,"Acute Or Chronic ",null,null,null,null,"Chlorella pyrenoidosa",null,null,"logarithmic growth phase",null,null,"6 days",null,null,"LC50",null,null,"Growth Inhibition: Algal Biomass (cell counts)",null,null,"N.A.",null,null,"Tracheophyta",null,null,"N.A.",null,null,"HGZ media",null,null,"15°C",null,null,null,null,null,7.7]
[null,null,null,null,null,{"$f":"IF(W3=\"\",0,1)","v":1},"Toxicity value","0.207 ug/L",null,"PH",null,null,null,null,"Chlorella vulgaris",null,null,"N.A.",null,null,"7 days",null,null,"LOEC",null,null,"Growth inhibition: AUC",null,null,"plantae",null,null,"Bacillariophyta",null,null,"Trebouxiophyceae",null,null,"Marinewater",null,null,"18-22",null,null,null,null,null,7.8]
[null,2,"Select the appropriate answer option to each question. Comments can be added to the cells in column H.",null,null,{"$f":"IF(Z3=\"\",0,1)","v":1},null,null,null,"Salinity/Conductivity","N.A.",null,null,null,"Chlorella vulgaris",null,null,"not stated",null,null,"72 hour",null,null,"N.A.",null,null,"Growth inhibition: cell count",null,null,"Cyanobacteria",null,null,"Magnoliophyta",null,null,"Magnoliopsida",null,null,"Moderately hard standard water",null,null,"20 ± 1°C",null,null,null,null,null,"7.5 - 8.3"]
[null,"*","If the selected answer option does not work try clicking on any other cell first and then click back on the answer option again.",null,null,{"$f":"IF(AC3=\"\",0,1)","v":1},null,null,null,null,null,null,null,null,"Dunaliella tertiolecta",null,null,"not stated",null,null,"96 hrs",null,null,"NOEC",null,null,"Growth inhibition: growth rate",null,null,"Microorganism",null,null,null,null,null,"Cyanophyceae",null,null,"N.A.",null,null,"21-24",null,null,null,null,null,"7.7-7.9"]
{"$rows_left_out":70}
{"sheet":"FW nonmetal plant_WS","index":8,"n_rows":117,"n_cols":22,"rows_kept":117,"cut":false,"hidden":false,"merged":[]}
[]
["Question No.",1,2,3,4,5,6,7,8,9,10,11,12,13,14,15,16.100000000000001,17,18,"Total Score","Quality Score","Comment "]
["Short Questions","Duration of the exposure ","Biological endpoint","Biological effect stated or not","Biological effect quantified or not","Appropriate controls","Control & contaminant concentration","Test acceptability criteria","Characteristics of the test organism"," Type of test media","Type of exposure","Contaminant concentrations","Parallel reference toxicant toxicity tests","Concentration–response relationship","Determine the toxicity","NOEC/LOEC or LC/EC/BEC","pH","Temperature","Grade or purity"]
["Category","Freshwater/non-metal/plant","Paper and data unique identifier(eg. 1-1,10-150)","244-1"]
["Scores",10,5,5,5,5,5,0,5,5,0,0,0,0,4,4,0,1,0,57,0.64772727272727271,"The highest possible grade for this datum is acceptable."]
["Answers","4 days","Growth","EC50","EC50","Control solutions with no herbicides. Herbicides were dissolved in acetone, methanol or distilled water","Triplicate","Not stated","6 x 10-5 cells/ml","HB4","Not stated","Not stated","Not stated","Not stated","Correlation coefficients > 0.85","Correlation coefficients > 0.85","Not stated","25oC","MCPA 10% soluble concentrate"]
["Category","Freshwater/non-metal/plant","Paper and data unique identifier(eg. 1-1,10-150)","245-1"]
["Scores",10,5,5,5,5,5,0,5,5,0,0,0,0,4,4,0,1,0,57,0.64772727272727271,"The highest possible grade for this datum is acceptable."]
["Answers","4 days","Growth","EC50","EC50","Control solutions with no herbicides. Herbicides were dissolved in acetone, methanol or distilled water","Triplicate","Not stated","6 x 10-5 cells/ml","HB4","Not stated","Not stated","Not stated","Not stated","Correlation coefficients > 0.85","Correlation coefficients > 0.85","Not stated","25oC","MCPA 10% soluble concentrate"]
["Category","Freshwater/non-metal/plant","Paper and data unique identifier(eg. 1-1,10-150)","245-2"]
{"$rows_left_out":107}