{"text_format":"1","workbook":"xlsx","n_sheets":9,"sheets":["Copyright","Cover","Instruction","Fresh Data QA","Sheet1","Fresh Quality","Marine Data QA","Marine Quality","All Result"],"not_rendered":{"charts":0,"images":0,"macros":1,"external_links":0,"defined_names":3,"comments":4,"pivot_tables":0},"unopened":[],"bounds":{"document_bytes":16777216,"sheet_cells":100000,"rows_first":2000,"rows_last":500,"rows_between":2000,"halvings":0,"cell_chars":16384,"cell_head_chars":4096},"cells_cut":0,"cells_raw":0,"read":"whole","date_system":"1900"}

{"sheet":"Copyright","index":0,"n_rows":0,"n_cols":0,"rows_kept":0,"cut":false,"hidden":false,"merged":[]}

{"sheet":"Cover","index":1,"n_rows":20,"n_cols":7,"rows_kept":20,"cut":false,"hidden":false,"merged":[[18,6,18,8],[14,6,14,8],[13,6,13,8],[4,4,4,10],[9,6,9,8],[12,6,12,8],[5,5,6,9]]}
[]
[]
[]
[]
[null,null,null,null,"Ecotoxicity Data Quality Assessment Method "]
[null,null,null,null,null,"To be used to assess the quality of data used for the Australian and New Zealand Guidelines for Fresh and Marine Water Quality (including sediment) and the Australian National Environment Protection (Assessment of Site Contamination) Measure"]
[]
[]
[]
[null,null,null,null,null,null,"Developed by "]
{"$rows_left_out":11}
{"sheet":"Instruction","index":2,"n_rows":17,"n_cols":11,"rows_kept":17,"cut":false,"hidden":false,"merged":[[16,6,16,8],[22,4,22,8]]}
[]
[]
[]
[]
[]
[]
[null,"Tabs contain questionaries -->           ",null,null,"Fresh Data QA ",null,"Marine Data QA",null,"Terrestrial Data QA",null,"Sediment Data QA"]
[]
[]
[]
{"$rows_left_out":8}
{"sheet":"Fresh Data QA","index":3,"n_rows":98,"n_cols":25,"rows_kept":98,"cut":false,"hidden":false,"merged":[[83,7,86,7],[34,2,36,2],[37,2,39,2],[28,2,30,2],[60,2,63,2],[40,2,42,2],[43,2,45,2],[83,2,86,2],[46,2,48,2],[31,2,33,2],[80,2,82,2],[49,2,51,2],[52,2,54,2],[56,2,59,2],[68,2,71,2],[72,2,75,2],[76,2,79,2],[11,7,13,7],[37,7,39,7],[28,7,30,7],[31,7,33,7],[25,7,27,7],[11,2,13,2],[14,2,16,2],[17,2,19,2],[25,2,27,2],[64,2,67,2],[80,7,82,7],[64,7,67,7],[68,7,71,7],[72,7,75,7],[76,7,79,7],[3,4,7,4],[56,7,59,7],[60,7,63,7],[40,7,42,7],[43,7,45,7],[46,7,48,7],[49,7,51,7],[34,7,36,7],[52,7,54,7],[14,7,16,7],[9,2,9,4],[20,2,21,2],[22,2,24,2],[17,7,19,7],[20,7,21,7],[22,7,24,7]]}
[null,1,"FILL IN BLANKS BELOW,PICK OPTIONS FROM DROPDOWN LIST",null,null,null,null,null,null,null,"* All the text in Blue are used for drop down list ,make changes with caution."]
[null,null,"Category",null,"Freshwater",{"$f":"IF(M3=\"\",0,1)","v":1},"Citation No.",{"$f":"IF(E3=\"\",\"\",LEFT(E3,FIND(\"-\",E3) -1))","v":{"$error":"#VALUE!"}},null,null,"Species",null,null,"Lifestage",null,null,"Exposure duration",null,null,"Measure of toxicity",null,null,"Toxicity endpoint"]
[null,null,"Paper and data unique identifier(eg. 1-1,10-150)",null,"???",{"$f":"IF(E3=\"\",0,1)","v":1},"Species (Scientific name)",null,null,null,"Acorus gramenius",15,{"$f":"IF(L3=0,\"\",INDEX(K3:K50,L3))","v":"Cyprinus carpio"},"<1 day old",3,{"$f":"IF(O3=0,\"\",INDEX(N3:N50,O3))","v":"1 year old"},"1 hour ",24,{"$f":"IF(R3=0,\"\",INDEX(Q3:Q50,R3))","v":"60 days"},"Growth - area",22,{"$f":"IF(U3=0,\"\",INDEX(T3:T50,U3))","v":"Mortality"},0.01,20,{"$f":"IF(X3=0,\"\",INDEX(W3:W50,X3))","v":"NOEC"}]
[null,null,"Citation",null,"Stara et al 2012",{"$f":"IF(E4=\"\",0,1)","v":1},"Lifestage",null,null,null,"Aedes albopictus",null,null,"1 month",null,null,"11 hour",null,null,"Growth Rate: Gain (Dry Weight)",null,null,0.02]
[null,null,null,null,null,{"$f":"IF(S3=\"\",0,1)","v":1},"Exposure duration",null,null,null,"Australian Bass",null,null,"1 year old",null,null,"13 days",null,null,"Growth Rate: Gain (Fresh Weight)",null,null,0.03]
[null,null,null,null,null,{"$f":"IF(V3=\"\",0,1)","v":1},"Measure of toxicity",null,null,null,"Bala Shark",null,null,"2 days old",null,null,"13 hour",null,null,"Growth Rate: Length",null,null,0.04]
[null,null,null,null,null,{"$f":"IF(Y3=\"\",0,1)","v":1},"Toxicity endpoint",null,null,null,"Basa",null,null,"2 weeks old",null,null,"14 days",null,null,"Growth Rate: New Leaves",null,null,0.05]
[null,null,null,null,null,{"$f":"IF(H8=\"\",0,1)","v":1},"Toxicity value","4 mg/L",null,null,"Black Parinha",null,null,"20 mins",null,null,"15 days",null,null,"Growth Rate: Number of Shoots",null,null,0.06]
[null,2,"CHOOSE ANSWER OPTIONS AND FILL IN ANSWERS IN ANSWER COLUMN",null,null,{"$f":"IF(M3=\"\",0,1)","v":1},null,null,null,null,"Brachionus calyciflorus",null,null,"4-5 months old",null,null,"2 hours",null,null,"Growth: ChlA",null,null,7.0000000000000007E-2]
[null,"*","If had problem click on answer options,click on any  other cells first and then click back again.",null,null,{"$f":"IF(P3=\"\",0,1)","v":1},null,null,null,null,"Branchiura sowerbyi",null,null,"4-6 months old",null,null,"20 mins",null,null,"Growth: Height",null,null,0.08]
{"$rows_left_out":89}
{"sheet":"Sheet1","index":4,"n_rows":34,"n_cols":29,"rows_kept":34,"cut":false,"hidden":true,"merged":[]}
[]
[{"$f":"'Fresh Data QA'!B11","v":"No."},{"$f":"'Fresh Data QA'!B13","v":1},{"$f":"'Fresh Data QA'!B16","v":2},{"$f":"'Fresh Data QA'!B19","v":3},{"$f":"'Fresh Data QA'!B21","v":4},{"$f":"'Fresh Data QA'!B23","v":5},{"$f":"'Fresh Data QA'!B26","v":6},{"$f":"'Fresh Data QA'!B29","v":7},{"$f":"'Fresh Data QA'!B32","v":8},{"$f":"'Fresh Data QA'!B35","v":9},{"$f":"'Fresh Data QA'!B39","v":10},{"$f":"'Fresh Data QA'!B42","v":11},{"$f":"'Fresh Data QA'!B45","v":12},{"$f":"'Fresh Data QA'!B48","v":13},{"$f":"'Fresh Data QA'!B51","v":14},{"$f":"'Fresh Data QA'!B53","v":15},{"$f":"'Fresh Data QA'!B58","v":16.100000000000001},{"$f":"'Fresh Data QA'!B62","v":16.2},{"$f":"'Fresh Data QA'!B66","v":16.3},{"$f":"'Fresh Data QA'!B70","v":16.399999999999999},{"$f":"'Fresh Data QA'!B74","v":16.5},{"$f":"'Fresh Data QA'!B78","v":16.600000000000001},{"$f":"'Fresh Data QA'!B82","v":17},{"$f":"'Fresh Data QA'!B85","v":18},{"$f":"'Fresh Data QA'!C90","v":"Total score"},{"$f":"'Fresh Data QA'!C92","v":"Quality Score"}]
[{"$f":"'Fresh Data QA'!C2","v":"Category"},{"$f":"'Fresh Data QA'!E2","v":"Freshwater"},{"$f":"'Fresh Data QA'!C3","v":"Paper and data unique identifier(eg. 1-1,10-150)"},{"$f":"'Fresh Data QA'!E3","v":"???"}]
[{"$f":"'Fresh Data QA'!G11","v":"Scores"},{"$f":"'Fresh Data QA'!G12","v":10},{"$f":"'Fresh Data QA'!G15","v":5},{"$f":"'Fresh Data QA'!G18","v":0},{"$f":"'Fresh Data QA'!G21","v":5},{"$f":"'Fresh Data QA'!G23","v":5},{"$f":"'Fresh Data QA'!G26","v":5},{"$f":"'Fresh Data QA'!G29","v":0},{"$f":"'Fresh Data QA'!G32","v":5},{"$f":"'Fresh Data QA'!G35","v":5},{"$f":"'Fresh Data QA'!G38","v":4},{"$f":"'Fresh Data QA'!G41","v":4},{"$f":"'Fresh Data QA'!G44","v":0},{"$f":"'Fresh Data QA'!G47","v":0},{"$f":"'Fresh Data QA'!G50","v":4},{"$f":"'Fresh Data QA'!G53","v":0},{"$f":"'Fresh Data QA'!G57","v":0},{"$f":"'Fresh Data QA'!G61","v":0},{"$f":"'Fresh Data QA'!G65","v":0},{"$f":"'Fresh Data QA'!G69","v":0},{"$f":"'Fresh Data QA'!G73","v":0},{"$f":"'Fresh Data QA'!G77","v":3},{"$f":"'Fresh Data QA'!G81","v":3},{"$f":"'Fresh Data QA'!G84","v":0},{"$f":"'Fresh Data QA'!G90","v":58},{"$f":"'Fresh Data QA'!G92","v":0.56310679611650483}]
["Answers",{"$f":"IF('Fresh Data QA'!H12=0,\"\",'Fresh Data QA'!H12)","v":""},{"$f":"IF('Fresh Data QA'!H15=0,\"\",'Fresh Data QA'!H15)","v":"The only relevant endpoint was mortality"},{"$f":"IF('Fresh Data QA'!H18=0,\"\",'Fresh Data QA'!H18)","v":""},{"$f":"IF('Fresh Data QA'!H21=0,\"\",'Fresh Data QA'!H21)","v":""},{"$f":"IF('Fresh Data QA'!H23=0,\"\",'Fresh Data QA'!H23)","v":""},{"$f":"IF('Fresh Data QA'!H26=0,\"\",'Fresh Data QA'!H26)","v":"For the other species there was replication and so they would get another 5 points"},{"$f":"IF('Fresh Data QA'!H29=0,\"\",'Fresh Data QA'!H29)","v":""},{"$f":"IF('Fresh Data QA'!H32=0,\"\",'Fresh Data QA'!H32)","v":""},{"$f":"IF('Fresh Data QA'!H35=0,\"\",'Fresh Data QA'!H35)","v":""},{"$f":"IF('Fresh Data QA'!H38=0,\"\",'Fresh Data QA'!H38)","v":""},{"$f":"IF('Fresh Data QA'!H41=0,\"\",'Fresh Data QA'!H41)","v":""},{"$f":"IF('Fresh Data QA'!H44=0,\"\",'Fresh Data QA'!H44)","v":""},{"$f":"IF('Fresh Data QA'!H47=0,\"\",'Fresh Data QA'!H47)","v":""},{"$f":"IF('Fresh Data QA'!H50=0,\"\",'Fresh Data QA'!H50)","v":""},{"$f":"IF('Fresh Data QA'!H53=0,\"\",'Fresh Data QA'!H53)","v":""},{"$f":"IF('Fresh Data QA'!H57=0,\"\",'Fresh Data QA'!H57)","v":""},{"$f":"IF('Fresh Data QA'!H61=0,\"\",'Fresh Data QA'!H65)","v":""},{"$f":"IF('Fresh Data QA'!H65=0,\"\",'Fresh Data QA'!H65)","v":""},{"$f":"IF('Fresh Data QA'!H69=0,\"\",'Fresh Data QA'!H69)","v":""},{"$f":"IF('Fresh Data QA'!H73=0,\"\",'Fresh Data QA'!H73)","v":""},{"$f":"IF('Fresh Data QA'!H77=0,\"\",'Fresh Data QA'!H77)","v":""},{"$f":"IF('Fresh Data QA'!H81=0,\"\",'Fresh Data QA'!H81)","v":""},{"$f":"IF('Fresh Data QA'!H84=0,\"\",'Fresh Data QA'!H84)","v":""}]
[{"$f":"'Fresh Data QA'!G3","v":"Species (Scientific name)"},{"$f":"'Fresh Data QA'!G4","v":"Lifestage"},{"$f":"'Fresh Data QA'!G5","v":"Exposure duration"},{"$f":"'Fresh Data QA'!G6","v":"Measure of toxicity"},{"$f":"'Fresh Data QA'!G7","v":"Toxicity endpoint"},{"$f":"'Fresh Data QA'!G8","v":"Toxicity value"},{"$f":"'Fresh Data QA'!C4","v":"Citation"},{"$f":"'Fresh Data QA'!G2","v":"Citation No."}]
[{"$f":"'Fresh Data QA'!M3","v":"Cyprinus carpio"},{"$f":"'Fresh Data QA'!P3","v":"1 year old"},{"$f":"'Fresh Data QA'!S3","v":"60 days"},{"$f":"'Fresh Data QA'!V3","v":"Mortality"},{"$f":"'Fresh Data QA'!Y3","v":"NOEC"},{"$f":"IF('Fresh Data QA'!H8=0,\"\",'Fresh Data QA'!H8)","v":"4 mg/L"},{"$f":"IF('Fresh Data QA'!E4=0,\"\",'Fresh Data QA'!E4)","v":"Stara et al 2012"},{"$f":"IF('Fresh Data QA'!H2=0,\"\",'Fresh Data QA'!H2)","v":{"$error":"#VALUE!"}}]
[]
[]
[]
{"$rows_left_out":25}
{"sheet":"Fresh Quality","index":5,"n_rows":848,"n_cols":26,"rows_kept":848,"cut":false,"hidden":false,"merged":[]}
[]
["Question No.",1,2,3,4,5,6,7,8,9,10,11,12,13,14,15,16.100000000000001,16.2,16.3,16.399999999999999,16.5,16.600000000000001,17,18,"Total Score","Quality Score"]
["Short Questions","Duration of the exposure ","Biological endpoint","Biological effect stated or not","Biological effect quantified or not","Appropriate controls","Control & contaminant concentration","Test acceptability criteria","Characteristics of the test organism"," Type of test media","Type of exposure","Contaminant concentrations","Parallel reference toxicant toxicity tests","Concentration–response relationship","Determine the toxicity","NOEC/LOEC or LC/EC/BEC","pH","POC","Particle size","AVS & 1-M HCl extractable metals","Dissolved contaminants","Dissolved ammonia and sulfide","Temperature","Grade or purity"]
["Marks Awarded","10 or 0","10,5 or 0","5 or 0 ","5 or 0 ","5 or 0 ","5 or 0 ","5 or 0 ","5 or 0 ","5 or 0 ","4 or 0","4 or 0","4 or 0","4 or 0","4 or 0","4 or 0","3,1,or 0","3,1,or 0","3,1,or 0","3,1,or 0","3,1,or 0","3,1,or 0","3 or 0","3 or 0"]
["Max. Possible Score",10,10,5,5,5,5,5,5,5,4,4,4,4,4,4,3,3,3,3,3,3,3,3,{"$f":"SUM(B5:X5)","v":103}]
["Category","Freshwater","Paper and data unique identifier(eg. 1-1,10-150)","1-2"]
["Scores",10,10,5,5,5,5,5,0,5,4,0,0,0,4,4,3,3,3,3,1,1,3,3,82,0.79611650485436891]
["Answers","","","","","","","","","","","","","","","","","","","","","","",""]
["Category","Freshwater","Paper and data unique identifier(eg. 1-1,10-150)","891-1"]
["Scores",10,10,5,5,5,5,0,5,5,4,0,0,0,4,4,3,0,0,3,0,0,3,3,74,0.71844660194174759]
{"$rows_left_out":839}
{"sheet":"Marine Data QA","index":6,"n_rows":98,"n_cols":25,"rows_kept":98,"cut":false,"hidden":false,"merged":[[3,4,7,4],[56,7,59,7],[60,7,63,7],[40,7,42,7],[43,7,45,7],[46,7,48,7],[49,7,51,7],[34,7,36,7],[52,7,54,7],[14,7,16,7],[11,7,13,7],[17,7,19,7],[20,7,21,7],[22,7,24,7],[25,7,27,7],[9,2,9,4],[80,7,82,7],[64,7,67,7],[68,7,71,7],[72,7,75,7],[76,7,79,7],[60,2,63,2],[40,2,42,2],[17,2,19,2],[28,2,30,2],[43,2,45,2],[25,2,27,2],[28,7,30,7],[31,7,33,7],[11,2,13,2],[20,2,21,2],[22,2,24,2],[14,2,16,2],[87,7,88,7],[46,2,48,2],[31,2,33,2],[37,7,39,7],[83,7,86,7],[34,2,36,2],[37,2,39,2],[83,2,86,2],[64,2,67,2],[68,2,71,2],[72,2,75,2],[76,2,79,2],[80,2,82,2],[49,2,51,2],[52,2,54,2],[56,2,59,2]]}
[null,1,"FILL IN BLANKS BELOW,PICK OPTIONS FROM DROPDOWN LIST",null,null,null,null,null,null,null,"* All the text in Blue are used for drop down list ,make changes with caution."]
[null,null,"Category",null,"Marine ",{"$f":"IF(M3=\"\",0,1)","v":1},"Citation No.",{"$f":"IF(E3=\"\",\"\",LEFT(E3,FIND(\"-\",E3) -1))","v":"852"},null,null,"Species",null,null,"Lifestage",null,null,"Exposure duration",null,null,"Measure of toxicity",null,null,"Toxicity endpoint"]
[null,null,"Paper and data unique identifier(eg. 1-1,10-150)",null,"852-1-GD",{"$f":"IF(E3=\"\",0,1)","v":1},"Species (Scientific name)",null,null,null,"Australian Bass",18,{"$f":"IF(L3=0,\"\",INDEX(K3:K50,L3))","v":"Proisotoma minuta"},"3h - 5h post-hatch larvae",13,{"$f":"IF(O3=0,\"\",INDEX(N3:N50,O3))","v":"60-day old"},"1 hour ",13,{"$f":"IF(R3=0,\"\",INDEX(Q3:Q50,R3))","v":"7 days"},"Method 1",11,{"$f":"IF(U3=0,\"\",INDEX(T3:T50,U3))","v":"Mortality"},0.01,14,{"$f":"IF(X3=0,\"\",INDEX(W3:W50,X3))","v":"LC50"}]
[null,null,"Citation",null,"Park, E.K. and Lees, E.M., 2005. Application of an Artificial Sea Salt Solution to Determine Acute Toxicity of Herbicides to Proisotoma minuta (Collembola), J. Environ. Sci. Health Part B Pestic. Food Contam. Agric. Wastes40(4): 595-604. ",{"$f":"IF(E4=\"\",0,1)","v":1},"Lifestage",null,null,null,"Bala Shark",null,null,"Exponential growth phase",null,null,"2 hours",null,null,"Method 10",null,null,0.02]
[null,null,null,null,null,{"$f":"IF(S3=\"\",0,1)","v":1},"Exposure duration",null,null,null,"Basa",null,null,"Phase 1",null,null,"3 days",null,null,"Method 2",null,null,0.03]
[null,null,null,null,null,{"$f":"IF(V3=\"\",0,1)","v":1},"Measure of toxicity",null,null,null,"Black Parinha",null,null,"phase 14",null,null,"3 hours",null,null,"Method 3",null,null,0.04]
[null,null,null,null,null,{"$f":"IF(Y3=\"\",0,1)","v":1},"Toxicity endpoint",null,null,null,"Catfish",null,null,"Phase 2",null,null,"4 hours",null,null,"Method 4",null,null,0.05]
[null,null,null,null,null,{"$f":"IF(H8=\"\",0,1)","v":1},"Toxicity value",">100,000 ug/L",null,null,"Ceratoneis closterium",null,null,"Phase 3",null,null,"5 days",null,null,"Method 5",null,null,0.06]
[null,2,"CHOOSE ANSWER OPTIONS AND FILL IN ANSWERS IN ANSWER COLUMN",null,null,{"$f":"IF(M3=\"\",0,1)","v":1},null,null,null,null,"Cylindrotheca closterium",null,null,"Phase 4",null,null,"5 hours",null,null,"Method 6",null,null,7.0000000000000007E-2]
[null,"*","If had problem click on answer options,click on any  other cells first and then click back again.",null,null,{"$f":"IF(P3=\"\",0,1)","v":1},null,null,null,null,"Eel",null,null,"Phase 5",null,null,"6 hours",null,null,"Method 7",null,null,0.08]
{"$rows_left_out":89}
{"sheet":"Marine Quality","index":7,"n_rows":71,"n_cols":27,"rows_kept":71,"cut":false,"hidden":false,"merged":[]}
[]
["Question No.",1,2,3,4,5,6,7,8,9,10,11,12,13,14,15,16.100000000000001,16.2,16.3,16.399999999999999,16.5,16.600000000000001,17,18,19,"Total Score","Quality Score"]
["Short Questions","duration of the exposure ","biological endpoint","biological effect stated or not","biological effect qualified or not","Appropriate controls","control and contaminant concentration","test acceptability criteria","characteristics of the test organism"," type of test media","type of exposure","contaminant concentrations","parallel reference toxicant toxicity tests","concentration–response relationship"," statistical method or model to determine the toxicity","LC/EC/BEC data values ","pH","POC","Particle size","AVS & 1-M HCl extractable metals","Dissolved contaminants","Dissolved ammonia and sulfide","Temperature","Grade or purity","salinity/conductivity measured and stated"]
["Marks Awarded","10 or 0","10,5 or 0","5 or 0 ","5 or 0 ","5 or 0 ","5 or 0 ","5 or 0 ","5 or 0 ","5 or 0 ","4 or 0","4 or 0","4 or 0","4 or 0","4 or 0","4 or 0","3,1,or 0","3,1,or 0","3,1,or 0","3,1,or 0","3,1,or 0","3,1,or 0","3 or 0","3 or 0","3 or 0"]
["Max. Possible Score",10,10,5,5,5,5,5,5,5,4,4,4,4,4,4,3,3,3,3,3,3,3,3,3,{"$f":"SUM(B5:Y5)","v":106}]
["Category","Marine ","Paper and data unique identifier(eg. 1-1,10-150)","2-2"]
["Scores",10,10,5,5,5,5,2,5,5,4,4,4,4,4,4,3,3,3,3,3,3,3,3,3,103,0.97169811320754718]
["Answers","","","","",null,"","","","","","","","","","","","","","","","","","",""]
["Category","Marine ","Paper and data unique identifier(eg. 1-1,10-150)","890-1"]
["Scores",10,10,5,5,5,5,5,5,5,4,0,4,4,4,4,3,0,3,3,0,0,3,3,3,93,0.95876288659793818]
{"$rows_left_out":62}
{"sheet":"All Result","index":8,"n_rows":297,"n_cols":23,"rows_kept":297,"cut":false,"hidden":false,"merged":[]}
["Chemical","Simazine"]
[{"$f":"'Fresh Data QA'!C2","v":"Category"},{"$f":"'Fresh Data QA'!C3","v":"Paper and data unique identifier(eg. 1-1,10-150)"},{"$f":"'Fresh Data QA'!C90","v":"Total score"},{"$f":"'Fresh Data QA'!C92","v":"Quality Score"},null,{"$f":"'Fresh Data QA'!G3","v":"Species (Scientific name)"},{"$f":"'Fresh Data QA'!G4","v":"Lifestage"},{"$f":"'Fresh Data QA'!G5","v":"Exposure duration"},{"$f":"'Fresh Data QA'!G6","v":"Measure of toxicity"},{"$f":"'Fresh Data QA'!G7","v":"Toxicity endpoint"},{"$f":"'Fresh Data QA'!G8","v":"Toxicity value"},{"$f":"'Fresh Data QA'!C4","v":"Citation"},{"$f":"'Fresh Data QA'!G2","v":"Citation No."},null,"Olivia's check (22/01/18)","MWs formulation check (18/04/18)"]
["Marine ","890-1",93,0.95876288659793818,null,"Sparus aurata L.","3h - 5h post-hatch larvae","72 hours","Mortality","LC10","2.36 mg/L","Arufe,M.I., J. Arellano, M.J. Moreno, and C. Sarasquete, 2004. Comparative Toxic Effects of Formulated Simazine on Vibrio fischeri and Gilthead Seabream (Sparus aurata L.) Larvae, Chemosphere57(11): 1725-1732. ","890",null,"Commercial grade Gesatop containing 90% simazine","Formulation but 90% simazine"]
["Marine ","890-2",93,0.95876288659793818,null,"Sparus aurata L.","3h - 5h post-hatch larvae","72 hours","Mortality","LC50","4.19 mg/L","Arufe,M.I., J. Arellano, M.J. Moreno, and C. Sarasquete, 2004. Comparative Toxic Effects of Formulated Simazine on Vibrio fischeri and Gilthead Seabream (Sparus aurata L.) Larvae, Chemosphere57(11): 1725-1732. ","890",null,"Commercial grade Gesatop containing 90% simazine","Formulation but 90% simazine"]
["Marine ","890-3",93,0.95876288659793818,null,"Sparus aurata L.","3h - 5h post-hatch larvae","72 hours","Mortality","LC90","7.42 mg/L","Arufe,M.I., J. Arellano, M.J. Moreno, and C. Sarasquete, 2004. Comparative Toxic Effects of Formulated Simazine on Vibrio fischeri and Gilthead Seabream (Sparus aurata L.) Larvae, Chemosphere57(11): 1725-1732. ","890",null,"Commercial grade Gesatop containing 90% simazine","Formulation but 90% simazine"]
["Marine ","890-4",93,0.95876288659793818,null,"Sparus aurata L.","3h - 5h post-hatch larvae","72 hours","Mortality","NOEC","2.25 mg/L","Arufe,M.I., J. Arellano, M.J. Moreno, and C. Sarasquete, 2004. Comparative Toxic Effects of Formulated Simazine on Vibrio fischeri and Gilthead Seabream (Sparus aurata L.) Larvae, Chemosphere57(11): 1725-1732. ","890",null,"Commercial grade Gesatop containing 90% simazine","Formulation but 90% simazine"]
["Marine ","890-5",93,0.95876288659793818,null,"Sparus aurata L.","3h - 5h post-hatch larvae","72 hours","Mortality","LOEC","4.50 mg/L","Arufe,M.I., J. Arellano, M.J. Moreno, and C. Sarasquete, 2004. Comparative Toxic Effects of Formulated Simazine on Vibrio fischeri and Gilthead Seabream (Sparus aurata L.) Larvae, Chemosphere57(11): 1725-1732. ","890",null,"Commercial grade Gesatop containing 90% simazine","Formulation but 90% simazine"]
["Marine ","890-6",93,0.95876288659793818,null,"Sparus aurata L.","3h - 5h post-hatch larvae","72 hours","Population: Growth (Dry Weight)","NOEC","4.50 mg/L","Arufe,M.I., J. Arellano, M.J. Moreno, and C. Sarasquete, 2004. Comparative Toxic Effects of Formulated Simazine on Vibrio fischeri and Gilthead Seabream (Sparus aurata L.) Larvae, Chemosphere57(11): 1725-1732. ","890",null,"Commercial grade Gesatop containing 90% simazine","Formulation but 90% simazine"]
["Marine ","890-7",93,0.95876288659793818,null,"Sparus aurata L.","3h - 5h post-hatch larvae","72 hours","Population: Growth (Dry Weight)","NOEC",">4.50 mg/L","Arufe,M.I., J. Arellano, M.J. Moreno, and C. Sarasquete, 2004. Comparative Toxic Effects of Formulated Simazine on Vibrio fischeri and Gilthead Seabream (Sparus aurata L.) Larvae, Chemosphere57(11): 1725-1732. ","890","Do Not Use -  Actual NOEC was obtained from this paper (above)","Commercial grade Gesatop containing 90% simazine","Formulation but 90% simazine"]
["Freshwater","891-1",74,0.71844660194174759,null,"Chlorella pyrenoidosa","Exponential Growth Phase","6 days","Population: Abundance","IC50","6.45 uM","Chan,C.Y., 2005. Detoxification and Degradation of Triazine-Pollutants by an Integrated Photochemical-Biological System, Ph.D.Thesis, The Chinese University of Hong Kong, China:153. ","891",null,"Greater than 98% purity","Greater than 98% purity"]
{"$rows_left_out":287}