{"text_format":"1","workbook":"xlsx","n_sheets":9,"sheets":["Copyright","Cover","All Result","Instruction","Sheet1","FW nonmetal plant","FW nonmetal plant_WS","Reference list","Sheet2"],"not_rendered":{"charts":0,"images":0,"macros":1,"external_links":0,"defined_names":6,"comments":2,"pivot_tables":0},"unopened":[],"bounds":{"document_bytes":16777216,"sheet_cells":100000,"rows_first":2000,"rows_last":500,"rows_between":2000,"halvings":0,"cell_chars":16384,"cell_head_chars":4096},"cells_cut":0,"cells_raw":0,"read":"whole","date_system":"1900"}

{"sheet":"Copyright","index":0,"n_rows":0,"n_cols":0,"rows_kept":0,"cut":false,"hidden":false,"merged":[]}

{"sheet":"Cover","index":1,"n_rows":20,"n_cols":7,"rows_kept":20,"cut":false,"hidden":false,"merged":[[18,6,18,8],[14,6,14,8],[13,6,13,8],[4,4,4,10],[9,6,9,8],[12,6,12,8],[5,5,6,9]]}
[]
[]
[]
[]
[null,null,null,null,"Ecotoxicity Data Quality Assessment Method V2"]
[null,null,null,null,null,"To be used to assess the quality of data used for the Australian and New Zealand Guidelines for Fresh and Marine Water Quality (including sediment) and the Australian National Environment Protection (Assessment of Site Contamination) Measure"]
[]
[]
[]
[null,null,null,null,null,null,"Developed by "]
{"$rows_left_out":11}
{"sheet":"All Result","index":2,"n_rows":120,"n_cols":22,"rows_kept":120,"cut":false,"hidden":false,"merged":[]}
[]
["Nitrate (Freshwater)"]
[{"$f":"'FW nonmetal plant'!C2","v":"Category"},{"$f":"'FW nonmetal plant'!C3","v":"Paper and data unique identifier(eg. 1-1,10-150)"},{"$f":"'FW nonmetal plant'!C70","v":"Total score"},{"$f":"'FW nonmetal plant'!C72","v":"Quality Score"},"Comment ",{"$f":"'FW nonmetal plant'!G3","v":"Species (Scientific name)"},{"$f":"'FW nonmetal plant'!G4","v":"Lifestage"},{"$f":"'FW nonmetal plant'!G5","v":"Exposure duration"},{"$f":"'FW nonmetal plant'!G6","v":"Measure of toxicity"},{"$f":"'FW nonmetal plant'!G7","v":"Toxicity endpoint"},{"$f":"'FW nonmetal plant'!G8","v":"Toxicity value"},{"$f":"'FW nonmetal plant'!J2","v":"Taxonomic group"},{"$f":"'FW nonmetal plant'!J3","v":"Phylum"},"Media",{"$f":"'FW nonmetal plant'!J6","v":"Temperature "},{"$f":"'FW nonmetal plant'!J7","v":"Acute Or Chronic "},{"$f":"'FW nonmetal plant'!J8","v":"PH"},"Hardness, mg/L CaCO3","REFERENCE",{"$f":"'Reference list'!A62N26","v":{"$error":"#NAME?"}}]
["Freshwater/non-metal/non- plant","N06-1",71,0.80681818181818177,"No hardness data","Astacus astacus","Juvenile","7 d","NOAEL","Mortality",">14.0","Invertebrate","Arthropoda","Freshwater",15,"Chronic",8.3000000000000007,"NR","Jensen, F.B. (1996). Uptake, elimination and effects of nitrite and nitrate in freshwater crayfish (Astacus astacus). Aquatic Toxicology 34:  94-104.","N06",null,{"$f":"B4","v":"N06-1"}]
["Freshwater/non-metal/non- plant","N03-1",81,0.92045454545454541,"No hardness data","Bufo americanus","Egg","23 d","NOEC","Hatched",">9.3","Amphibian","Chordata","Freshwater",25,"Chronic",6.5,"NR","Laposata, M.M.; Dunson, W.A. (1998). Effects of boron and nitrate on hatching success of amphibian eggs. Archives of Environmental and Contamination Toxicology 35:  615-619.","N03",null,{"$f":"B5","v":"N03-1"}]
["Freshwater/non-metal/non- plant","N07-1",81,0.92045454545454541,"","Ceriodaphnia dubia","Neonates","7 d","NOEC","Reproduction",7.1,"Invertebrate","Arthropoda","Freshwater",25,"Chronic","7.89-8.25","156-172","Scott, G.; Crunkilton, R.L. (2000). Acute and chronic toxicity of nitrate to fathead minnows (Pimephales promelas), Ceriodaphnia dubia, and Daphnia magna. Environmental Toxicology and Chemistry 19:  2918-2922.","N07",null,"N07-1"]
["Freshwater/non-metal/non- plant","N07-2",81,0.92045454545454541,"","Ceriodaphnia dubia","Neonates","7 d","NOEC","Reproduction",56.5,"Invertebrate","Arthropoda","Freshwater",25,"Chronic","7.89-8.25","156-172","Scott, G.; Crunkilton, R.L. (2000). Acute and chronic toxicity of nitrate to fathead minnows (Pimephales promelas), Ceriodaphnia dubia, and Daphnia magna. Environmental Toxicology and Chemistry 19:  2918-2922.","N07",null,"N07-2"]
["Freshwater/non-metal/non- plant","N07-3",81,0.92045454545454541,"","Ceriodaphnia dubia","Neonates","7 d","NOEC","Reproduction",7.1,"Invertebrate","Arthropoda","Freshwater",25,"Chronic","7.89-8.25","156-172","Scott, G.; Crunkilton, R.L. (2000). Acute and chronic toxicity of nitrate to fathead minnows (Pimephales promelas), Ceriodaphnia dubia, and Daphnia magna. Environmental Toxicology and Chemistry 19:  2918-2922.","N07",null,"N07-3"]
["Freshwater/non-metal/non- plant","N07-4",81,0.92045454545454541,"","Ceriodaphnia dubia","Neonates","7 d","NOEC","Reproduction",17.899999999999999,"Invertebrate","Arthropoda","Freshwater",25,"Chronic","7.89-8.25","156-172","Scott, G.; Crunkilton, R.L. (2000). Acute and chronic toxicity of nitrate to fathead minnows (Pimephales promelas), Ceriodaphnia dubia, and Daphnia magna. Environmental Toxicology and Chemistry 19:  2918-2922.","N07",null,"N07-4"]
["Freshwater/non-metal/non- plant","N07-5",81,0.92045454545454541,"","Ceriodaphnia dubia","Neonates","7 d","NOEC","Reproduction",17.899999999999999,"Invertebrate","Arthropoda","Freshwater",25,"Chronic","7.89-8.25","156-172","Scott, G.; Crunkilton, R.L. (2000). Acute and chronic toxicity of nitrate to fathead minnows (Pimephales promelas), Ceriodaphnia dubia, and Daphnia magna. Environmental Toxicology and Chemistry 19:  2918-2922.","N07",null,"N07-5"]
{"$rows_left_out":111}
{"sheet":"Instruction","index":3,"n_rows":21,"n_cols":10,"rows_kept":21,"cut":false,"hidden":false,"merged":[[27,6,27,16],[14,6,14,7],[5,4,5,7]]}
[]
[]
[null,"Click here to see \"All Result\" -->","All Result"]
[]
[]
[null,null,null,null,"Freshwater ",null,null,null,null,"Freshwater "]
[]
[null,"Tabs contain questionaries -->           ","Freshwater/metal/nonplant",null,"Freshwater/non-metal/non-plant ",null,null,"Freshwater/metal/plant",null,"Freshwater/non-metal/plant"]
[]
[]
{"$rows_left_out":12}
{"sheet":"Sheet1","index":4,"n_rows":70,"n_cols":29,"rows_kept":70,"cut":false,"hidden":true,"merged":[]}
[]
[{"$f":"#REF!","v":{"$error":"#REF!"}},{"$f":"#REF!","v":{"$error":"#REF!"}},{"$f":"#REF!","v":{"$error":"#REF!"}},{"$f":"#REF!","v":{"$error":"#REF!"}},{"$f":"#REF!","v":{"$error":"#REF!"}},{"$f":"#REF!","v":{"$error":"#REF!"}},{"$f":"#REF!","v":{"$error":"#REF!"}},{"$f":"#REF!","v":{"$error":"#REF!"}},{"$f":"#REF!","v":{"$error":"#REF!"}},{"$f":"#REF!","v":{"$error":"#REF!"}},{"$f":"#REF!","v":{"$error":"#REF!"}},{"$f":"#REF!","v":{"$error":"#REF!"}},{"$f":"#REF!","v":{"$error":"#REF!"}},{"$f":"#REF!","v":{"$error":"#REF!"}},{"$f":"#REF!","v":{"$error":"#REF!"}},{"$f":"#REF!","v":{"$error":"#REF!"}},{"$f":"#REF!","v":{"$error":"#REF!"}},{"$f":"#REF!","v":{"$error":"#REF!"}},{"$f":"#REF!","v":{"$error":"#REF!"}},{"$f":"#REF!","v":{"$error":"#REF!"}},{"$f":"#REF!","v":{"$error":"#REF!"}},{"$f":"#REF!","v":{"$error":"#REF!"}},{"$f":"#REF!","v":{"$error":"#REF!"}},{"$f":"#REF!","v":{"$error":"#REF!"}},{"$f":"#REF!","v":{"$error":"#REF!"}},{"$f":"#REF!","v":{"$error":"#REF!"}}]
[{"$f":"#REF!","v":{"$error":"#REF!"}},{"$f":"#REF!","v":{"$error":"#REF!"}},{"$f":"#REF!","v":{"$error":"#REF!"}},{"$f":"#REF!","v":{"$error":"#REF!"}}]
[{"$f":"#REF!","v":{"$error":"#REF!"}},{"$f":"#REF!","v":{"$error":"#REF!"}},{"$f":"#REF!","v":{"$error":"#REF!"}},{"$f":"#REF!","v":{"$error":"#REF!"}},{"$f":"#REF!","v":{"$error":"#REF!"}},{"$f":"#REF!","v":{"$error":"#REF!"}},{"$f":"#REF!","v":{"$error":"#REF!"}},{"$f":"#REF!","v":{"$error":"#REF!"}},{"$f":"#REF!","v":{"$error":"#REF!"}},{"$f":"#REF!","v":{"$error":"#REF!"}},{"$f":"#REF!","v":{"$error":"#REF!"}},{"$f":"#REF!","v":{"$error":"#REF!"}},{"$f":"#REF!","v":{"$error":"#REF!"}},{"$f":"#REF!","v":{"$error":"#REF!"}},{"$f":"#REF!","v":{"$error":"#REF!"}},{"$f":"#REF!","v":{"$error":"#REF!"}},{"$f":"#REF!","v":{"$error":"#REF!"}},{"$f":"#REF!","v":{"$error":"#REF!"}},{"$f":"#REF!","v":{"$error":"#REF!"}},{"$f":"#REF!","v":{"$error":"#REF!"}},{"$f":"#REF!","v":{"$error":"#REF!"}},{"$f":"#REF!","v":{"$error":"#REF!"}},{"$f":"#REF!","v":{"$error":"#REF!"}},{"$f":"#REF!","v":{"$error":"#REF!"}},{"$f":"#REF!","v":{"$error":"#REF!"}},{"$f":"#REF!","v":{"$error":"#REF!"}}]
["Answers",{"$f":"IF(#REF!=0,\"\",#REF!)","v":{"$error":"#REF!"}},{"$f":"IF(#REF!=0,\"\",#REF!)","v":{"$error":"#REF!"}},{"$f":"IF(#REF!=0,\"\",#REF!)","v":{"$error":"#REF!"}},{"$f":"IF(#REF!=0,\"\",#REF!)","v":{"$error":"#REF!"}},{"$f":"IF(#REF!=0,\"\",#REF!)","v":{"$error":"#REF!"}},{"$f":"IF(#REF!=0,\"\",#REF!)","v":{"$error":"#REF!"}},{"$f":"IF(#REF!=0,\"\",#REF!)","v":{"$error":"#REF!"}},{"$f":"IF(#REF!=0,\"\",#REF!)","v":{"$error":"#REF!"}},{"$f":"IF(#REF!=0,\"\",#REF!)","v":{"$error":"#REF!"}},{"$f":"IF(#REF!=0,\"\",#REF!)","v":{"$error":"#REF!"}},{"$f":"IF(#REF!=0,\"\",#REF!)","v":{"$error":"#REF!"}},{"$f":"IF(#REF!=0,\"\",#REF!)","v":{"$error":"#REF!"}},{"$f":"IF(#REF!=0,\"\",#REF!)","v":{"$error":"#REF!"}},{"$f":"IF(#REF!=0,\"\",#REF!)","v":{"$error":"#REF!"}},{"$f":"IF(#REF!=0,\"\",#REF!)","v":{"$error":"#REF!"}},{"$f":"IF(#REF!=0,\"\",#REF!)","v":{"$error":"#REF!"}},{"$f":"IF(#REF!=0,\"\",#REF!)","v":{"$error":"#REF!"}},{"$f":"IF(#REF!=0,\"\",#REF!)","v":{"$error":"#REF!"}},{"$f":"IF(#REF!=0,\"\",#REF!)","v":{"$error":"#REF!"}},{"$f":"IF(#REF!=0,\"\",#REF!)","v":{"$error":"#REF!"}},{"$f":"IF(#REF!=0,\"\",#REF!)","v":{"$error":"#REF!"}},{"$f":"IF(#REF!=0,\"\",#REF!)","v":{"$error":"#REF!"}},{"$f":"IF(#REF!=0,\"\",#REF!)","v":{"$error":"#REF!"}}]
[{"$f":"#REF!","v":{"$error":"#REF!"}},{"$f":"#REF!","v":{"$error":"#REF!"}},{"$f":"#REF!","v":{"$error":"#REF!"}},{"$f":"#REF!","v":{"$error":"#REF!"}},{"$f":"#REF!","v":{"$error":"#REF!"}},{"$f":"#REF!","v":{"$error":"#REF!"}},{"$f":"#REF!","v":{"$error":"#REF!"}},{"$f":"#REF!","v":{"$error":"#REF!"}}]
[{"$f":"#REF!","v":{"$error":"#REF!"}},{"$f":"#REF!","v":{"$error":"#REF!"}},{"$f":"#REF!","v":{"$error":"#REF!"}},{"$f":"#REF!","v":{"$error":"#REF!"}},{"$f":"#REF!","v":{"$error":"#REF!"}},{"$f":"IF(#REF!=0,\"\",#REF!)","v":{"$error":"#REF!"}},{"$f":"IF(#REF!=0,\"\",#REF!)","v":{"$error":"#REF!"}},{"$f":"IF(#REF!=0,\"\",#REF!)","v":{"$error":"#REF!"}}]
[]
[]
[]
{"$rows_left_out":61}
{"sheet":"FW nonmetal plant","index":5,"n_rows":79,"n_cols":53,"rows_kept":79,"cut":false,"hidden":false,"merged":[[60,2,62,2],[60,7,62,7],[63,2,66,2],[63,7,66,7],[52,2,54,2],[52,7,54,7],[56,2,59,2],[56,7,59,7],[43,2,45,2],[43,7,45,7],[46,2,48,2],[46,7,48,7],[49,2,51,2],[49,7,51,7],[37,2,39,2],[37,7,39,7],[40,2,42,2],[25,2,27,2],[25,7,27,7],[28,2,30,2],[28,7,30,7],[31,2,33,2],[31,7,33,7],[20,2,21,2],[20,7,21,7],[22,2,24,2],[22,7,24,7],[34,2,36,2],[9,2,9,4],[11,2,13,2],[11,7,13,7],[14,2,16,2],[17,2,19,2],[17,7,19,7]]}
[null,1,"Fill in the blank cells below, based on information provided in the paper being assessed. You can either pick an option from the dropdown list or add the appropriate detail using the 'Add to list' button. ",null,null,null,null,null,null,null,null,null,null,null,"* All the text in RED are used for drop down list ,make changes with caution."]
[null,null,"Category",{"$f":"IF(AF3=\"\",0,1)","v":1},"Freshwater/non-metal/plant",{"$f":"IF(E3=\"\",0,1)","v":1},"Citation No.",{"$f":"IF(ISERROR(FIND(\"-\",E3)),E3,LEFT(E3,FIND(\"-\",E3)-1))","v":"N"},null,"Taxonomic group",null,null,null,null,"Species",null,null,"Lifestage",null,null,"Exposure duration",null,null,"Measure of toxicity",null,null,"Toxicity endpoint",null,null,"Taxonomic group",null,null,"Phylum",null,null,"Class",null,null,"Media",null,null,"Temperature ",null,null,"Acute Or Chronic",null,null,"PH",null,null,"Salinity/Conductivity"]
[null,null,"Paper and data unique identifier(eg. 1-1,10-150)",{"$f":"IF(AI3=\"\",0,1)","v":1},"N-25-1",{"$f":"IF(E4=\"\",0,1)","v":1},"Species (Scientific name)",null,null,"Phylum",null,null,null,null,"Aedes albopictus",42,{"$f":"IF(P3=0,\"\",INDEX(O3:O100,P3))","v":"Hyalella azteca"},"1 month",19,{"$f":"IF(S3=0,\"\",INDEX(R3:R100,S3))","v":"Juveniles"},"10d",35,{"$f":"IF(V3=0,\"\",INDEX(U3:U100,V3))","v":"42 d"},"EC50",12,{"$f":"IF(Y3=0,\"\",INDEX(X3:X100,Y3))","v":"EC20"},"Development",16,{"$f":"IF(AB3=0,\"\",INDEX(AA3:AA100,AB3))","v":"Mortality, growth, reproduction"},"Alga",15,{"$f":"IF(AE3=0,\"\",INDEX(AD3:AD100,AE3))","v":"Invertebrate"}," Chordata",15,{"$f":"IF(AH3=0,\"\",INDEX(AG3:AG100,AH3))","v":"Arthropoda"}," Branchiopoda",22,{"$f":"IF(AK3=0,\"\",INDEX(AJ3:AJ102,AK3))","v":"Malacostraca"},"Freshwater",1,{"$f":"IF(AN3=0,\"\",INDEX(AM3:AM100,AN3))","v":"Freshwater"},7.5,24,{"$f":"IF(AQ3=0,\"\",INDEX(AP3:AP100,AQ3))","v":"22.9 C"},10,3,{"$f":"IF(AT3=0,\"\",INDEX(AS3:AS100,AT3))","v":"Chronic"},6.2,33,{"$f":"IF(AW3=0,\"\",INDEX(AV3:AV100,AW3))","v":8},"30 ppt",null,"N.A."]
[null,null,"Citation",{"$f":"IF(AL3=\"\",0,1)","v":1},"Wang N, Dorman RA, Ivey CD, Soucek DJ, Dickinson A, Kunz BK, Steevens JA, Hammer EJ and Bauer CR. (2020). Acute and chronic toxicity of sodium nitrate and sodium sulfate to several freshwater organisms in water-only exposures. Environmental Toxicology and Chemistry, 39, 1071-1085.",{"$f":"IF(AX3=\"\",0,1)","v":1},"Lifestage",null,null,"Class",null,null,null,null,"Astacus astacus",null,null,"1 year old",null,null,"11 hours",null,null,"LC50",null,null,"Growth ",null,null,"Amphibian",null,null," Mollusca",null,null," Gastropoda",null,null,"Marinewater",null,null,10,null,null,"Acute ",null,null,6.5,null,null,"150 uS/cm"]
[null,null,null,{"$f":"IF(AO3=\"\",0,1)","v":1},null,{"$f":"IF(H8=\"\",0,1)","v":1},"Exposure duration",null,null,"Media",null,null,null,null,"Australian Bass",null,null,"Egg",null,null,"11d ",null,null,"LC50 and EC50",null,null,"Growth and mortality",null,null,"Fish",null,null,"Arthropoda",null,null," Insecta",null,null,"N.A.",null,null,13,null,null,"Chronic",null,null,6.8,null,null,"N.A."]
[null,null,null,{"$f":"IF(AR3=\"\",0,1)","v":1},null,{"$f":"IF(Q3=\"\",0,1)","v":1},"Measure of toxicity",null,null,"Temperature ",null,null,null,null,"Bufo americanus",null,null,"Embryo",null,null,"126 d",null,null,"N.A.",null,null,"hatched",null,null,"Invertebrate",null,null,"Arthropoda",null,null," Malacostraca",null,null,null,null,null,14,null,null,"Chronic",null,null,7.6]
[null,null,null,{"$f":"IF(AU3=\"\",0,1)","v":1},null,{"$f":"IF(T3=\"\",0,1)","v":1},"Toxicity endpoint",null,null,"Acute Or Chronic ",null,null,null,null,"Ceriodaphnia dubia",null,null,"Embryo-Alevin-Fry",null,null,"13 days ",null,null,"NOAEL",null,null,"Mortality",null,null,"Microalga",null,null,"Chlorophyta",null,null," Malacostraca",null,null,null,null,null,22,null,null,"N.A.",null,null,8.25]
[null,null,null,null,null,{"$f":"IF(W3=\"\",0,1)","v":1},"Toxicity value",56.7,null,"PH",null,null,null,null,"Chironomus dilutus",null,null,"Embryo-larvae",null,null,"14 d",null,null,"NOEC",null,null,"N.A.",null,null,"N.A.",null,null,"Chlorophyta",null,null,"Actinopterygii",null,null,null,null,null,23,null,null,null,null,null,8.3000000000000007]
[null,2,"Select the appropriate answer option to each question. Comments can be added to the cells in column H.",null,null,{"$f":"IF(Z3=\"\",0,1)","v":1},null,null,null,"Salinity/Conductivity","N.A.",null,null,null,"Chironomus dilutus",null,null,"exponential",null,null,"146 d",null,null,"LC10",null,null,"Reproduction",null,null,"Mollusc",null,null,"Chordata",null,null,"Amphibia",null,null,null,null,null,23.1,null,null,null,null,null,"6.4-7.3"]
[null,"*","If the selected answer option does not work try clicking on any other cell first and then click back on the answer option again.",null,null,{"$f":"IF(AC3=\"\",0,1)","v":1},null,null,null,null,null,null,null,null,"Coregonus clupeaformis",null,null,"Fry",null,null,"16 d",null,null,"EC10",null,null,"Survival and reproduction",null,null,"Arthropoda",null,null,"N.A.",null,null,"Branchiopoda",null,null,null,null,null,23.4,null,null,null,null,null,"6-7.4"]
{"$rows_left_out":70}
{"sheet":"FW nonmetal plant_WS","index":6,"n_rows":200,"n_cols":22,"rows_kept":200,"cut":false,"hidden":false,"merged":[]}
[null,null,null,null,null,null,null,null,null,null,null,null,null,null,null,null,null,null,"MAX",88]
["Question No.",1,2,3,4,5,6,7,8,9,10,11,12,13,14,15,16.100000000000001,17,18,"Total Score","Quality Score","Comment "]
["Short Questions","Duration of the exposure ","Biological endpoint","Biological effect stated or not","Biological effect quantified or not","Appropriate controls","Control & contaminant concentration","Test acceptability criteria","Characteristics of the test organism"," Type of test media","Type of exposure","Contaminant concentrations","Parallel reference toxicant toxicity tests","Concentration–response relationship","Determine the toxicity","NOEC/LOEC or LC/EC/BEC","pH","Temperature","Grade or purity"]
["Category","Freshwater/non-metal/plant","Paper and data unique identifier(eg. 1-1,10-150)","N01-1"]
["Scores",10,10,5,5,5,5,2,5,5,4,4,4,4,4,4,3,1,3,{"$f":"SUM(B5:S5)","v":83},{"$f":"T5/MAX","v":0.94318181818181823}]
["Answers","146 days","growth","NOEC and LC50, cannot find LCx or Ecx..","","(also hardness control)","","\" No specific acceptability criteria for the two test species were used in the present study. However, Environment Canada [8] defines an acceptable rainbow trout embryo  evelopment\ntest as one in which the control has 60% or more survivors at the time when 50% of the embryos reach the swim-up stage.\" ","","","STATIC","","","","","","PH was a range of 6-7.4 also the DO was stated.","not sure about this one because it says room temperature was measured. ",""]
["Category","Freshwater/non-metal/plant","Paper and data unique identifier(eg. 1-1,10-150)","N01-2"]
["Scores",10,10,5,5,5,5,2,5,5,4,4,4,4,4,4,3,1,3,{"$f":"SUM(B8:S8)","v":83},{"$f":"T8/MAX","v":0.94318181818181823},""]
["Answers","126 Days","","","","","4 replicates per treatment 10 larve per replicate","Not too sure about this.. It says: No specific acceptability criteria for the two test species\nwere used in the present study.","","","static","","","","","","","Room temperature was measured daily",""]
["Category","Freshwater/non-metal/plant","Paper and data unique identifier(eg. 1-1,10-150)","N02-1"]
{"$rows_left_out":191}
{"sheet":"Reference list","index":7,"n_rows":63,"n_cols":3,"rows_kept":63,"cut":false,"hidden":false,"merged":[]}
["Code","Reference","Full reference"]
["N01-1","McGurk et al (2006)","McGurk, M.D.; Landry, F.; Tang, A.; Hanks, C.C. (2006). Acute and chronic toxicity of nitrate to early life stages of lake trout (Salvelinus namaycush) and lake whitefish (Coregonus clupeaformis). Environmental Toxicology and Chemistry 25:  2187-2196."]
["N01-2","McGurk et al (2006)","McGurk, M.D.; Landry, F.; Tang, A.; Hanks, C.C. (2006). Acute and chronic toxicity of nitrate to early life stages of lake trout (Salvelinus namaycush) and lake whitefish (Coregonus clupeaformis). Environmental Toxicology and Chemistry 25:  2187-2196."]
["N02-1","Kinchloe et al (1979)","Kincheloe, J.W.; Wedemeyer, G.A.; Koch, D.L. (1979). Tolerance of developing salmonid eggs and fry to nitrate exposure. Bulletin of Environmental Contamination and Toxicology 23:  575-578."]
["N02-2","Kinchloe et al (1979)","Kincheloe, J.W.; Wedemeyer, G.A.; Koch, D.L. (1979). Tolerance of developing salmonid eggs and fry to nitrate exposure. Bulletin of Environmental Contamination and Toxicology 23:  575-578."]
["N02-3","Kinchloe et al (1979)","Kincheloe, J.W.; Wedemeyer, G.A.; Koch, D.L. (1979). Tolerance of developing salmonid eggs and fry to nitrate exposure. Bulletin of Environmental Contamination and Toxicology 23:  575-578."]
["N02-4","Kinchloe et al (1979) ","Kincheloe, J.W.; Wedemeyer, G.A.; Koch, D.L. (1979). Tolerance of developing salmonid eggs and fry to nitrate exposure. Bulletin of Environmental Contamination and Toxicology 23:  575-578."]
["N02-5","Kinchloe et al (1979) ","Kincheloe, J.W.; Wedemeyer, G.A.; Koch, D.L. (1979). Tolerance of developing salmonid eggs and fry to nitrate exposure. Bulletin of Environmental Contamination and Toxicology 23:  575-578."]
["N03-1","Laposata & Dunson (1998)","Laposata, M.M.; Dunson, W.A. (1998). Effects of boron and nitrate on hatching success of amphibian eggs. Archives of Environmental and Contamination Toxicology 35:  615-619."]
["N04-1","Hickey et al (2013)","Hickey, C.W.; Thompson, K.J.; Albert, A.; Martin, M.L. (2013). Chronic sensitivity of juvenile inanga (Galaxias maculatus) and early life-stage rainbow trout (Oncorhynchus mykiss) to nitrate. No. HBR13207; HAM2013-012. NIWA report for Hawke's Bay Regional Council"]
{"$rows_left_out":54}
{"sheet":"Sheet2","index":8,"n_rows":0,"n_cols":0,"rows_kept":0,"cut":false,"hidden":false,"merged":[]}