{"text_format":"1","workbook":"xlsx","n_sheets":9,"sheets":["Copyright","Cover","Instruction","Sheet1","All Result","FW metal nonplant","FW metal nonplant_WS","FW metal plant","FW metal plant_WS"],"not_rendered":{"charts":0,"images":0,"macros":1,"external_links":1,"defined_names":3,"comments":3,"pivot_tables":0},"unopened":[],"bounds":{"document_bytes":16777216,"sheet_cells":100000,"rows_first":2000,"rows_last":500,"rows_between":2000,"halvings":0,"cell_chars":16384,"cell_head_chars":4096},"cells_cut":0,"cells_raw":0,"read":"whole","date_system":"1900"}

{"sheet":"Copyright","index":0,"n_rows":0,"n_cols":0,"rows_kept":0,"cut":false,"hidden":false,"merged":[]}

{"sheet":"Cover","index":1,"n_rows":20,"n_cols":7,"rows_kept":20,"cut":false,"hidden":false,"merged":[[18,6,18,8],[14,6,14,8],[13,6,13,8],[4,4,4,10],[9,6,9,8],[12,6,12,8],[5,5,6,9]]}
[]
[]
[]
[]
[null,null,null,null,"Ecotoxicity Data Quality Assessment Method V2"]
[null,null,null,null,null,"To be used to assess the quality of data used for the Australian and New Zealand Guidelines for Fresh and Marine Water Quality (including sediment) and the Australian National Environment Protection (Assessment of Site Contamination) Measure"]
[]
[]
[]
[null,null,null,null,null,null,"Developed by "]
[]
[]
[null,null,null,null,null,null,"Zoe Zhang"]
[null,null,null,null,null,null,"   Dr. Michael Warne"]
[null,null,null,null,null,null,"Alison Vieritz "]
[]
[]
[]
[null,null,null,null,null,null,"Water Quality & Investigations "]
[null,null,null,null,null,"                 Department of Science,Information Technology and Innovation"]

{"sheet":"Instruction","index":2,"n_rows":21,"n_cols":10,"rows_kept":21,"cut":false,"hidden":false,"merged":[[27,6,27,16],[14,6,14,7],[5,4,5,7]]}
[]
[]
[null,"Click here to see \"All Result\" -->","All Result"]
[]
[]
[null,null,null,null,"Freshwater "]
[]
[null,"Tabs contain questionaries -->           ","Freshwater/metal/nonplant",null,"Freshwater/non-metal/non-plant ",null,null,"Freshwater/metal/plant",null,"Freshwater/non-metal/plant"]
[]
[]
[]
[null,"Tabs contain score of paper and short answers to questions -->","Freshwater/metal/nonplant Worksheet",null,"Freshwater/non-metal/non-plant Worksheet",null,null,"Freshwater/metal/plant Worksheet",null,"Freshwater/non-metal/plant/ Worksheet"]
[]
[]
[null,null,"Marine ",null,null,null,"Terrestrial",null,null,"Sediment "]
[]
[null,"Tab contain questionaries -->","Marine or estuarine/non-plant",null,"Marine or estuarine/Plant",null,null,"Terrestrial Data QA",null,"Sediment Data QA"]
[]
[]
[]
[null,"Tab Contains all scores of paper --> ","Marine or estuarine/non-Plant Worksheet",null,"Marine or estuarine/Plant_Worksheet",null,null,"Terrestrial Quality",null,"Sediment Quality"]

{"sheet":"Sheet1","index":3,"n_rows":70,"n_cols":29,"rows_kept":70,"cut":false,"hidden":true,"merged":[]}
[]
[{"$f":"#REF!","v":{"$error":"#REF!"}},{"$f":"#REF!","v":{"$error":"#REF!"}},{"$f":"#REF!","v":{"$error":"#REF!"}},{"$f":"#REF!","v":{"$error":"#REF!"}},{"$f":"#REF!","v":{"$error":"#REF!"}},{"$f":"#REF!","v":{"$error":"#REF!"}},{"$f":"#REF!","v":{"$error":"#REF!"}},{"$f":"#REF!","v":{"$error":"#REF!"}},{"$f":"#REF!","v":{"$error":"#REF!"}},{"$f":"#REF!","v":{"$error":"#REF!"}},{"$f":"#REF!","v":{"$error":"#REF!"}},{"$f":"#REF!","v":{"$error":"#REF!"}},{"$f":"#REF!","v":{"$error":"#REF!"}},{"$f":"#REF!","v":{"$error":"#REF!"}},{"$f":"#REF!","v":{"$error":"#REF!"}},{"$f":"#REF!","v":{"$error":"#REF!"}},{"$f":"#REF!","v":{"$error":"#REF!"}},{"$f":"#REF!","v":{"$error":"#REF!"}},{"$f":"#REF!","v":{"$error":"#REF!"}},{"$f":"#REF!","v":{"$error":"#REF!"}},{"$f":"#REF!","v":{"$error":"#REF!"}},{"$f":"#REF!","v":{"$error":"#REF!"}},{"$f":"#REF!","v":{"$error":"#REF!"}},{"$f":"#REF!","v":{"$error":"#REF!"}},{"$f":"#REF!","v":{"$error":"#REF!"}},{"$f":"#REF!","v":{"$error":"#REF!"}}]
[{"$f":"#REF!","v":{"$error":"#REF!"}},{"$f":"#REF!","v":{"$error":"#REF!"}},{"$f":"#REF!","v":{"$error":"#REF!"}},{"$f":"#REF!","v":{"$error":"#REF!"}}]
[{"$f":"#REF!","v":{"$error":"#REF!"}},{"$f":"#REF!","v":{"$error":"#REF!"}},{"$f":"#REF!","v":{"$error":"#REF!"}},{"$f":"#REF!","v":{"$error":"#REF!"}},{"$f":"#REF!","v":{"$error":"#REF!"}},{"$f":"#REF!","v":{"$error":"#REF!"}},{"$f":"#REF!","v":{"$error":"#REF!"}},{"$f":"#REF!","v":{"$error":"#REF!"}},{"$f":"#REF!","v":{"$error":"#REF!"}},{"$f":"#REF!","v":{"$error":"#REF!"}},{"$f":"#REF!","v":{"$error":"#REF!"}},{"$f":"#REF!","v":{"$error":"#REF!"}},{"$f":"#REF!","v":{"$error":"#REF!"}},{"$f":"#REF!","v":{"$error":"#REF!"}},{"$f":"#REF!","v":{"$error":"#REF!"}},{"$f":"#REF!","v":{"$error":"#REF!"}},{"$f":"#REF!","v":{"$error":"#REF!"}},{"$f":"#REF!","v":{"$error":"#REF!"}},{"$f":"#REF!","v":{"$error":"#REF!"}},{"$f":"#REF!","v":{"$error":"#REF!"}},{"$f":"#REF!","v":{"$error":"#REF!"}},{"$f":"#REF!","v":{"$error":"#REF!"}},{"$f":"#REF!","v":{"$error":"#REF!"}},{"$f":"#REF!","v":{"$error":"#REF!"}},{"$f":"#REF!","v":{"$error":"#REF!"}},{"$f":"#REF!","v":{"$error":"#REF!"}}]
["Answers",{"$f":"IF(#REF!=0,\"\",#REF!)","v":{"$error":"#REF!"}},{"$f":"IF(#REF!=0,\"\",#REF!)","v":{"$error":"#REF!"}},{"$f":"IF(#REF!=0,\"\",#REF!)","v":{"$error":"#REF!"}},{"$f":"IF(#REF!=0,\"\",#REF!)","v":{"$error":"#REF!"}},{"$f":"IF(#REF!=0,\"\",#REF!)","v":{"$error":"#REF!"}},{"$f":"IF(#REF!=0,\"\",#REF!)","v":{"$error":"#REF!"}},{"$f":"IF(#REF!=0,\"\",#REF!)","v":{"$error":"#REF!"}},{"$f":"IF(#REF!=0,\"\",#REF!)","v":{"$error":"#REF!"}},{"$f":"IF(#REF!=0,\"\",#REF!)","v":{"$error":"#REF!"}},{"$f":"IF(#REF!=0,\"\",#REF!)","v":{"$error":"#REF!"}},{"$f":"IF(#REF!=0,\"\",#REF!)","v":{"$error":"#REF!"}},{"$f":"IF(#REF!=0,\"\",#REF!)","v":{"$error":"#REF!"}},{"$f":"IF(#REF!=0,\"\",#REF!)","v":{"$error":"#REF!"}},{"$f":"IF(#REF!=0,\"\",#REF!)","v":{"$error":"#REF!"}},{"$f":"IF(#REF!=0,\"\",#REF!)","v":{"$error":"#REF!"}},{"$f":"IF(#REF!=0,\"\",#REF!)","v":{"$error":"#REF!"}},{"$f":"IF(#REF!=0,\"\",#REF!)","v":{"$error":"#REF!"}},{"$f":"IF(#REF!=0,\"\",#REF!)","v":{"$error":"#REF!"}},{"$f":"IF(#REF!=0,\"\",#REF!)","v":{"$error":"#REF!"}},{"$f":"IF(#REF!=0,\"\",#REF!)","v":{"$error":"#REF!"}},{"$f":"IF(#REF!=0,\"\",#REF!)","v":{"$error":"#REF!"}},{"$f":"IF(#REF!=0,\"\",#REF!)","v":{"$error":"#REF!"}},{"$f":"IF(#REF!=0,\"\",#REF!)","v":{"$error":"#REF!"}}]
[{"$f":"#REF!","v":{"$error":"#REF!"}},{"$f":"#REF!","v":{"$error":"#REF!"}},{"$f":"#REF!","v":{"$error":"#REF!"}},{"$f":"#REF!","v":{"$error":"#REF!"}},{"$f":"#REF!","v":{"$error":"#REF!"}},{"$f":"#REF!","v":{"$error":"#REF!"}},{"$f":"#REF!","v":{"$error":"#REF!"}},{"$f":"#REF!","v":{"$error":"#REF!"}}]
[{"$f":"#REF!","v":{"$error":"#REF!"}},{"$f":"#REF!","v":{"$error":"#REF!"}},{"$f":"#REF!","v":{"$error":"#REF!"}},{"$f":"#REF!","v":{"$error":"#REF!"}},{"$f":"#REF!","v":{"$error":"#REF!"}},{"$f":"IF(#REF!=0,\"\",#REF!)","v":{"$error":"#REF!"}},{"$f":"IF(#REF!=0,\"\",#REF!)","v":{"$error":"#REF!"}},{"$f":"IF(#REF!=0,\"\",#REF!)","v":{"$error":"#REF!"}}]
[]
[]
[]
[{"$f":"#REF!","v":{"$error":"#REF!"}},{"$f":"#REF!","v":{"$error":"#REF!"}},{"$f":"#REF!","v":{"$error":"#REF!"}},{"$f":"#REF!","v":{"$error":"#REF!"}},{"$f":"#REF!","v":{"$error":"#REF!"}},{"$f":"#REF!","v":{"$error":"#REF!"}},{"$f":"#REF!","v":{"$error":"#REF!"}},{"$f":"#REF!","v":{"$error":"#REF!"}},{"$f":"#REF!","v":{"$error":"#REF!"}},{"$f":"#REF!","v":{"$error":"#REF!"}},{"$f":"#REF!","v":{"$error":"#REF!"}},{"$f":"#REF!","v":{"$error":"#REF!"}},{"$f":"#REF!","v":{"$error":"#REF!"}},{"$f":"#REF!","v":{"$error":"#REF!"}},{"$f":"#REF!","v":{"$error":"#REF!"}},{"$f":"#REF!","v":{"$error":"#REF!"}},{"$f":"#REF!","v":{"$error":"#REF!"}},{"$f":"#REF!","v":{"$error":"#REF!"}},{"$f":"#REF!","v":{"$error":"#REF!"}},{"$f":"#REF!","v":{"$error":"#REF!"}},{"$f":"#REF!","v":{"$error":"#REF!"}},{"$f":"#REF!","v":{"$error":"#REF!"}},{"$f":"#REF!","v":{"$error":"#REF!"}},{"$f":"#REF!","v":{"$error":"#REF!"}},{"$f":"#REF!","v":{"$error":"#REF!"}},{"$f":"#REF!","v":{"$error":"#REF!"}},{"$f":"#REF!","v":{"$error":"#REF!"}}]
[{"$f":"#REF!","v":{"$error":"#REF!"}},{"$f":"#REF!","v":{"$error":"#REF!"}},{"$f":"#REF!","v":{"$error":"#REF!"}},{"$f":"#REF!","v":{"$error":"#REF!"}}]
[{"$f":"#REF!","v":{"$error":"#REF!"}},{"$f":"#REF!","v":{"$error":"#REF!"}},{"$f":"#REF!","v":{"$error":"#REF!"}},{"$f":"#REF!","v":{"$error":"#REF!"}},{"$f":"#REF!","v":{"$error":"#REF!"}},{"$f":"#REF!","v":{"$error":"#REF!"}},{"$f":"#REF!","v":{"$error":"#REF!"}},{"$f":"#REF!","v":{"$error":"#REF!"}},{"$f":"#REF!","v":{"$error":"#REF!"}},{"$f":"#REF!","v":{"$error":"#REF!"}},{"$f":"#REF!","v":{"$error":"#REF!"}},{"$f":"#REF!","v":{"$error":"#REF!"}},{"$f":"#REF!","v":{"$error":"#REF!"}},{"$f":"#REF!","v":{"$error":"#REF!"}},{"$f":"#REF!","v":{"$error":"#REF!"}},{"$f":"#REF!","v":{"$error":"#REF!"}},{"$f":"#REF!","v":{"$error":"#REF!"}},{"$f":"#REF!","v":{"$error":"#REF!"}},{"$f":"#REF!","v":{"$error":"#REF!"}},{"$f":"#REF!","v":{"$error":"#REF!"}},{"$f":"#REF!","v":{"$error":"#REF!"}},{"$f":"#REF!","v":{"$error":"#REF!"}},{"$f":"#REF!","v":{"$error":"#REF!"}},{"$f":"#REF!","v":{"$error":"#REF!"}},{"$f":"#REF!","v":{"$error":"#REF!"}},{"$f":"#REF!","v":{"$error":"#REF!"}},{"$f":"#REF!","v":{"$error":"#REF!"}}]
[{"$f":"#REF!","v":{"$error":"#REF!"}},{"$f":"IF(#REF!=0,\"\",#REF!)","v":{"$error":"#REF!"}},{"$f":"IF(#REF!=0,\"\",#REF!)","v":{"$error":"#REF!"}},{"$f":"IF(#REF!=0,\"\",#REF!)","v":{"$error":"#REF!"}},{"$f":"IF(#REF!=0,\"\",#REF!)","v":{"$error":"#REF!"}},null,{"$f":"IF(#REF!=0,\"\",#REF!)","v":{"$error":"#REF!"}},{"$f":"IF(#REF!=0,\"\",#REF!)","v":{"$error":"#REF!"}},{"$f":"IF(#REF!=0,\"\",#REF!)","v":{"$error":"#REF!"}},{"$f":"IF(#REF!=0,\"\",#REF!)","v":{"$error":"#REF!"}},{"$f":"IF(#REF!=0,\"\",#REF!)","v":{"$error":"#REF!"}},{"$f":"IF(#REF!=0,\"\",#REF!)","v":{"$error":"#REF!"}},{"$f":"IF(#REF!=0,\"\",#REF!)","v":{"$error":"#REF!"}},{"$f":"IF(#REF!=0,\"\",#REF!)","v":{"$error":"#REF!"}},{"$f":"IF(#REF!=0,\"\",#REF!)","v":{"$error":"#REF!"}},{"$f":"IF(#REF!=0,\"\",#REF!)","v":{"$error":"#REF!"}},{"$f":"IF(#REF!=0,\"\",#REF!)","v":{"$error":"#REF!"}},{"$f":"IF(#REF!=0,\"\",#REF!)","v":{"$error":"#REF!"}},{"$f":"IF(#REF!=0,\"\",#REF!)","v":{"$error":"#REF!"}},{"$f":"IF(#REF!=0,\"\",#REF!)","v":{"$error":"#REF!"}},{"$f":"IF(#REF!=0,\"\",#REF!)","v":{"$error":"#REF!"}},{"$f":"IF(#REF!=0,\"\",#REF!)","v":{"$error":"#REF!"}},{"$f":"IF(#REF!=0,\"\",#REF!)","v":{"$error":"#REF!"}},{"$f":"IF(#REF!=0,\"\",#REF!)","v":{"$error":"#REF!"}},{"$f":"IF(#REF!=0,\"\",#REF!)","v":{"$error":"#REF!"}}]
[{"$f":"#REF!","v":{"$error":"#REF!"}},{"$f":"#REF!","v":{"$error":"#REF!"}},{"$f":"#REF!","v":{"$error":"#REF!"}},{"$f":"#REF!","v":{"$error":"#REF!"}},{"$f":"#REF!","v":{"$error":"#REF!"}},{"$f":"#REF!","v":{"$error":"#REF!"}},{"$f":"#REF!","v":{"$error":"#REF!"}},{"$f":"#REF!","v":{"$error":"#REF!"}}]
[{"$f":"#REF!","v":{"$error":"#REF!"}},{"$f":"#REF!","v":{"$error":"#REF!"}},{"$f":"#REF!","v":{"$error":"#REF!"}},{"$f":"#REF!","v":{"$error":"#REF!"}},{"$f":"#REF!","v":{"$error":"#REF!"}},{"$f":"IF(#REF!=0,\"\",#REF!)","v":{"$error":"#REF!"}},{"$f":"IF(#REF!=0,\"\",#REF!)","v":{"$error":"#REF!"}},{"$f":"IF(#REF!=0,\"\",#REF!)","v":{"$error":"#REF!"}}]
[]
[]
[]
[{"$f":"#REF!","v":{"$error":"#REF!"}},{"$f":"#REF!","v":{"$error":"#REF!"}},{"$f":"#REF!","v":{"$error":"#REF!"}},{"$f":"#REF!","v":{"$error":"#REF!"}},{"$f":"#REF!","v":{"$error":"#REF!"}},{"$f":"#REF!","v":{"$error":"#REF!"}},{"$f":"#REF!","v":{"$error":"#REF!"}},{"$f":"#REF!","v":{"$error":"#REF!"}},{"$f":"#REF!","v":{"$error":"#REF!"}},{"$f":"#REF!","v":{"$error":"#REF!"}},{"$f":"#REF!","v":{"$error":"#REF!"}},{"$f":"#REF!","v":{"$error":"#REF!"}},{"$f":"#REF!","v":{"$error":"#REF!"}},{"$f":"#REF!","v":{"$error":"#REF!"}},{"$f":"#REF!","v":{"$error":"#REF!"}},{"$f":"#REF!","v":{"$error":"#REF!"}},{"$f":"#REF!","v":{"$error":"#REF!"}},{"$f":"#REF!","v":{"$error":"#REF!"}},{"$f":"#REF!","v":{"$error":"#REF!"}},{"$f":"#REF!","v":{"$error":"#REF!"}},{"$f":"#REF!","v":{"$error":"#REF!"}},{"$f":"#REF!","v":{"$error":"#REF!"}},{"$f":"#REF!","v":{"$error":"#REF!"}},{"$f":"#REF!","v":{"$error":"#REF!"}},{"$f":"#REF!","v":{"$error":"#REF!"}},{"$f":"#REF!","v":{"$error":"#REF!"}}]
[{"$f":"#REF!","v":{"$error":"#REF!"}},{"$f":"#REF!","v":{"$error":"#REF!"}},{"$f":"#REF!","v":{"$error":"#REF!"}},{"$f":"#REF!","v":{"$error":"#REF!"}}]
[{"$f":"#REF!","v":{"$error":"#REF!"}},{"$f":"#REF!","v":{"$error":"#REF!"}},{"$f":"#REF!","v":{"$error":"#REF!"}},{"$f":"#REF!","v":{"$error":"#REF!"}},{"$f":"#REF!","v":{"$error":"#REF!"}},{"$f":"#REF!","v":{"$error":"#REF!"}},{"$f":"#REF!","v":{"$error":"#REF!"}},{"$f":"#REF!","v":{"$error":"#REF!"}},{"$f":"#REF!","v":{"$error":"#REF!"}},{"$f":"#REF!","v":{"$error":"#REF!"}},{"$f":"#REF!","v":{"$error":"#REF!"}},{"$f":"#REF!","v":{"$error":"#REF!"}},{"$f":"#REF!","v":{"$error":"#REF!"}},{"$f":"#REF!","v":{"$error":"#REF!"}},{"$f":"#REF!","v":{"$error":"#REF!"}},{"$f":"#REF!","v":{"$error":"#REF!"}},{"$f":"#REF!","v":{"$error":"#REF!"}},{"$f":"#REF!","v":{"$error":"#REF!"}},{"$f":"#REF!","v":{"$error":"#REF!"}},{"$f":"#REF!","v":{"$error":"#REF!"}},{"$f":"#REF!","v":{"$error":"#REF!"}},{"$f":"#REF!","v":{"$error":"#REF!"}},{"$f":"#REF!","v":{"$error":"#REF!"}},{"$f":"#REF!","v":{"$error":"#REF!"}},{"$f":"#REF!","v":{"$error":"#REF!"}},{"$f":"#REF!","v":{"$error":"#REF!"}}]
[{"$f":"#REF!","v":{"$error":"#REF!"}},{"$f":"IF(#REF!=0,\"\",#REF!)","v":{"$error":"#REF!"}},{"$f":"IF(#REF!=0,\"\",#REF!)","v":{"$error":"#REF!"}},{"$f":"IF(#REF!=0,\"\",#REF!)","v":{"$error":"#REF!"}},{"$f":"IF(#REF!=0,\"\",#REF!)","v":{"$error":"#REF!"}},{"$f":"IF(#REF!=0,\"\",#REF!)","v":{"$error":"#REF!"}},{"$f":"IF(#REF!=0,\"\",#REF!)","v":{"$error":"#REF!"}},{"$f":"IF(#REF!=0,\"\",#REF!)","v":{"$error":"#REF!"}},{"$f":"IF(#REF!=0,\"\",#REF!)","v":{"$error":"#REF!"}},{"$f":"IF(#REF!=0,\"\",#REF!)","v":{"$error":"#REF!"}},{"$f":"IF(#REF!=0,\"\",#REF!)","v":{"$error":"#REF!"}},{"$f":"IF(#REF!=0,\"\",#REF!)","v":{"$error":"#REF!"}},{"$f":"IF(#REF!=0,\"\",#REF!)","v":{"$error":"#REF!"}},{"$f":"IF(#REF!=0,\"\",#REF!)","v":{"$error":"#REF!"}},{"$f":"IF(#REF!=0,\"\",#REF!)","v":{"$error":"#REF!"}},{"$f":"IF(#REF!=0,\"\",#REF!)","v":{"$error":"#REF!"}},{"$f":"IF(#REF!=0,\"\",#REF!)","v":{"$error":"#REF!"}},{"$f":"IF(#REF!=0,\"\",#REF!)","v":{"$error":"#REF!"}},{"$f":"IF(#REF!=0,\"\",#REF!)","v":{"$error":"#REF!"}},{"$f":"IF(#REF!=0,\"\",#REF!)","v":{"$error":"#REF!"}},{"$f":"IF(#REF!=0,\"\",#REF!)","v":{"$error":"#REF!"}},{"$f":"IF(#REF!=0,\"\",#REF!)","v":{"$error":"#REF!"}},{"$f":"IF(#REF!=0,\"\",#REF!)","v":{"$error":"#REF!"}},{"$f":"IF(#REF!=0,\"\",#REF!)","v":{"$error":"#REF!"}}]
[{"$f":"#REF!","v":{"$error":"#REF!"}},{"$f":"#REF!","v":{"$error":"#REF!"}},{"$f":"#REF!","v":{"$error":"#REF!"}},{"$f":"#REF!","v":{"$error":"#REF!"}},{"$f":"#REF!","v":{"$error":"#REF!"}},{"$f":"#REF!","v":{"$error":"#REF!"}},{"$f":"#REF!","v":{"$error":"#REF!"}},{"$f":"#REF!","v":{"$error":"#REF!"}}]
[{"$f":"#REF!","v":{"$error":"#REF!"}},{"$f":"#REF!","v":{"$error":"#REF!"}},{"$f":"#REF!","v":{"$error":"#REF!"}},{"$f":"#REF!","v":{"$error":"#REF!"}},{"$f":"#REF!","v":{"$error":"#REF!"}},{"$f":"IF(#REF!=0,\"\",#REF!)","v":{"$error":"#REF!"}},{"$f":"IF(#REF!=0,\"\",#REF!)","v":{"$error":"#REF!"}},{"$f":"IF(#REF!=0,\"\",#REF!)","v":{"$error":"#REF!"}}]
[]
[]
[]
[{"$f":"#REF!","v":{"$error":"#REF!"}},{"$f":"#REF!","v":{"$error":"#REF!"}},{"$f":"#REF!","v":{"$error":"#REF!"}},{"$f":"#REF!","v":{"$error":"#REF!"}},{"$f":"#REF!","v":{"$error":"#REF!"}},{"$f":"#REF!","v":{"$error":"#REF!"}},{"$f":"#REF!","v":{"$error":"#REF!"}},{"$f":"#REF!","v":{"$error":"#REF!"}},{"$f":"#REF!","v":{"$error":"#REF!"}},{"$f":"#REF!","v":{"$error":"#REF!"}},{"$f":"#REF!","v":{"$error":"#REF!"}},{"$f":"#REF!","v":{"$error":"#REF!"}},{"$f":"#REF!","v":{"$error":"#REF!"}},{"$f":"#REF!","v":{"$error":"#REF!"}},{"$f":"#REF!","v":{"$error":"#REF!"}},{"$f":"#REF!","v":{"$error":"#REF!"}},{"$f":"#REF!","v":{"$error":"#REF!"}},{"$f":"#REF!","v":{"$error":"#REF!"}},{"$f":"#REF!","v":{"$error":"#REF!"}},{"$f":"#REF!","v":{"$error":"#REF!"}},{"$f":"#REF!","v":{"$error":"#REF!"}},{"$f":"#REF!","v":{"$error":"#REF!"}},{"$f":"#REF!","v":{"$error":"#REF!"}},{"$f":"#REF!","v":{"$error":"#REF!"}},{"$f":"#REF!","v":{"$error":"#REF!"}},{"$f":"#REF!","v":{"$error":"#REF!"}},{"$f":"#REF!","v":{"$error":"#REF!"}},{"$f":"#REF!","v":{"$error":"#REF!"}},{"$f":"#REF!","v":{"$error":"#REF!"}}]
[{"$f":"#REF!","v":{"$error":"#REF!"}},{"$f":"#REF!","v":{"$error":"#REF!"}},{"$f":"#REF!","v":{"$error":"#REF!"}},{"$f":"#REF!","v":{"$error":"#REF!"}}]
[{"$f":"#REF!","v":{"$error":"#REF!"}},{"$f":"#REF!","v":{"$error":"#REF!"}},{"$f":"#REF!","v":{"$error":"#REF!"}},{"$f":"#REF!","v":{"$error":"#REF!"}},{"$f":"#REF!","v":{"$error":"#REF!"}},{"$f":"#REF!","v":{"$error":"#REF!"}},{"$f":"#REF!","v":{"$error":"#REF!"}},{"$f":"#REF!","v":{"$error":"#REF!"}},{"$f":"#REF!","v":{"$error":"#REF!"}},{"$f":"#REF!","v":{"$error":"#REF!"}},{"$f":"#REF!","v":{"$error":"#REF!"}},{"$f":"#REF!","v":{"$error":"#REF!"}},{"$f":"#REF!","v":{"$error":"#REF!"}},{"$f":"#REF!","v":{"$error":"#REF!"}},{"$f":"#REF!","v":{"$error":"#REF!"}},{"$f":"#REF!","v":{"$error":"#REF!"}},{"$f":"#REF!","v":{"$error":"#REF!"}},{"$f":"#REF!","v":{"$error":"#REF!"}},{"$f":"#REF!","v":{"$error":"#REF!"}},{"$f":"#REF!","v":{"$error":"#REF!"}},{"$f":"#REF!","v":{"$error":"#REF!"}},{"$f":"#REF!","v":{"$error":"#REF!"}},{"$f":"#REF!","v":{"$error":"#REF!"}},{"$f":"#REF!","v":{"$error":"#REF!"}},{"$f":"#REF!","v":{"$error":"#REF!"}},{"$f":"#REF!","v":{"$error":"#REF!"}},{"$f":"#REF!","v":{"$error":"#REF!"}},{"$f":"#REF!","v":{"$error":"#REF!"}},{"$f":"#REF!","v":{"$error":"#REF!"}}]
[{"$f":"#REF!","v":{"$error":"#REF!"}},{"$f":"IF(#REF!=\"\",\"\",#REF!)","v":{"$error":"#REF!"}},{"$f":"IF(#REF!=\"\",\"\",#REF!)","v":{"$error":"#REF!"}},{"$f":"IF(#REF!=\"\",\"\",#REF!)","v":{"$error":"#REF!"}},{"$f":"IF(#REF!=\"\",\"\",#REF!)","v":{"$error":"#REF!"}},{"$f":"IF(#REF!=\"\",\"\",#REF!)","v":{"$error":"#REF!"}},{"$f":"IF(#REF!=\"\",\"\",#REF!)","v":{"$error":"#REF!"}},{"$f":"IF(#REF!=\"\",\"\",#REF!)","v":{"$error":"#REF!"}},{"$f":"IF(#REF!=\"\",\"\",#REF!)","v":{"$error":"#REF!"}},{"$f":"IF(#REF!=\"\",\"\",#REF!)","v":{"$error":"#REF!"}},{"$f":"IF(#REF!=\"\",\"\",#REF!)","v":{"$error":"#REF!"}},{"$f":"IF(#REF!=\"\",\"\",#REF!)","v":{"$error":"#REF!"}},{"$f":"IF(#REF!=\"\",\"\",#REF!)","v":{"$error":"#REF!"}},{"$f":"IF(#REF!=\"\",\"\",#REF!)","v":{"$error":"#REF!"}},{"$f":"IF(#REF!=\"\",\"\",#REF!)","v":{"$error":"#REF!"}},{"$f":"IF(#REF!=\"\",\"\",#REF!)","v":{"$error":"#REF!"}},{"$f":"IF(#REF!=\"\",\"\",#REF!)","v":{"$error":"#REF!"}},{"$f":"IF(#REF!=\"\",\"\",#REF!)","v":{"$error":"#REF!"}},{"$f":"IF(#REF!=\"\",\"\",#REF!)","v":{"$error":"#REF!"}},{"$f":"IF(#REF!=\"\",\"\",#REF!)","v":{"$error":"#REF!"}},{"$f":"IF(#REF!=\"\",\"\",#REF!)","v":{"$error":"#REF!"}},{"$f":"IF(#REF!=\"\",\"\",#REF!)","v":{"$error":"#REF!"}},{"$f":"IF(#REF!=\"\",\"\",#REF!)","v":{"$error":"#REF!"}},{"$f":"IF(#REF!=\"\",\"\",#REF!)","v":{"$error":"#REF!"}},{"$f":"IF(#REF!=\"\",\"\",#REF!)","v":{"$error":"#REF!"}},{"$f":"IF(#REF!=\"\",\"\",#REF!)","v":{"$error":"#REF!"}},{"$f":"IF(#REF!=\"\",\"\",#REF!)","v":{"$error":"#REF!"}}]
[{"$f":"#REF!","v":{"$error":"#REF!"}},{"$f":"#REF!","v":{"$error":"#REF!"}},{"$f":"#REF!","v":{"$error":"#REF!"}},{"$f":"#REF!","v":{"$error":"#REF!"}},{"$f":"#REF!","v":{"$error":"#REF!"}},{"$f":"#REF!","v":{"$error":"#REF!"}},{"$f":"#REF!","v":{"$error":"#REF!"}},{"$f":"#REF!","v":{"$error":"#REF!"}}]
[{"$f":"#REF!","v":{"$error":"#REF!"}},{"$f":"#REF!","v":{"$error":"#REF!"}},{"$f":"#REF!","v":{"$error":"#REF!"}},{"$f":"#REF!","v":{"$error":"#REF!"}},{"$f":"#REF!","v":{"$error":"#REF!"}},{"$f":"IF(#REF!=\"\",\"\",#REF!)","v":{"$error":"#REF!"}},{"$f":"IF(#REF!=\"\",\"\",#REF!)","v":{"$error":"#REF!"}},{"$f":"IF(#REF!=\"\",\"\",#REF!)","v":{"$error":"#REF!"}}]
[{"$f":"#REF!","v":{"$error":"#REF!"}},{"$f":"#REF!","v":{"$error":"#REF!"}},{"$f":"#REF!","v":{"$error":"#REF!"}},{"$f":"#REF!","v":{"$error":"#REF!"}},{"$f":"#REF!","v":{"$error":"#REF!"}},{"$f":"#REF!","v":{"$error":"#REF!"}},{"$f":"#REF!","v":{"$error":"#REF!"}},{"$f":"#REF!","v":{"$error":"#REF!"}},{"$f":"#REF!","v":{"$error":"#REF!"}},{"$f":"#REF!","v":{"$error":"#REF!"}},{"$f":"#REF!","v":{"$error":"#REF!"}},{"$f":"#REF!","v":{"$error":"#REF!"}},{"$f":"#REF!","v":{"$error":"#REF!"}},{"$f":"#REF!","v":{"$error":"#REF!"}},{"$f":"#REF!","v":{"$error":"#REF!"}},{"$f":"#REF!","v":{"$error":"#REF!"}},{"$f":"#REF!","v":{"$error":"#REF!"}},{"$f":"#REF!","v":{"$error":"#REF!"}},{"$f":"#REF!","v":{"$error":"#REF!"}},{"$f":"#REF!","v":{"$error":"#REF!"}},{"$f":"#REF!","v":{"$error":"#REF!"}}]
[{"$f":"#REF!","v":{"$error":"#REF!"}},{"$f":"#REF!","v":{"$error":"#REF!"}},{"$f":"#REF!","v":{"$error":"#REF!"}},{"$f":"#REF!","v":{"$error":"#REF!"}}]
[{"$f":"#REF!","v":{"$error":"#REF!"}},{"$f":"#REF!","v":{"$error":"#REF!"}},{"$f":"#REF!","v":{"$error":"#REF!"}},{"$f":"#REF!","v":{"$error":"#REF!"}},{"$f":"#REF!","v":{"$error":"#REF!"}},{"$f":"#REF!","v":{"$error":"#REF!"}},{"$f":"#REF!","v":{"$error":"#REF!"}},{"$f":"#REF!","v":{"$error":"#REF!"}},{"$f":"#REF!","v":{"$error":"#REF!"}},{"$f":"#REF!","v":{"$error":"#REF!"}},{"$f":"#REF!","v":{"$error":"#REF!"}},{"$f":"#REF!","v":{"$error":"#REF!"}},{"$f":"#REF!","v":{"$error":"#REF!"}},{"$f":"#REF!","v":{"$error":"#REF!"}},{"$f":"#REF!","v":{"$error":"#REF!"}},{"$f":"#REF!","v":{"$error":"#REF!"}},{"$f":"#REF!","v":{"$error":"#REF!"}},{"$f":"#REF!","v":{"$error":"#REF!"}},{"$f":"#REF!","v":{"$error":"#REF!"}},{"$f":"#REF!","v":{"$error":"#REF!"}},{"$f":"#REF!","v":{"$error":"#REF!"}},{"$f":"#REF!","v":{"$error":"#REF!"}}]
[{"$f":"#REF!","v":{"$error":"#REF!"}},{"$f":"IF(#REF!=\"\",\"\",#REF!)","v":{"$error":"#REF!"}},{"$f":"IF(#REF!=\"\",\"\",#REF!)","v":{"$error":"#REF!"}},{"$f":"IF(#REF!=\"\",\"\",#REF!)","v":{"$error":"#REF!"}},{"$f":"IF(#REF!=\"\",\"\",#REF!)","v":{"$error":"#REF!"}},{"$f":"IF(#REF!=\"\",\"\",#REF!)","v":{"$error":"#REF!"}},{"$f":"IF(#REF!=\"\",\"\",#REF!)","v":{"$error":"#REF!"}},{"$f":"IF(#REF!=\"\",\"\",#REF!)","v":{"$error":"#REF!"}},{"$f":"IF(#REF!=\"\",\"\",#REF!)","v":{"$error":"#REF!"}},{"$f":"IF(#REF!=\"\",\"\",#REF!)","v":{"$error":"#REF!"}},{"$f":"IF(#REF!=\"\",\"\",#REF!)","v":{"$error":"#REF!"}},{"$f":"IF(#REF!=\"\",\"\",#REF!)","v":{"$error":"#REF!"}},{"$f":"IF(#REF!=\"\",\"\",#REF!)","v":{"$error":"#REF!"}},{"$f":"IF(#REF!=\"\",\"\",#REF!)","v":{"$error":"#REF!"}},{"$f":"IF(#REF!=\"\",\"\",#REF!)","v":{"$error":"#REF!"}},{"$f":"IF(#REF!=\"\",\"\",#REF!)","v":{"$error":"#REF!"}},{"$f":"IF(#REF!=\"\",\"\",#REF!)","v":{"$error":"#REF!"}},{"$f":"IF(#REF!=\"\",\"\",#REF!)","v":{"$error":"#REF!"}},{"$f":"IF(#REF!=\"\",\"\",#REF!)","v":{"$error":"#REF!"}}]
[{"$f":"#REF!","v":{"$error":"#REF!"}},{"$f":"#REF!","v":{"$error":"#REF!"}},{"$f":"#REF!","v":{"$error":"#REF!"}},{"$f":"#REF!","v":{"$error":"#REF!"}},{"$f":"#REF!","v":{"$error":"#REF!"}},{"$f":"#REF!","v":{"$error":"#REF!"}},{"$f":"#REF!","v":{"$error":"#REF!"}},{"$f":"#REF!","v":{"$error":"#REF!"}},{"$f":"#REF!","v":{"$error":"#REF!"}},{"$f":"#REF!","v":{"$error":"#REF!"}},{"$f":"#REF!","v":{"$error":"#REF!"}},{"$f":"#REF!","v":{"$error":"#REF!"}},{"$f":"#REF!","v":{"$error":"#REF!"}},{"$f":"#REF!","v":{"$error":"#REF!"}},{"$f":"#REF!","v":{"$error":"#REF!"}},{"$f":"#REF!","v":{"$error":"#REF!"}}]
[{"$f":"#REF!","v":{"$error":"#REF!"}},{"$f":"#REF!","v":{"$error":"#REF!"}},{"$f":"#REF!","v":{"$error":"#REF!"}},{"$f":"#REF!","v":{"$error":"#REF!"}},{"$f":"#REF!","v":{"$error":"#REF!"}},{"$f":"IF(#REF!=\"\",\"\",#REF!)","v":{"$error":"#REF!"}},{"$f":"#REF!","v":{"$error":"#REF!"}},{"$f":"#REF!","v":{"$error":"#REF!"}},{"$f":"#REF!","v":{"$error":"#REF!"}},{"$f":"#REF!","v":{"$error":"#REF!"}},{"$f":"#REF!","v":{"$error":"#REF!"}},{"$f":"#REF!","v":{"$error":"#REF!"}},{"$f":"#REF!","v":{"$error":"#REF!"}},{"$f":"#REF!","v":{"$error":"#REF!"}},{"$f":"IF(#REF!=\"\",\"\",#REF!)","v":{"$error":"#REF!"}},{"$f":"IF(#REF!=\"\",\"\",#REF!)","v":{"$error":"#REF!"}}]
[{"$f":"'FW metal plant'!B11","v":"No."},{"$f":"'FW metal plant'!B13","v":1},{"$f":"'FW metal plant'!B16","v":2},{"$f":"'FW metal plant'!B19","v":3},{"$f":"'FW metal plant'!B21","v":4},{"$f":"'FW metal plant'!B23","v":5},{"$f":"'FW metal plant'!B26","v":6},{"$f":"'FW metal plant'!B29","v":7},{"$f":"'FW metal plant'!B32","v":8},{"$f":"'FW metal plant'!B35","v":9},{"$f":"'FW metal plant'!B39","v":10},{"$f":"'FW metal plant'!B42","v":11},{"$f":"'FW metal plant'!B45","v":12},{"$f":"'FW metal plant'!B48","v":13},{"$f":"'FW metal plant'!B51","v":14},{"$f":"'FW metal plant'!B53","v":15},{"$f":"'FW metal plant'!B58","v":16.100000000000001},{"$f":"'FW metal plant'!B61","v":16.2},{"$f":"'FW metal plant'!B64","v":16.3},{"$f":"'FW metal plant'!B67","v":16.399999999999999},{"$f":"'FW metal plant'!B70","v":17},{"$f":"'FW metal plant'!B73","v":18},{"$f":"'FW metal plant'!C78","v":"Total score"},{"$f":"'FW metal plant'!C80","v":"Quality Score"}]
[{"$f":"'FW metal plant'!C2","v":"Category"},{"$f":"'FW metal plant'!E2","v":"Freshwater/metal/plant"},{"$f":"'FW metal plant'!C3","v":"Paper and data unique identifier(eg. 1-1,10-150)"},{"$f":"'FW metal plant'!E3","v":"175-5"}]
[{"$f":"'FW metal plant'!G11","v":"Scores"},{"$f":"'FW metal plant'!G12","v":10},{"$f":"'FW metal plant'!G15","v":10},{"$f":"'FW metal plant'!G18","v":5},{"$f":"'FW metal plant'!G21","v":5},{"$f":"'FW metal plant'!G23","v":5},{"$f":"'FW metal plant'!G26","v":5},{"$f":"'FW metal plant'!G29","v":5},{"$f":"'FW metal plant'!G32","v":5},{"$f":"'FW metal plant'!G35","v":5},{"$f":"'FW metal plant'!G38","v":4},{"$f":"'FW metal plant'!G41","v":4},{"$f":"'FW metal plant'!G44","v":0},{"$f":"'FW metal plant'!G47","v":4},{"$f":"'FW metal plant'!G50","v":4},{"$f":"'FW metal plant'!G53","v":4},{"$f":"'FW metal plant'!G57","v":3},{"$f":"'FW metal plant'!G60","v":1},{"$f":"'FW metal plant'!G63","v":0},{"$f":"'FW metal plant'!G66","v":3},{"$f":"'FW metal plant'!G69","v":3},{"$f":"'FW metal plant'!G72","v":3},{"$f":"'FW metal plant'!G78","v":88},{"$f":"'FW metal plant'!G80","v":0.90721649484536082},{"$f":"'FW metal plant'!H80","v":""}]
[{"$f":"'FW metal plant'!H11","v":"Answers"},{"$f":"IF('FW metal plant'!H12=\"\",\"\",'FW metal plant'!H12)","v":"72 h"},{"$f":"IF('FW metal plant'!H15=\"\",\"\",'FW metal plant'!H15)","v":"Growth rate, defined."},{"$f":"IF('FW metal plant'!H18=\"\",\"\",'FW metal plant'!H18)","v":"EC"},{"$f":"IF('FW metal plant'!H21=\"\",\"\",'FW metal plant'!H21)","v":10},{"$f":"IF('FW metal plant'!H23=\"\",\"\",'FW metal plant'!H23)","v":""},{"$f":"IF('FW metal plant'!H26=\"\",\"\",'FW metal plant'!H26)","v":"duplicate"},{"$f":"IF('FW metal plant'!H29=\"\",\"\",'FW metal plant'!H29)","v":"Control growth rate >1 doublings per day. Results of this study define acceptability criteria for future studies (optimisation paper)."},{"$f":"IF('FW metal plant'!H32=\"\",\"\",'FW metal plant'!H32)","v":"0.27 x 10^3 cells/mL in exponential growth"},{"$f":"IF('FW metal plant'!H35=\"\",\"\",'FW metal plant'!H35)","v":"synthetic softwater "},{"$f":"IF('FW metal plant'!H38=\"\",\"\",'FW metal plant'!H38)","v":"Static"},{"$f":"IF('FW metal plant'!H41=\"\",\"\",'FW metal plant'!H41)","v":"beginning and end"},{"$f":"IF('FW metal plant'!H44=\"\",\"\",'FW metal plant'!H44)","v":"Copper tests done alongside, however, this study will inform acceptability criteria and refotx data for future work"},{"$f":"IF('FW metal plant'!H47=\"\",\"\",'FW metal plant'!H47)","v":""},{"$f":"IF('FW metal plant'!H50=\"\",\"\",'FW metal plant'!H50)","v":""},{"$f":"IF('FW metal plant'!H53=\"\",\"\",'FW metal plant'!H53)","v":"95% CLs of 140-205"},{"$f":"IF('FW metal plant'!H57=\"\",\"\",'FW metal plant'!H57)","v":7.5},{"$f":"IF('FW metal plant'!H60=\"\",\"\",'FW metal plant'!H60)","v":"prepared according to USEPA methods to be 100-120 mg CaCO3/L"},{"$f":"IF('FW metal plant'!H63=\"\",\"\",'FW metal plant'!H63)","v":""},{"$f":"IF('FW metal plant'!H66=\"\",\"\",'FW metal plant'!H66)","v":"<0.5 mg/L"},{"$f":"IF('FW metal plant'!H69=\"\",\"\",'FW metal plant'!H69)","v":"27 ± 2"},{"$f":"IF('FW metal plant'!H72=\"\",\"\",'FW metal plant'!H72)","v":"AR grade used, and controls were analysed for contmaination"}]
[{"$f":"'FW metal plant'!G3","v":"Species (Scientific name)"},{"$f":"'FW metal plant'!G4","v":"Lifestage"},{"$f":"'FW metal plant'!G5","v":"Exposure duration"},{"$f":"'FW metal plant'!G6","v":"Measure of toxicity"},{"$f":"'FW metal plant'!G7","v":"Toxicity endpoint"},{"$f":"'FW metal plant'!G8","v":"Toxicity value"},{"$f":"'FW metal plant'!J2","v":"Taxonomic group"},{"$f":"'FW metal plant'!J3","v":"Phylum"},{"$f":"'FW metal plant'!J4","v":"Class"},{"$f":"'FW metal plant'!J5","v":"Media"},{"$f":"'FW metal plant'!J6","v":"Temperature "},{"$f":"'FW metal plant'!J7","v":"Acute Or Chronic "},{"$f":"'FW metal plant'!J8","v":"PH"},{"$f":"'FW metal plant'!J9","v":"Salinity/Conductivity"},{"$f":"'FW metal plant'!C4","v":"Citation"},{"$f":"'FW metal plant'!G2","v":"Citation No."}]
[{"$f":"'FW metal plant'!Q3","v":"Pediastrum duplex meyan (in multispecies assay)"},{"$f":"'FW metal plant'!T3","v":"exponentially growing cells"},{"$f":"'FW metal plant'!W3","v":"72 h"},{"$f":"'FW metal plant'!Z3","v":"EC10"},{"$f":"'FW metal plant'!AC3","v":"Growth rate"},{"$f":"IF('FW metal plant'!H8=\"\",\"\",'FW metal plant'!H8)","v":173},{"$f":"'FW metal plant'!AF3","v":"Microalga"},{"$f":"'FW metal plant'!AI3","v":"Chlorophyta"},{"$f":"'FW metal plant'!AL3","v":"Chlorophyceae"},{"$f":"'FW metal plant'!AO3","v":"Freshwater"},{"$f":"'FW metal plant'!AR3","v":27},{"$f":"'FW metal plant'!AU3","v":"Chronic"},{"$f":"'FW metal plant'!AX3","v":7.5},{"$f":"'FW metal plant'!BA3","v":"N.A."},{"$f":"IF('FW metal plant'!E4=\"\",\"\",'FW metal plant'!E4)","v":"McKnight et al 2018 (unpublished data)"},{"$f":"IF('FW metal plant'!H2=\"\",\"\",'FW metal plant'!H2)","v":"175"}]
[{"$f":"#REF!","v":{"$error":"#REF!"}},{"$f":"#REF!","v":{"$error":"#REF!"}},{"$f":"#REF!","v":{"$error":"#REF!"}},{"$f":"#REF!","v":{"$error":"#REF!"}},{"$f":"#REF!","v":{"$error":"#REF!"}},{"$f":"#REF!","v":{"$error":"#REF!"}},{"$f":"#REF!","v":{"$error":"#REF!"}},{"$f":"#REF!","v":{"$error":"#REF!"}},{"$f":"#REF!","v":{"$error":"#REF!"}},{"$f":"#REF!","v":{"$error":"#REF!"}},{"$f":"#REF!","v":{"$error":"#REF!"}},{"$f":"#REF!","v":{"$error":"#REF!"}},{"$f":"#REF!","v":{"$error":"#REF!"}},{"$f":"#REF!","v":{"$error":"#REF!"}},{"$f":"#REF!","v":{"$error":"#REF!"}},{"$f":"#REF!","v":{"$error":"#REF!"}},{"$f":"#REF!","v":{"$error":"#REF!"}},{"$f":"#REF!","v":{"$error":"#REF!"}},{"$f":"#REF!","v":{"$error":"#REF!"}},{"$f":"#REF!","v":{"$error":"#REF!"}},{"$f":"#REF!","v":{"$error":"#REF!"}},{"$f":"#REF!","v":{"$error":"#REF!"}}]
[{"$f":"#REF!","v":{"$error":"#REF!"}},{"$f":"#REF!","v":{"$error":"#REF!"}},{"$f":"#REF!","v":{"$error":"#REF!"}},{"$f":"#REF!","v":{"$error":"#REF!"}}]
[{"$f":"#REF!","v":{"$error":"#REF!"}},{"$f":"#REF!","v":{"$error":"#REF!"}},{"$f":"#REF!","v":{"$error":"#REF!"}},{"$f":"#REF!","v":{"$error":"#REF!"}},{"$f":"#REF!","v":{"$error":"#REF!"}},{"$f":"#REF!","v":{"$error":"#REF!"}},{"$f":"#REF!","v":{"$error":"#REF!"}},{"$f":"#REF!","v":{"$error":"#REF!"}},{"$f":"#REF!","v":{"$error":"#REF!"}},{"$f":"#REF!","v":{"$error":"#REF!"}},{"$f":"#REF!","v":{"$error":"#REF!"}},{"$f":"#REF!","v":{"$error":"#REF!"}},{"$f":"#REF!","v":{"$error":"#REF!"}},{"$f":"#REF!","v":{"$error":"#REF!"}},{"$f":"#REF!","v":{"$error":"#REF!"}},{"$f":"#REF!","v":{"$error":"#REF!"}},{"$f":"#REF!","v":{"$error":"#REF!"}},{"$f":"#REF!","v":{"$error":"#REF!"}},{"$f":"#REF!","v":{"$error":"#REF!"}},{"$f":"#REF!","v":{"$error":"#REF!"}},{"$f":"#REF!","v":{"$error":"#REF!"}},{"$f":"#REF!","v":{"$error":"#REF!"}},null,{"$f":"#REF!","v":{"$error":"#REF!"}}]
[{"$f":"#REF!","v":{"$error":"#REF!"}},{"$f":"IF(#REF!=\"\",\"\",#REF!)","v":{"$error":"#REF!"}},{"$f":"IF(#REF!=\"\",\"\",#REF!)","v":{"$error":"#REF!"}},{"$f":"IF(#REF!=\"\",\"\",#REF!)","v":{"$error":"#REF!"}},{"$f":"IF(#REF!=\"\",\"\",#REF!)","v":{"$error":"#REF!"}},{"$f":"IF(#REF!=\"\",\"\",#REF!)","v":{"$error":"#REF!"}},{"$f":"IF(#REF!=\"\",\"\",#REF!)","v":{"$error":"#REF!"}},{"$f":"IF(#REF!=\"\",\"\",#REF!)","v":{"$error":"#REF!"}},{"$f":"IF(#REF!=\"\",\"\",#REF!)","v":{"$error":"#REF!"}},{"$f":"IF(#REF!=\"\",\"\",#REF!)","v":{"$error":"#REF!"}},{"$f":"IF(#REF!=\"\",\"\",#REF!)","v":{"$error":"#REF!"}},{"$f":"IF(#REF!=\"\",\"\",#REF!)","v":{"$error":"#REF!"}},{"$f":"IF(#REF!=\"\",\"\",#REF!)","v":{"$error":"#REF!"}},{"$f":"IF(#REF!=\"\",\"\",#REF!)","v":{"$error":"#REF!"}},{"$f":"IF(#REF!=\"\",\"\",#REF!)","v":{"$error":"#REF!"}},{"$f":"IF(#REF!=\"\",\"\",#REF!)","v":{"$error":"#REF!"}},{"$f":"IF(#REF!=\"\",\"\",#REF!)","v":{"$error":"#REF!"}},{"$f":"IF(#REF!=\"\",\"\",#REF!)","v":{"$error":"#REF!"}},{"$f":"IF(#REF!=\"\",\"\",#REF!)","v":{"$error":"#REF!"}},{"$f":"IF(#REF!=\"\",\"\",#REF!)","v":{"$error":"#REF!"}}]
[{"$f":"#REF!","v":{"$error":"#REF!"}},{"$f":"#REF!","v":{"$error":"#REF!"}},{"$f":"#REF!","v":{"$error":"#REF!"}},{"$f":"#REF!","v":{"$error":"#REF!"}},{"$f":"#REF!","v":{"$error":"#REF!"}},{"$f":"#REF!","v":{"$error":"#REF!"}},{"$f":"#REF!","v":{"$error":"#REF!"}},{"$f":"#REF!","v":{"$error":"#REF!"}},{"$f":"#REF!","v":{"$error":"#REF!"}},{"$f":"#REF!","v":{"$error":"#REF!"}},{"$f":"#REF!","v":{"$error":"#REF!"}},{"$f":"#REF!","v":{"$error":"#REF!"}},{"$f":"#REF!","v":{"$error":"#REF!"}},{"$f":"#REF!","v":{"$error":"#REF!"}},{"$f":"#REF!","v":{"$error":"#REF!"}},{"$f":"#REF!","v":{"$error":"#REF!"}}]
[{"$f":"#REF!","v":{"$error":"#REF!"}},{"$f":"#REF!","v":{"$error":"#REF!"}},{"$f":"#REF!","v":{"$error":"#REF!"}},{"$f":"#REF!","v":{"$error":"#REF!"}},{"$f":"#REF!","v":{"$error":"#REF!"}},{"$f":"IF(#REF!=\"\",\"\",#REF!)","v":{"$error":"#REF!"}},{"$f":"#REF!","v":{"$error":"#REF!"}},{"$f":"#REF!","v":{"$error":"#REF!"}},{"$f":"#REF!","v":{"$error":"#REF!"}},{"$f":"#REF!","v":{"$error":"#REF!"}},{"$f":"#REF!","v":{"$error":"#REF!"}},{"$f":"#REF!","v":{"$error":"#REF!"}},{"$f":"#REF!","v":{"$error":"#REF!"}},{"$f":"#REF!","v":{"$error":"#REF!"}},{"$f":"IF(#REF!=\"\",\"\",#REF!)","v":{"$error":"#REF!"}},{"$f":"IF(#REF!=\"\",\"\",#REF!)","v":{"$error":"#REF!"}}]
[{"$f":"'FW metal nonplant'!B11","v":"No."},{"$f":"'FW metal nonplant'!B13","v":1},{"$f":"'FW metal nonplant'!B16","v":2},{"$f":"'FW metal nonplant'!B19","v":3},{"$f":"'FW metal nonplant'!B21","v":4},{"$f":"'FW metal nonplant'!B23","v":5},{"$f":"'FW metal nonplant'!B26","v":6},{"$f":"'FW metal nonplant'!B29","v":7},{"$f":"'FW metal nonplant'!B32","v":8},{"$f":"'FW metal nonplant'!B35","v":9},{"$f":"'FW metal nonplant'!B39","v":10},{"$f":"'FW metal nonplant'!B42","v":11},{"$f":"'FW metal nonplant'!B45","v":12},{"$f":"'FW metal nonplant'!B48","v":13},{"$f":"'FW metal nonplant'!B51","v":14},{"$f":"'FW metal nonplant'!B53","v":15},{"$f":"'FW metal nonplant'!B58","v":16.100000000000001},{"$f":"'FW metal nonplant'!B61","v":16.2},{"$f":"'FW metal nonplant'!B64","v":16.3},{"$f":"'FW metal nonplant'!B67","v":16.399999999999999},{"$f":"'FW metal nonplant'!B70","v":16.5},{"$f":"'FW metal nonplant'!B73","v":17},{"$f":"'FW metal nonplant'!B76","v":18},{"$f":"'FW metal nonplant'!C81","v":"Total score"},{"$f":"'FW metal nonplant'!C83","v":"Quality Score"}]
[{"$f":"'FW metal nonplant'!C2","v":"Category"},{"$f":"'FW metal nonplant'!E2","v":"Freshwater/metal/non- plant"},{"$f":"'FW metal nonplant'!C3","v":"Paper and data unique identifier(eg. 1-1,10-150)"},{"$f":"'FW metal nonplant'!E3","v":"177-15"}]
[{"$f":"'FW metal nonplant'!G11","v":"Scores"},{"$f":"'FW metal nonplant'!G12","v":10},{"$f":"'FW metal nonplant'!G15","v":5},{"$f":"'FW metal nonplant'!G18","v":5},{"$f":"'FW metal nonplant'!G21","v":5},{"$f":"'FW metal nonplant'!G23","v":5},{"$f":"'FW metal nonplant'!G26","v":5},{"$f":"'FW metal nonplant'!G29","v":5},{"$f":"'FW metal nonplant'!G32","v":5},{"$f":"'FW metal nonplant'!G35","v":5},{"$f":"'FW metal nonplant'!G38","v":4},{"$f":"'FW metal nonplant'!G41","v":4},{"$f":"'FW metal nonplant'!G44","v":4},{"$f":"'FW metal nonplant'!G47","v":4},{"$f":"'FW metal nonplant'!G50","v":4},{"$f":"'FW metal nonplant'!G53","v":4},{"$f":"'FW metal nonplant'!G57","v":3},{"$f":"'FW metal nonplant'!G60","v":3},{"$f":"'FW metal nonplant'!G63","v":3},{"$f":"'FW metal nonplant'!G66","v":3},{"$f":"'FW metal nonplant'!G69","v":3},{"$f":"'FW metal nonplant'!G72","v":1},{"$f":"'FW metal nonplant'!G75","v":3},{"$f":"'FW metal nonplant'!G81","v":93},{"$f":"'FW metal nonplant'!G83","v":0.93},{"$f":"'FW metal nonplant'!H83","v":""}]
[{"$f":"'FW metal nonplant'!H11","v":"Answers"},{"$f":"IF('FW metal nonplant'!H12=\"\",\"\",'FW metal nonplant'!H12)","v":"12-d"},{"$f":"IF('FW metal nonplant'!H15=\"\",\"\",'FW metal nonplant'!H15)","v":"imbalance of hatched embryos"},{"$f":"IF('FW metal nonplant'!H18=\"\",\"\",'FW metal nonplant'!H18)","v":"NOEC"},{"$f":"IF('FW metal nonplant'!H21=\"\",\"\",'FW metal nonplant'!H21)","v":"72% effect"},{"$f":"IF('FW metal nonplant'!H23=\"\",\"\",'FW metal nonplant'!H23)","v":"Yes, DMW lab water control and River water control"},{"$f":"IF('FW metal nonplant'!H26=\"\",\"\",'FW metal nonplant'!H26)","v":"4 replicates"},{"$f":"IF('FW metal nonplant'!H29=\"\",\"\",'FW metal nonplant'!H29)","v":"Cited ESA SOP 126 (ESA, 2013) and USEPA (2002) and required >=80% survival in the controls"},{"$f":"IF('FW metal nonplant'!H32=\"\",\"\",'FW metal nonplant'!H32)","v":"<24h fertilised eggs"},{"$f":"IF('FW metal nonplant'!H35=\"\",\"\",'FW metal nonplant'!H35)","v":"Tea Tree water"},{"$f":"IF('FW metal nonplant'!H38=\"\",\"\",'FW metal nonplant'!H38)","v":"Static renewal. Solutions renewed every 48 h"},{"$f":"IF('FW metal nonplant'!H41=\"\",\"\",'FW metal nonplant'!H41)","v":"Dissolved Ni measured at beginning, during and end of test on new and old test solutions"},{"$f":"IF('FW metal nonplant'!H44=\"\",\"\",'FW metal nonplant'!H44)","v":"Copper reference test"},{"$f":"IF('FW metal nonplant'!H47=\"\",\"\",'FW metal nonplant'!H47)","v":""},{"$f":"IF('FW metal nonplant'!H50=\"\",\"\",'FW metal nonplant'!H50)","v":"Toxcalc v5.0.23"},{"$f":"IF('FW metal nonplant'!H53=\"\",\"\",'FW metal nonplant'!H53)","v":"P<0.05"},{"$f":"IF('FW metal nonplant'!H57=\"\",\"\",'FW metal nonplant'!H57)","v":"6.9-7.2"},{"$f":"IF('FW metal nonplant'!H60=\"\",\"\",'FW metal nonplant'!H60)","v":"Ca = 2.1 mg/L\nMg = 4.7 mg/L\nBased on Ca and Mg, hardness = 25 mg/L as CaCO3"},{"$f":"IF('FW metal nonplant'!H63=\"\",\"\",'FW metal nonplant'!H63)","v":"Total Alkalinity as CaCO3 = 14 mg/L"},{"$f":"IF('FW metal nonplant'!H66=\"\",\"\",'FW metal nonplant'!H66)","v":"DOC = 10 mg/L"},{"$f":"IF('FW metal nonplant'!H69=\"\",\"\",'FW metal nonplant'!H69)","v":"111-113% saturation"},{"$f":"IF('FW metal nonplant'!H72=\"\",\"\",'FW metal nonplant'!H72)","v":"25 +/- oC"},{"$f":"IF('FW metal nonplant'!H75=\"\",\"\",'FW metal nonplant'!H75)","v":"Dilution water was analysed for multiple metals"}]
[{"$f":"'FW metal nonplant'!G3","v":"Species (Scientific name)"},{"$f":"'FW metal nonplant'!G4","v":"Lifestage"},{"$f":"'FW metal nonplant'!G5","v":"Exposure duration"},{"$f":"'FW metal nonplant'!G6","v":"Measure of toxicity"},{"$f":"'FW metal nonplant'!G7","v":"Toxicity endpoint"},{"$f":"'FW metal nonplant'!G8","v":"Toxicity value"},{"$f":"'FW metal nonplant'!J2","v":"Taxonomic group"},{"$f":"'FW metal nonplant'!J3","v":"Phylum"},{"$f":"'FW metal nonplant'!J4","v":"Class"},{"$f":"'FW metal nonplant'!J5","v":"Media"},{"$f":"'FW metal nonplant'!J6","v":"Temperature "},{"$f":"'FW metal nonplant'!J7","v":"Acute Or Chronic "},{"$f":"'FW metal nonplant'!J8","v":"PH"},{"$f":"'FW metal nonplant'!J9","v":"Salinity/Conductivity"},{"$f":"'FW metal nonplant'!C4","v":"Citation"},{"$f":"'FW metal nonplant'!G2","v":"Citation No."}]
[{"$f":"'FW metal nonplant'!Q3","v":"Melanotaenia splendida splendida"},{"$f":"'FW metal nonplant'!T3","v":"embryo"},{"$f":"'FW metal nonplant'!W3","v":"12-d"},{"$f":"'FW metal nonplant'!Z3","v":"NOEC"},{"$f":"'FW metal nonplant'!AC3","v":"Embryo hatching success/imbalance"},{"$f":"IF('FW metal nonplant'!H8=\"\",\"\",'FW metal nonplant'!H8)","v":52},{"$f":"'FW metal nonplant'!AF3","v":"Fish"},{"$f":"'FW metal nonplant'!AI3","v":"Chordata"},{"$f":"'FW metal nonplant'!AL3","v":"Actinopterygii"},{"$f":"'FW metal nonplant'!AO3","v":"Tea Tree River"},{"$f":"'FW metal nonplant'!AR3","v":"25 ± 2"},{"$f":"'FW metal nonplant'!AU3","v":"Chronic"},{"$f":"'FW metal nonplant'!AX3","v":"6.9-7.2"},{"$f":"'FW metal nonplant'!BA3","v":"N.A."},{"$f":"IF('FW metal nonplant'!E4=\"\",\"\",'FW metal nonplant'!E4)","v":"Ecotox Services Australia. 2014. Toxicity of Nickel Under Varying Physico-chemical Conditions. Prepared for Nickel Producers Environmental Research Association (NiPERA). Test Report. May 2014."},{"$f":"IF('FW metal nonplant'!H2=\"\",\"\",'FW metal nonplant'!H2)","v":"177"}]
[{"$f":"#REF!","v":{"$error":"#REF!"}},{"$f":"#REF!","v":{"$error":"#REF!"}},{"$f":"#REF!","v":{"$error":"#REF!"}},{"$f":"#REF!","v":{"$error":"#REF!"}},{"$f":"#REF!","v":{"$error":"#REF!"}},{"$f":"#REF!","v":{"$error":"#REF!"}},{"$f":"#REF!","v":{"$error":"#REF!"}},{"$f":"#REF!","v":{"$error":"#REF!"}},{"$f":"#REF!","v":{"$error":"#REF!"}},{"$f":"#REF!","v":{"$error":"#REF!"}},{"$f":"#REF!","v":{"$error":"#REF!"}},{"$f":"#REF!","v":{"$error":"#REF!"}},{"$f":"#REF!","v":{"$error":"#REF!"}},{"$f":"#REF!","v":{"$error":"#REF!"}},{"$f":"#REF!","v":{"$error":"#REF!"}},{"$f":"#REF!","v":{"$error":"#REF!"}},{"$f":"#REF!","v":{"$error":"#REF!"}},{"$f":"#REF!","v":{"$error":"#REF!"}},{"$f":"#REF!","v":{"$error":"#REF!"}},{"$f":"#REF!","v":{"$error":"#REF!"}},{"$f":"#REF!","v":{"$error":"#REF!"}},{"$f":"#REF!","v":{"$error":"#REF!"}},{"$f":"#REF!","v":{"$error":"#REF!"}}]
[{"$f":"#REF!","v":{"$error":"#REF!"}},{"$f":"#REF!","v":{"$error":"#REF!"}},{"$f":"#REF!","v":{"$error":"#REF!"}},{"$f":"#REF!","v":{"$error":"#REF!"}}]
[{"$f":"#REF!","v":{"$error":"#REF!"}},{"$f":"#REF!","v":{"$error":"#REF!"}},{"$f":"#REF!","v":{"$error":"#REF!"}},{"$f":"#REF!","v":{"$error":"#REF!"}},{"$f":"#REF!","v":{"$error":"#REF!"}},{"$f":"#REF!","v":{"$error":"#REF!"}},{"$f":"#REF!","v":{"$error":"#REF!"}},{"$f":"#REF!","v":{"$error":"#REF!"}},{"$f":"#REF!","v":{"$error":"#REF!"}},{"$f":"#REF!","v":{"$error":"#REF!"}},{"$f":"#REF!","v":{"$error":"#REF!"}},{"$f":"#REF!","v":{"$error":"#REF!"}},{"$f":"#REF!","v":{"$error":"#REF!"}},{"$f":"#REF!","v":{"$error":"#REF!"}},{"$f":"#REF!","v":{"$error":"#REF!"}},{"$f":"#REF!","v":{"$error":"#REF!"}},{"$f":"#REF!","v":{"$error":"#REF!"}},{"$f":"#REF!","v":{"$error":"#REF!"}},{"$f":"#REF!","v":{"$error":"#REF!"}},{"$f":"#REF!","v":{"$error":"#REF!"}},{"$f":"#REF!","v":{"$error":"#REF!"}},{"$f":"#REF!","v":{"$error":"#REF!"}},{"$f":"#REF!","v":{"$error":"#REF!"}},{"$f":"#REF!","v":{"$error":"#REF!"}}]
[{"$f":"#REF!","v":{"$error":"#REF!"}},{"$f":"IF(#REF!=\"\",\"\",#REF!)","v":{"$error":"#REF!"}},{"$f":"IF(#REF!=\"\",\"\",#REF!)","v":{"$error":"#REF!"}},{"$f":"IF(#REF!=\"\",\"\",#REF!)","v":{"$error":"#REF!"}},{"$f":"IF(#REF!=\"\",\"\",#REF!)","v":{"$error":"#REF!"}},{"$f":"IF(#REF!=\"\",\"\",#REF!)","v":{"$error":"#REF!"}},{"$f":"IF(#REF!=\"\",\"\",#REF!)","v":{"$error":"#REF!"}},{"$f":"IF(#REF!=\"\",\"\",#REF!)","v":{"$error":"#REF!"}},{"$f":"IF(#REF!=\"\",\"\",#REF!)","v":{"$error":"#REF!"}},{"$f":"IF(#REF!=\"\",\"\",#REF!)","v":{"$error":"#REF!"}},{"$f":"IF(#REF!=\"\",\"\",#REF!)","v":{"$error":"#REF!"}},{"$f":"IF(#REF!=\"\",\"\",#REF!)","v":{"$error":"#REF!"}},{"$f":"IF(#REF!=\"\",\"\",#REF!)","v":{"$error":"#REF!"}},{"$f":"IF(#REF!=\"\",\"\",#REF!)","v":{"$error":"#REF!"}},{"$f":"IF(#REF!=\"\",\"\",#REF!)","v":{"$error":"#REF!"}},{"$f":"IF(#REF!=\"\",\"\",#REF!)","v":{"$error":"#REF!"}},{"$f":"IF(#REF!=\"\",\"\",#REF!)","v":{"$error":"#REF!"}},{"$f":"IF(#REF!=\"\",\"\",#REF!)","v":{"$error":"#REF!"}},{"$f":"IF(#REF!=\"\",\"\",#REF!)","v":{"$error":"#REF!"}},{"$f":"IF(#REF!=\"\",\"\",#REF!)","v":{"$error":"#REF!"}},{"$f":"IF(#REF!=\"\",\"\",#REF!)","v":{"$error":"#REF!"}}]
[{"$f":"#REF!","v":{"$error":"#REF!"}},{"$f":"#REF!","v":{"$error":"#REF!"}},{"$f":"#REF!","v":{"$error":"#REF!"}},{"$f":"#REF!","v":{"$error":"#REF!"}},{"$f":"#REF!","v":{"$error":"#REF!"}},{"$f":"#REF!","v":{"$error":"#REF!"}},{"$f":"#REF!","v":{"$error":"#REF!"}},{"$f":"#REF!","v":{"$error":"#REF!"}},{"$f":"#REF!","v":{"$error":"#REF!"}},{"$f":"#REF!","v":{"$error":"#REF!"}},{"$f":"#REF!","v":{"$error":"#REF!"}},{"$f":"#REF!","v":{"$error":"#REF!"}},{"$f":"#REF!","v":{"$error":"#REF!"}},{"$f":"#REF!","v":{"$error":"#REF!"}},{"$f":"#REF!","v":{"$error":"#REF!"}},{"$f":"#REF!","v":{"$error":"#REF!"}}]
[{"$f":"#REF!","v":{"$error":"#REF!"}},{"$f":"#REF!","v":{"$error":"#REF!"}},{"$f":"#REF!","v":{"$error":"#REF!"}},{"$f":"#REF!","v":{"$error":"#REF!"}},{"$f":"#REF!","v":{"$error":"#REF!"}},{"$f":"IF(#REF!=\"\",\"\",#REF!)","v":{"$error":"#REF!"}},{"$f":"#REF!","v":{"$error":"#REF!"}},{"$f":"#REF!","v":{"$error":"#REF!"}},{"$f":"#REF!","v":{"$error":"#REF!"}},{"$f":"#REF!","v":{"$error":"#REF!"}},{"$f":"#REF!","v":{"$error":"#REF!"}},{"$f":"#REF!","v":{"$error":"#REF!"}},{"$f":"#REF!","v":{"$error":"#REF!"}},{"$f":"#REF!","v":{"$error":"#REF!"}},{"$f":"IF(#REF!=\"\", \"\",#REF!)","v":{"$error":"#REF!"}},{"$f":"IF(#REF!=\"\", \"\",#REF!)","v":{"$error":"#REF!"}}]
[{"$f":"#REF!","v":{"$error":"#REF!"}},{"$f":"#REF!","v":{"$error":"#REF!"}},{"$f":"#REF!","v":{"$error":"#REF!"}},{"$f":"#REF!","v":{"$error":"#REF!"}},{"$f":"#REF!","v":{"$error":"#REF!"}},{"$f":"#REF!","v":{"$error":"#REF!"}},{"$f":"#REF!","v":{"$error":"#REF!"}},{"$f":"#REF!","v":{"$error":"#REF!"}},{"$f":"#REF!","v":{"$error":"#REF!"}},{"$f":"#REF!","v":{"$error":"#REF!"}},{"$f":"#REF!","v":{"$error":"#REF!"}},{"$f":"#REF!","v":{"$error":"#REF!"}},{"$f":"#REF!","v":{"$error":"#REF!"}},{"$f":"#REF!","v":{"$error":"#REF!"}},{"$f":"#REF!","v":{"$error":"#REF!"}},{"$f":"#REF!","v":{"$error":"#REF!"}},{"$f":"#REF!","v":{"$error":"#REF!"}},{"$f":"#REF!","v":{"$error":"#REF!"}},{"$f":"#REF!","v":{"$error":"#REF!"}},{"$f":"#REF!","v":{"$error":"#REF!"}},{"$f":"#REF!","v":{"$error":"#REF!"}},{"$f":"#REF!","v":{"$error":"#REF!"}}]
[{"$f":"#REF!","v":{"$error":"#REF!"}},{"$f":"#REF!","v":{"$error":"#REF!"}},{"$f":"#REF!","v":{"$error":"#REF!"}},{"$f":"#REF!","v":{"$error":"#REF!"}}]
[{"$f":"#REF!","v":{"$error":"#REF!"}},{"$f":"#REF!","v":{"$error":"#REF!"}},{"$f":"#REF!","v":{"$error":"#REF!"}},{"$f":"#REF!","v":{"$error":"#REF!"}},{"$f":"#REF!","v":{"$error":"#REF!"}},{"$f":"#REF!","v":{"$error":"#REF!"}},{"$f":"#REF!","v":{"$error":"#REF!"}},{"$f":"#REF!","v":{"$error":"#REF!"}},{"$f":"#REF!","v":{"$error":"#REF!"}},{"$f":"#REF!","v":{"$error":"#REF!"}},{"$f":"#REF!","v":{"$error":"#REF!"}},{"$f":"#REF!","v":{"$error":"#REF!"}},{"$f":"#REF!","v":{"$error":"#REF!"}},{"$f":"#REF!","v":{"$error":"#REF!"}},{"$f":"#REF!","v":{"$error":"#REF!"}},{"$f":"#REF!","v":{"$error":"#REF!"}},{"$f":"#REF!","v":{"$error":"#REF!"}},{"$f":"#REF!","v":{"$error":"#REF!"}},{"$f":"#REF!","v":{"$error":"#REF!"}},{"$f":"#REF!","v":{"$error":"#REF!"}},{"$f":"#REF!","v":{"$error":"#REF!"}},{"$f":"#REF!","v":{"$error":"#REF!"}},{"$f":"#REF!","v":{"$error":"#REF!"}}]
[{"$f":"#REF!","v":{"$error":"#REF!"}},{"$f":"IF(#REF!=\"\",\"\",#REF!)","v":{"$error":"#REF!"}},{"$f":"IF(#REF!=\"\",\"\",#REF!)","v":{"$error":"#REF!"}},{"$f":"IF(#REF!=\"\",\"\",#REF!)","v":{"$error":"#REF!"}},{"$f":"IF(#REF!=\"\",\"\",#REF!)","v":{"$error":"#REF!"}},{"$f":"IF(#REF!=\"\",\"\",#REF!)","v":{"$error":"#REF!"}},{"$f":"IF(#REF!=\"\",\"\",#REF!)","v":{"$error":"#REF!"}},{"$f":"IF(#REF!=\"\",\"\",#REF!)","v":{"$error":"#REF!"}},{"$f":"IF(#REF!=\"\",\"\",#REF!)","v":{"$error":"#REF!"}},{"$f":"IF(#REF!=\"\",\"\",#REF!)","v":{"$error":"#REF!"}},{"$f":"IF(#REF!=\"\",\"\",#REF!)","v":{"$error":"#REF!"}},{"$f":"IF(#REF!=\"\",\"\",#REF!)","v":{"$error":"#REF!"}},{"$f":"IF(#REF!=\"\",\"\",#REF!)","v":{"$error":"#REF!"}},{"$f":"IF(#REF!=\"\",\"\",#REF!)","v":{"$error":"#REF!"}},{"$f":"IF(#REF!=\"\",\"\",#REF!)","v":{"$error":"#REF!"}},{"$f":"IF(#REF!=\"\",\"\",#REF!)","v":{"$error":"#REF!"}},{"$f":"IF(#REF!=\"\",\"\",#REF!)","v":{"$error":"#REF!"}},{"$f":"IF(#REF!=\"\",\"\",#REF!)","v":{"$error":"#REF!"}},{"$f":"IF(#REF!=\"\",\"\",#REF!)","v":{"$error":"#REF!"}},{"$f":"IF(#REF!=\"\",\"\",#REF!)","v":{"$error":"#REF!"}}]
[{"$f":"#REF!","v":{"$error":"#REF!"}},{"$f":"#REF!","v":{"$error":"#REF!"}},{"$f":"#REF!","v":{"$error":"#REF!"}},{"$f":"#REF!","v":{"$error":"#REF!"}},{"$f":"#REF!","v":{"$error":"#REF!"}},{"$f":"#REF!","v":{"$error":"#REF!"}},{"$f":"#REF!","v":{"$error":"#REF!"}},{"$f":"#REF!","v":{"$error":"#REF!"}},{"$f":"#REF!","v":{"$error":"#REF!"}},{"$f":"#REF!","v":{"$error":"#REF!"}},{"$f":"#REF!","v":{"$error":"#REF!"}},{"$f":"#REF!","v":{"$error":"#REF!"}},{"$f":"#REF!","v":{"$error":"#REF!"}},{"$f":"#REF!","v":{"$error":"#REF!"}},{"$f":"#REF!","v":{"$error":"#REF!"}},{"$f":"#REF!","v":{"$error":"#REF!"}}]
[{"$f":"#REF!","v":{"$error":"#REF!"}},{"$f":"#REF!","v":{"$error":"#REF!"}},{"$f":"#REF!","v":{"$error":"#REF!"}},{"$f":"#REF!","v":{"$error":"#REF!"}},{"$f":"#REF!","v":{"$error":"#REF!"}},{"$f":"IF(#REF!=\"\",\"\",#REF!)","v":{"$error":"#REF!"}},{"$f":"#REF!","v":{"$error":"#REF!"}},{"$f":"#REF!","v":{"$error":"#REF!"}},{"$f":"#REF!","v":{"$error":"#REF!"}},{"$f":"#REF!","v":{"$error":"#REF!"}},{"$f":"#REF!","v":{"$error":"#REF!"}},{"$f":"#REF!","v":{"$error":"#REF!"}},{"$f":"#REF!","v":{"$error":"#REF!"}},{"$f":"#REF!","v":{"$error":"#REF!"}},{"$f":"IF(#REF!=\"\",\"\",#REF!)","v":{"$error":"#REF!"}},{"$f":"IF(#REF!=\"\",\"\",#REF!)","v":{"$error":"#REF!"}}]

{"sheet":"All Result","index":4,"n_rows":489,"n_cols":22,"rows_kept":489,"cut":false,"hidden":false,"merged":[]}
["Toxicant:","Nickel"]
["Medium:","Freshwater"]
[]
[{"$f":"'[1]FW nonmetal plant'!C2","v":"Category"},{"$f":"'[1]FW nonmetal plant'!C3","v":"Paper and data unique identifier(eg. 1-1,10-150)"},{"$f":"'[1]FW nonmetal plant'!C70","v":"Total score"},{"$f":"'[1]FW nonmetal plant'!C72","v":"Quality Score"},"Comment ",{"$f":"'[1]FW nonmetal plant'!G3","v":"Species (Scientific name)"},{"$f":"'[1]FW nonmetal plant'!G4","v":"Lifestage"},{"$f":"'[1]FW nonmetal plant'!G5","v":"Exposure duration"},{"$f":"'[1]FW nonmetal plant'!G6","v":"Measure of toxicity"},{"$f":"'[1]FW nonmetal plant'!G7","v":"Toxicity endpoint"},{"$f":"'[1]FW nonmetal plant'!G8","v":"Toxicity value"},{"$f":"'[1]FW nonmetal plant'!J2","v":"Taxonomic group"},{"$f":"'[1]FW nonmetal plant'!J3","v":"Phylum"},{"$f":"'[1]FW nonmetal plant'!J4","v":"Class"},{"$f":"'[1]FW nonmetal plant'!J5","v":"Media"},{"$f":"'[1]FW nonmetal plant'!J6","v":"Temperature "},{"$f":"'[1]FW nonmetal plant'!J7","v":"Acute Or Chronic "},{"$f":"'[1]FW nonmetal plant'!J8","v":"PH"},{"$f":"'FW metal plant'!J9","v":"Salinity/Conductivity"},{"$f":"'FW metal plant'!C4","v":"Citation"},{"$f":"'FW metal plant'!G2","v":"Citation No."}]
["Freshwater/metal/plant","152-1",40,0.41237113402061853,"The highest possible grade for this datum is acceptable.","mixed phytoplankton community","N.A.","5 d","NOEC","Biomass (Chl a)","NR","phytoplankton community","N.A.","N.A.","N.A.","N.A.","Chronic",8.15,"N.A.","Chakraborty, P., Babu, P. V. R., Acharyya, T. and Bandyopadhyay, D. (2010). Stress and toxicity of biologically important transition metals (Co, Ni, Cu and Zn) on phytoplankton in a tropical freshwater system: An investigation with pigment analysis by HPLC. Chemosphere 80, 548-553.","152"]
["Freshwater/metal/plant","152-2",40,0.41237113402061853,"The highest possible grade for this datum is acceptable.","mixed phytoplankton community","N.A.","5 d","N.A.","Biomass green algae (lutein)","NR","phytoplankton community","N.A.","N.A.","N.A.","N.A.","Chronic",8.15,"N.A.","Chakraborty, P., Babu, P. V. R., Acharyya, T. and Bandyopadhyay, D. (2010). Stress and toxicity of biologically important transition metals (Co, Ni, Cu and Zn) on phytoplankton in a tropical freshwater system: An investigation with pigment analysis by HPLC. Chemosphere 80, 548-553.","152"]
["Freshwater/metal/plant","152-3",40,0.41237113402061853,"The highest possible grade for this datum is acceptable.","mixed phytoplankton community","N.A.","5 d","N.A.","Biomass cyanobacteria (zeaxanthin)","NR","phytoplankton community","N.A.","N.A.","N.A.","N.A.","Chronic",8.15,"N.A.","Chakraborty, P., Babu, P. V. R., Acharyya, T. and Bandyopadhyay, D. (2010). Stress and toxicity of biologically important transition metals (Co, Ni, Cu and Zn) on phytoplankton in a tropical freshwater system: An investigation with pigment analysis by HPLC. Chemosphere 80, 548-553.","152"]
["Freshwater/metal/non- plant","13-2",70,0.67,"The highest possible grade for this datum is acceptable.","Ceriodaphnia dubia","Neonate (<1 d)","7 d","NOEC","Reproduction (fecundity)",">7.5 and <15","Microinvertebrate - microcrustacean","Arthropoda","Branchiopoda","Freshwater",25,"Chronic",8.5,"N.A.","Kszos, L.A., Stewart, A.J. and Taylor, P.A. (1992) An evaluation of nickel toxicity to Ceriodaphnia dubia and Daphnia magna in a contaminated stream and in laboratory tests. Environmental Toxicology and Chemistry 11:1001–1012","13"]
["Freshwater/metal/non- plant","171-10",78,0.78,"","Daphnia longispina","<48h old neonate","21 d","LC50","Survival",">118","Microinvertebrate","Arthropoda","Branchiopoda","Freshwater","20°C","Chronic",7.18,"N.A.","Deleebeeck, N.M. E, Muyssen, B.T.A, De Laender, F, Janssen, C.R., De Schamphelaere, K.A.C (2007). Comparison of nickel toxicity to cladocerans in soft versus hard surface waters, Aquatic Toxicology 84: 223-235.","171"]
["Freshwater/metal/non- plant","13-5",47,0.47,"DO NO USE - The highest possible grade for this datum is acceptable.","Pimephales promelas","larvae","7 d","NOEC","Survival","=>16 mg/L","Fish","Chordata","Actinopterygii","Freshwater",25,"Chronic",8.1,"N.A.","Kszos, L.A., Stewart, A.J. and Taylor, P.A. (1992) An evaluation of nickel toxicity to Ceriodaphnia dubia and Daphnia magna in a contaminated stream and in laboratory tests. Environmental Toxicology and Chemistry 11:1001–1012","13"]
["Freshwater/metal/plant","154-44",81,0.83505154639175261,"","Chlorella sp.","exponentially growing cells","72 h","NOEC","Growth rate","<97.7","Microalga","Chlorophyta","Chlorophyceae","Freshwater","25°C","Chronic","N.R.","N.A.","Deleebeeck, N.M.E. De Laender, F., Chepurnov, V.A., Vyerman, W., Janseen, C.R. De Schamphelaere, K.A.C. (2009). A single bioavailability model can accurately predict Ni toxicity to green microalgae in soft and hard surface waters. Water Research 43:1935-1947.","154"]
["Freshwater/metal/non- plant","167-47",84,0.84,"","Daphnia magna","<24h old neonate","21 d","NOEC","Reproduction","<97.5","Microinvertebrate","Arthropoda","Branchiopoda","Freshwater","NR","Chronic",7.71,"N.A.","Deleebeeck, N.M.E., de Schamphelaere, K.A.C. and Janssen, C.R. (2008). A Novel method for predicting chronic bioavailability and toxicity to Daphnia magna in artificial and natural waters. Environemtnal Toxicology and Chemistry 27: 2097-2107.","167","4 µg Ni/L in base water"]
["Freshwater/metal/plant","169-84",88,0.90721649484536082,"","Pseudokirchneriella subcapitata","exponentially growing cells","72 h","NOEC","Growth rate","<93.8","Microalga","Chlorophyta","Chlorophyceae","Freshwater","25°C","Chronic",7.78,"N.A.","Deleebeeck, N.M.E., de Schamphelaere, K.A.C and Janssen, C.R. (2009). Effects of Mg2+ and H+ on the toxicity of Ni2+ to the unicellular green alga Pseudokirchneriella subcapitata: Model development and validation with surface waters. Science of the Total Environment 407:1901-1914.","169"]
["Freshwater/metal/plant","169-54",85,0.87628865979381443,"","Pseudokirchneriella subcapitata","exponentially growing cells","72 h","NOEC","Growth rate","<89.4","Microalga","Chlorophyta","Chlorophyceae","Freshwater","25°C","Chronic",7.52,"N.A.","Deleebeeck, N.M.E., de Schamphelaere, K.A.C and Janssen, C.R. (2009). Effects of Mg2+ and H+ on the toxicity of Ni2+ to the unicellular green alga Pseudokirchneriella subcapitata: Model development and validation with surface waters. Science of the Total Environment 407:1901-1914.","169"]
["Freshwater/metal/non- plant","155-1",62,0.62,"The highest possible grade for this datum is acceptable. States that all Control animals showed normal development, but no test acceptability criteria","Radix quadrisi","embryo","14 d","NOEC","Hatching","<88","Gastropod","Mollusca","Gastropoda","Freshwater","25°C","Chronic","7.5 (7.2-7.8)","N.A.","Factor, C.J.B. and de Chavez, E.R.C. (2012). Toxicity of arsenic, aluminium, chromium and nickel to the embryos of the freshwater snail, Radix quadrasi von Moellendorf 1898. Phillipine Journal of Science 141 (2): 207-216.","155"]
["Freshwater/metal/non- plant","155-2",62,0.62,"The highest possible grade for this datum is acceptable.","Radix quadrisi","embryo","14 d","NOEC","shell thinning","<88","Gastropod","Mollusca","Gastropoda","Freshwater","25°C","Chronic","7.5 (7.2-7.8)","N.A.","Factor, C.J.B. and de Chavez, E.R.C. (2012). Toxicity of arsenic, aluminium, chromium and nickel to the embryos of the freshwater snail, Radix quadrasi von Moellendorf 1898. Phillipine Journal of Science 141 (2): 207-216.","155"]
["Freshwater/metal/non- plant","155-3",62,0.62,"The highest possible grade for this datum is acceptable.","Radix quadrisi","embryo","14 d","NOEC","growth","<88","Gastropod","Mollusca","Gastropoda","Freshwater","25°C","Chronic","7.5 (7.2-7.8)","N.A.","Factor, C.J.B. and de Chavez, E.R.C. (2012). Toxicity of arsenic, aluminium, chromium and nickel to the embryos of the freshwater snail, Radix quadrasi von Moellendorf 1898. Phillipine Journal of Science 141 (2): 207-216.","155"]
["Freshwater/metal/non- plant","155-4",62,0.62,"The highest possible grade for this datum is acceptable.","Radix quadrisi","embryo","14 d","NOEC","edema","<88","Gastropod","Mollusca","Gastropoda","Freshwater","25°C","Chronic","7.5 (7.2-7.8)","N.A.","Factor, C.J.B. and de Chavez, E.R.C. (2012). Toxicity of arsenic, aluminium, chromium and nickel to the embryos of the freshwater snail, Radix quadrasi von Moellendorf 1898. Phillipine Journal of Science 141 (2): 207-216.","155"]
["Freshwater/metal/plant","154-19",81,0.83505154639175261,"","Coelastrum microporum","exponentially growing cells","72 h","NOEC","Growth rate","<84","Microalga","Chlorophyta","Chlorophyceae","Freshwater","25°C","Chronic","N.R.","N.A.","Deleebeeck, N.M.E. De Laender, F., Chepurnov, V.A., Vyerman, W., Janseen, C.R. De Schamphelaere, K.A.C. (2009). A single bioavailability model can accurately predict Ni toxicity to green microalgae in soft and hard surface waters. Water Research 43:1935-1947.","154"]
["Freshwater/metal/non- plant","7-3",71,0.71,"Data does not specify standard method or test acceptability criteria. Exposure duration unclear (up to 8 month)","Clistoronia magnifica","larvae","8 months","NOEL","Life cycle (first generation)","<66","Macroinvertebrate","Arthropoda","Trichoptera","Freshwater",15,"Chronic","6.8–7.4","N.A.","Nebeker, A.V., Savonen, C., Baker, R.J. and McCrady, J.K. (1984) Effects of copper, nickel and zinc on the life cycle of the caddisfly Clistoronia magnifica (Limnephilidae). Environmental Toxicology and Chemsistry, 3:645–649.","7"]
["Freshwater/metal/plant","169-79",88,0.90721649484536082,"","Pseudokirchneriella subcapitata","exponentially growing cells","72 h","NOEC","Growth rate","<65","Microalga","Chlorophyta","Chlorophyceae","Freshwater","25°C","Chronic","7.99/8.01","N.A.","Deleebeeck, N.M.E., de Schamphelaere, K.A.C and Janssen, C.R. (2009). Effects of Mg2+ and H+ on the toxicity of Ni2+ to the unicellular green alga Pseudokirchneriella subcapitata: Model development and validation with surface waters. Science of the Total Environment 407:1901-1914.","169"]
["Freshwater/metal/non- plant","167-45",84,0.84,"","Daphnia magna","<24h old neonate","21 d","NOEC","Reproduction","<60.1","Microinvertebrate","Arthropoda","Branchiopoda","Freshwater","NR","Chronic",7.09,"N.A.","Deleebeeck, N.M.E., de Schamphelaere, K.A.C. and Janssen, C.R. (2008). A Novel method for predicting chronic bioavailability and toxicity to Daphnia magna in artificial and natural waters. Environemtnal Toxicology and Chemistry 27: 2097-2107.","167"," 2.0 µg/L Ni in base water"]
["Freshwater/metal/plant","154-46",81,0.83505154639175261,"","Desmodesmus spinosus","exponentially growing cells","72 h","NOEC","Growth rate","<6.9","Microalga","Chlorophyta","Chlorophyceae","Freshwater","25°C","Chronic","N.R.","N.A.","Deleebeeck, N.M.E. De Laender, F., Chepurnov, V.A., Vyerman, W., Janseen, C.R. De Schamphelaere, K.A.C. (2009). A single bioavailability model can accurately predict Ni toxicity to green microalgae in soft and hard surface waters. Water Research 43:1935-1947.","154"]
["Freshwater/metal/plant","154-38",81,0.83505154639175261,"","Scenedesmus accuminatus","exponentially growing cells","72 h","NOEC","Growth rate","<6.2","Microalga","Chlorophyta","Chlorophyceae","Freshwater","25°C","Chronic","N.R.","N.A.","Deleebeeck, N.M.E. De Laender, F., Chepurnov, V.A., Vyerman, W., Janseen, C.R. De Schamphelaere, K.A.C. (2009). A single bioavailability model can accurately predict Ni toxicity to green microalgae in soft and hard surface waters. Water Research 43:1935-1947.","154"]
["Freshwater/metal/non- plant","167-39",81,0.81,"","Daphnia magna","<24h old neonate","21 d","NOEC","Reproduction","<6.13","Microinvertebrate","Arthropoda","Branchiopoda","Freshwater","NR","Chronic",6.97,"N.A.","Deleebeeck, N.M.E., de Schamphelaere, K.A.C. and Janssen, C.R. (2008). A Novel method for predicting chronic bioavailability and toxicity to Daphnia magna in artificial and natural waters. Environemtnal Toxicology and Chemistry 27: 2097-2107.","167"]
["Freshwater/metal/non- plant","162-30",94,0.94,"","Chironomus tentans","second instar larvae","10 d","NOEC","Growth (AFDW)","<558.4","Macroinvertebrate","Arthropoda","Insecta","Freshwater","25 ± 2","Chronic",7.3,"N.A.","Schlekat, C. E., Genderen, E. V., De Schamphelaerem K. A. C., Antunes, P. M. C., Rogevich, E. C., and Stubblefield, W. A. (2010) Cross-species extrpolation of chronic nickel Biotic Ligand Models. Science of the Total Environment 408, 6148-6157.","162"]
["Freshwater/metal/plant","169-68",85,0.87628865979381443,"","Pseudokirchneriella subcapitata","exponentially growing cells","72 h","NOEC","Growth rate","<55.7","Microalga","Chlorophyta","Chlorophyceae","Freshwater","25°C","Chronic",7.2,"N.A.","Deleebeeck, N.M.E., de Schamphelaere, K.A.C and Janssen, C.R. (2009). Effects of Mg2+ and H+ on the toxicity of Ni2+ to the unicellular green alga Pseudokirchneriella subcapitata: Model development and validation with surface waters. Science of the Total Environment 407:1901-1914.","169"]
["Freshwater/metal/non- plant","12-2",74,0.74,"NOECs determined by data in Table 3 and text (p<0.05)","Clistoronia magnifica","larvae","19 weeks","NOEC","Survival","<55","Macroinvertebrate","Arthropoda","Trichoptera","Freshwater","10–13","Chronic",5.5,"N.A.","van Frankenhuyzen K. and Geen G.H. (1987) Effects of low pH and nickel on growth and survival of the shredding caddisfly Clistoronia magnifica (Limnephilidae) Canadian Journal of Zoology 65, 1729–1732","12"]
["Freshwater/metal/non- plant","12-3",74,0.74,"NOECs determined by data in Table 3 and text (p<0.05)","Clistoronia magnifica","larvae","19 weeks","NOEC","Survival","<55","Macroinvertebrate","Arthropoda","Trichoptera","Freshwater","10–13","Chronic",6.2,"N.A.","van Frankenhuyzen K. and Geen G.H. (1987) Effects of low pH and nickel on growth and survival of the shredding caddisfly Clistoronia magnifica (Limnephilidae) Canadian Journal of Zoology 65, 1729–1732","12"]
["Freshwater/metal/plant","169-60",85,0.87628865979381443,"","Pseudokirchneriella subcapitata","exponentially growing cells","72 h","NOEC","Growth rate","<52.3","Microalga","Chlorophyta","Chlorophyceae","Freshwater","25°C","Chronic",6.01,"N.A.","Deleebeeck, N.M.E., de Schamphelaere, K.A.C and Janssen, C.R. (2009). Effects of Mg2+ and H+ on the toxicity of Ni2+ to the unicellular green alga Pseudokirchneriella subcapitata: Model development and validation with surface waters. Science of the Total Environment 407:1901-1914.","169"]
["Freshwater/metal/plant","169-80",85,0.87628865979381443,"","Pseudokirchneriella subcapitata","exponentially growing cells","72 h","NOEC","Growth rate","<52.1","Microalga","Chlorophyta","Chlorophyceae","Freshwater","25°C","Chronic",7.7,"N.A.","Deleebeeck, N.M.E., de Schamphelaere, K.A.C and Janssen, C.R. (2009). Effects of Mg2+ and H+ on the toxicity of Ni2+ to the unicellular green alga Pseudokirchneriella subcapitata: Model development and validation with surface waters. Science of the Total Environment 407:1901-1914.","169"]
["Freshwater/metal/non- plant","167-34",81,0.81,"","Daphnia magna","<24h old neonate","21 d","NOEC","Reproduction","<46","Microinvertebrate","Arthropoda","Branchiopoda","Freshwater","NR","Chronic",6.8,"N.A.","Deleebeeck, N.M.E., de Schamphelaere, K.A.C. and Janssen, C.R. (2008). A Novel method for predicting chronic bioavailability and toxicity to Daphnia magna in artificial and natural waters. Environemtnal Toxicology and Chemistry 27: 2097-2107.","167"]
["Freshwater/metal/plant","154-28",81,0.83505154639175261,"","Spermatozopsis exultans","exponentially growing cells","72 h","NOEC","Growth rate","<41.9","Microalga","Chlorophyta","Chlorophyceae","Freshwater","25°C","Chronic","N.R.","N.A.","Deleebeeck, N.M.E. De Laender, F., Chepurnov, V.A., Vyerman, W., Janseen, C.R. De Schamphelaere, K.A.C. (2009). A single bioavailability model can accurately predict Ni toxicity to green microalgae in soft and hard surface waters. Water Research 43:1935-1947.","154"]
["Freshwater/metal/plant","154-24",81,0.83505154639175261,"","Coelastrum microporum","exponentially growing cells","72 h","NOEC","Growth rate","<40.2","Microalga","Chlorophyta","Chlorophyceae","Freshwater","25°C","Chronic","N.R.","N.A.","Deleebeeck, N.M.E. De Laender, F., Chepurnov, V.A., Vyerman, W., Janseen, C.R. De Schamphelaere, K.A.C. (2009). A single bioavailability model can accurately predict Ni toxicity to green microalgae in soft and hard surface waters. Water Research 43:1935-1947.","154"]
["Freshwater/metal/non- plant","13-4",70,0.67,"The highest possible grade for this datum is acceptable.","Daphnia magna","Neonate (<1 d)","21 d","NOEC","Reproduction","<40","Microinvertebrate - microcrustacean","Arthropoda","Branchiopoda","Freshwater",21,"Chronic",7.7,"N.A.","Kszos, L.A., Stewart, A.J. and Taylor, P.A. (1992) An evaluation of nickel toxicity to Ceriodaphnia dubia and Daphnia magna in a contaminated stream and in laboratory tests. Environmental Toxicology and Chemistry 11:1001–1012","13"]
["Freshwater/metal/non- plant","15-1",76,0.76,"Multigenerational study : this data is for first generation (endpoint 5th brood)","Daphnia magna","Neonate (<1 d)","5th brood (in control)","NOEC","Reproduction","<4","Macroinvertebrate","Arthropoda","Branchiopoda","Freshwater",15,"Chronic",8,"N.A.","Pereira, C.M.S., Everaert, G., Blust, R. and De Schamphelaere K.A.C. (2018) Multigenerational effects of nickel on Daphnia magna depend on temperature and the magnitude of the effect in the first generation. Environmental Toxicology and Chemistry 37:1877–1888",15]
["Freshwater/metal/plant","169-72",85,0.87628865979381443,"","Pseudokirchneriella subcapitata","exponentially growing cells","72 h","NOEC","Growth rate","<38.1","Microalga","Chlorophyta","Chlorophyceae","Freshwater","25°C","Chronic",7.88,"N.A.","Deleebeeck, N.M.E., de Schamphelaere, K.A.C and Janssen, C.R. (2009). Effects of Mg2+ and H+ on the toxicity of Ni2+ to the unicellular green alga Pseudokirchneriella subcapitata: Model development and validation with surface waters. Science of the Total Environment 407:1901-1914.","169"]
["Freshwater/metal/plant","162-55",93,0.95876288659793818,"","Lemna minor","3-frond colonies","7 d","NOEC","growth rate (root length)","<35","Macrophyte","Tracheophyta","Liliopsida","Freshwater","25 ± 1","Chronic",7.6,"N.A.","Schlekat, C. E., Genderen, E. V., De Schamphelaerem K. A. C., Antunes, P. M. C., Rogevich, E. C., and Stubblefield, W. A. (2010) Cross-species extrpolation of chronic nickel Biotic Ligand Models. Science of the Total Environment 408, 6148-6157.","162"]
["Freshwater/metal/non- plant","8-2",83,0.83,"Data does not specify standard method or test acceptability criteria (assumed good). Replication also unclear","Salmo gairdneri","fertilised eggs","85 d","NOEL","Growth (fork length)","<35","Fish","Chordata","Actinopterygii","Freshwater",12,"Chronic",7,"N.A.","Nebeker, A.V., Savonen, C. and Stevens, D.G. (1985) Sensitivity of rainbow trout early life stages to nickel chloride. Environmental Toxicology and Chemsistry, 4:233–239.","8"]
["Freshwater/metal/non- plant","8-3",83,0.83,"Data does not specify standard method or test acceptability criteria (assumed good). Replication also unclear","Salmo gairdneri","fertilised eggs","85 d","NOEL","Growth (wet weight)","<35","Fish","Chordata","Actinopterygii","Freshwater",12,"Chronic",7,"N.A.","Nebeker, A.V., Savonen, C. and Stevens, D.G. (1985) Sensitivity of rainbow trout early life stages to nickel chloride. Environmental Toxicology and Chemsistry, 4:233–239.","8"]
["Freshwater/metal/plant","169-51",85,0.87628865979381443,"","Pseudokirchneriella subcapitata","exponentially growing cells","72 h","NOEC","Growth rate","<31.5","Microalga","Chlorophyta","Chlorophyceae","Freshwater","25°C","Chronic",7.48,"N.A.","Deleebeeck, N.M.E., de Schamphelaere, K.A.C and Janssen, C.R. (2009). Effects of Mg2+ and H+ on the toxicity of Ni2+ to the unicellular green alga Pseudokirchneriella subcapitata: Model development and validation with surface waters. Science of the Total Environment 407:1901-1914.","169"]
["Freshwater/metal/plant","154-20",81,0.83505154639175261,"","Coelastrum microporum","exponentially growing cells","72 h","NOEC","Growth rate","<31.2","Microalga","Chlorophyta","Chlorophyceae","Freshwater","25°C","Chronic","N.R.","N.A.","Deleebeeck, N.M.E. De Laender, F., Chepurnov, V.A., Vyerman, W., Janseen, C.R. De Schamphelaere, K.A.C. (2009). A single bioavailability model can accurately predict Ni toxicity to green microalgae in soft and hard surface waters. Water Research 43:1935-1947.","154"]
["Freshwater/metal/non- plant","174-1",87,0.87,"","Ceriodaphnia dubia","<24h old neonate","7 d","NOEC","Survival","<3.8","Microinvertebrate","Arthropoda","Branchiopoda","Freshwater","25-26","Chronic",7.66,"N.A.","Keithly, J. Brooker, J.A., DeForest, D.K., Wu, B.K. and Brix, K.V. (2004). Acute and chronic toxic ity of nickel to a cladoceran (Ceriodaphnia dubia) and an amphipod (Hyallela azteca). Environmental Toxicology and Chemistry 23: 691-696.","174"]
["Freshwater/metal/non- plant","174-3",87,0.87,"","Ceriodaphnia dubia","<24h old neonate","7 d","LC20","Survival","<3.8","Microinvertebrate","Arthropoda","Branchiopoda","Freshwater","25-26","Chronic",7.66,"N.A.","Keithly, J. Brooker, J.A., DeForest, D.K., Wu, B.K. and Brix, K.V. (2004). Acute and chronic toxic ity of nickel to a cladoceran (Ceriodaphnia dubia) and an amphipod (Hyallela azteca). Environmental Toxicology and Chemistry 23: 691-696.","174"]
["Freshwater/metal/non- plant","174-4",82,0.82,"","Ceriodaphnia dubia","<24h old neonate","7 d","NOEC","Reproduction","<3.8","Microinvertebrate","Arthropoda","Branchiopoda","Freshwater","25-26","Chronic",7.66,"N.A.","Keithly, J. Brooker, J.A., DeForest, D.K., Wu, B.K. and Brix, K.V. (2004). Acute and chronic toxic ity of nickel to a cladoceran (Ceriodaphnia dubia) and an amphipod (Hyallela azteca). Environmental Toxicology and Chemistry 23: 691-696.","174"]
["Freshwater/metal/non- plant","174-6",82,0.82,"","Ceriodaphnia dubia","<24h old neonate","7 d","LC20","Reproduction","<3.8","Microinvertebrate","Arthropoda","Branchiopoda","Freshwater","25-26","Chronic",7.66,"N.A.","Keithly, J. Brooker, J.A., DeForest, D.K., Wu, B.K. and Brix, K.V. (2004). Acute and chronic toxic ity of nickel to a cladoceran (Ceriodaphnia dubia) and an amphipod (Hyallela azteca). Environmental Toxicology and Chemistry 23: 691-696.","174"]
["Freshwater/metal/non- plant","162-2",94,0.94,"","Lymnaea stagnalis","<24h old","30 d","NOEC","growth","<3","Macroinvertebrate","Mollusca","Gastropoda","Freshwater","25 ± 2","Chronic",8,"N.A.","Schlekat, C. E., Genderen, E. V., De Schamphelaerem K. A. C., Antunes, P. M. C., Rogevich, E. C., and Stubblefield, W. A. (2010) Cross-species extrpolation of chronic nickel Biotic Ligand Models. Science of the Total Environment 408, 6148-6157.","162"]
["Freshwater/metal/non- plant","167-32",81,0.81,"","Daphnia magna","<24h old neonate","21 d","NOEC","Reproduction","<28.5","Microinvertebrate","Arthropoda","Branchiopoda","Freshwater","NR","Chronic",6.81,"N.A.","Deleebeeck, N.M.E., de Schamphelaere, K.A.C. and Janssen, C.R. (2008). A Novel method for predicting chronic bioavailability and toxicity to Daphnia magna in artificial and natural waters. Environemtnal Toxicology and Chemistry 27: 2097-2107.","167"]
["Freshwater/metal/plant","169-58",85,0.87628865979381443,"","Pseudokirchneriella subcapitata","exponentially growing cells","72 h","NOEC","Growth rate","<278","Microalga","Chlorophyta","Chlorophyceae","Freshwater","25°C","Chronic",7.54,"N.A.","Deleebeeck, N.M.E., de Schamphelaere, K.A.C and Janssen, C.R. (2009). Effects of Mg2+ and H+ on the toxicity of Ni2+ to the unicellular green alga Pseudokirchneriella subcapitata: Model development and validation with surface waters. Science of the Total Environment 407:1901-1914.","169"]
["Freshwater/metal/non- plant","167-33",81,0.81,"","Daphnia magna","<24h old neonate","21 d","NOEC","Reproduction","<27.3","Microinvertebrate","Arthropoda","Branchiopoda","Freshwater","NR","Chronic",6.82,"N.A.","Deleebeeck, N.M.E., de Schamphelaere, K.A.C. and Janssen, C.R. (2008). A Novel method for predicting chronic bioavailability and toxicity to Daphnia magna in artificial and natural waters. Environemtnal Toxicology and Chemistry 27: 2097-2107.","167"]
["Freshwater/metal/plant","162-57",81,0.83505154639175261,"","Lemna minor","3-frond colonies","7 d","NOEC","growth rate (root length)","<25","Macrophyte","Tracheophyta","Liliopsida","Freshwater","25 ± 1","Chronic",8,"N.A.","Schlekat, C. E., Genderen, E. V., De Schamphelaerem K. A. C., Antunes, P. M. C., Rogevich, E. C., and Stubblefield, W. A. (2010) Cross-species extrpolation of chronic nickel Biotic Ligand Models. Science of the Total Environment 408, 6148-6157.","162"]
["Freshwater/metal/plant","154-26",81,0.83505154639175261,"","Spermatozopsis exultans","exponentially growing cells","72 h","NOEC","Growth rate","<22.9","Microalga","Chlorophyta","Chlorophyceae","Freshwater","25°C","Chronic","N.R.","N.A.","Deleebeeck, N.M.E. De Laender, F., Chepurnov, V.A., Vyerman, W., Janseen, C.R. De Schamphelaere, K.A.C. (2009). A single bioavailability model can accurately predict Ni toxicity to green microalgae in soft and hard surface waters. Water Research 43:1935-1947.","154"]
["Freshwater/metal/non- plant","167-44",84,0.84,"","Daphnia magna","<24h old neonate","21 d","NOEC","Reproduction","<18.8","Microinvertebrate","Arthropoda","Branchiopoda","Freshwater","NR","Chronic",6.15,"N.A.","Deleebeeck, N.M.E., de Schamphelaere, K.A.C. and Janssen, C.R. (2008). A Novel method for predicting chronic bioavailability and toxicity to Daphnia magna in artificial and natural waters. Environemtnal Toxicology and Chemistry 27: 2097-2107.","167","2.5 µg/L Ni in base water"]
["Freshwater/metal/plant","162-53",93,0.95876288659793818,"","Lemna minor","3-frond colonies","7 d","NOEC","growth rate (root length)","<18","Macrophyte","Tracheophyta","Liliopsida","Freshwater","25 ± 1","Chronic",7.7,"N.A.","Schlekat, C. E., Genderen, E. V., De Schamphelaerem K. A. C., Antunes, P. M. C., Rogevich, E. C., and Stubblefield, W. A. (2010) Cross-species extrpolation of chronic nickel Biotic Ligand Models. Science of the Total Environment 408, 6148-6157.","162"]
["Freshwater/metal/plant","162-51",93,0.95876288659793818,"","Lemna minor","3-frond colonies","7 d","NOEC","growth rate (root length)","<17","Macrophyte","Tracheophyta","Liliopsida","Freshwater","25 ± 1","Chronic",6.9,"N.A.","Schlekat, C. E., Genderen, E. V., De Schamphelaerem K. A. C., Antunes, P. M. C., Rogevich, E. C., and Stubblefield, W. A. (2010) Cross-species extrpolation of chronic nickel Biotic Ligand Models. Science of the Total Environment 408, 6148-6157.","162"]
["Freshwater/metal/plant","169-64",85,0.87628865979381443,"","Pseudokirchneriella subcapitata","exponentially growing cells","72 h","NOEC","Growth rate","<16.6","Microalga","Chlorophyta","Chlorophyceae","Freshwater","25°C","Chronic",7.92,"N.A.","Deleebeeck, N.M.E., de Schamphelaere, K.A.C and Janssen, C.R. (2009). Effects of Mg2+ and H+ on the toxicity of Ni2+ to the unicellular green alga Pseudokirchneriella subcapitata: Model development and validation with surface waters. Science of the Total Environment 407:1901-1914.","169"]
["Freshwater/metal/plant","154-23",81,0.83505154639175261,"","Coelastrum microporum","exponentially growing cells","72 h","NOEC","Growth rate","<140","Microalga","Chlorophyta","Chlorophyceae","Freshwater","25°C","Chronic","N.R.","N.A.","Deleebeeck, N.M.E. De Laender, F., Chepurnov, V.A., Vyerman, W., Janseen, C.R. De Schamphelaere, K.A.C. (2009). A single bioavailability model can accurately predict Ni toxicity to green microalgae in soft and hard surface waters. Water Research 43:1935-1947.","154"]
["Freshwater/metal/non- plant","18-1",67,0.67,"population-based data over 66 days","Daphnia magna","population (adults and juveniles)","66 days","NOEC","Reproduction","<120","Macroinvertebrate","Arthropoda","Branchiopoda","Freshwater",21,"Chronic","7.7-7.9","N.A.","Munzinger, A. (1994) The influence of nickel on population dynamics and on some demographic parameters of Daphnia magna. Hydrobiologia 277:107–120","18"]
["Freshwater/metal/non- plant","167-37",81,0.81,"","Daphnia magna","<24h old neonate","21 d","NOEC","Reproduction","<11.2","Microinvertebrate","Arthropoda","Branchiopoda","Freshwater","NR","Chronic",5.87,"N.A.","Deleebeeck, N.M.E., de Schamphelaere, K.A.C. and Janssen, C.R. (2008). A Novel method for predicting chronic bioavailability and toxicity to Daphnia magna in artificial and natural waters. Environemtnal Toxicology and Chemistry 27: 2097-2107.","167"]
["Freshwater/metal/non- plant","161-2",79,0.79,"","Lymnaea stagnalis","7-8d juvenile",21,"EC20","growth","<1.3","Macroinvertebrate","Mollusca","Gastropoda","Freshwater","25 ± 1","Chronic",7.8,"N.A.","Niyogi, S., Brix, K. V., Grosell, M. (2014) Effects of chronic waterborne nickel exposure on growth, ion homeostasis, acid - base balance, and nickel uptake in the fresh water pulmonate snail, Lymnaea stagnalis, Aquatic Toxicology, 150, 36-44","161"]
["Freshwater/metal/non- plant","151-1",41,0.41,"The highest possible grade for this datum is acceptable.","Aeromonas hydrophila","N.R.","20 h","EC50","growth",13000,"Bacteria","Proteobacteria","Gammaproteobacteria","Freshwater","28°C","Acute ",7,"N.A.","Babich, H. Shopsis, C. Borenfreund. (1986). Cadmium-nickeltoxicity interactions towards a bacterium, filamentous fungi, and a cultured mamallian cell line. Bull. Envion. Contam. Toxicol. 37: 550-557.","151"]
["Freshwater/metal/non- plant","159-1",71,0.71,"The highest possible grade for this datum is acceptable. Control results given (low mortality/effects), but acceptablity criteria not stated.","Danio rerio","embryo","11 d","EC20","Mortality",9520,"Fish","Chordata","Actinopterygii","Freshwater","25.3 ± 0.8","Chronic","7.99 ± 0.14","N.A.","Kienle, C., Kohler, H. R., Filser, J. and Gerhardt, A. (2008). Effects of nickel chloride and oxygen depletion on behaviour and vitality of zebrafish (Danio rerio, Hamilton, 1822) (Pisces, Cypriniformes) embryos and larvae. Environmental Pollution 152, 612-620.","159","Note: this ppears to be repeat publication of above data"]
["Freshwater/metal/non- plant","158-1",75,0.75,"","Danio rerio","embryo","11 d","EC20","Mortality",9500,"Fish","Chordata","Actinopterygii","Freshwater","25.3 ± 0.8","Chronic","7.99 ± 0.14","N.A.","Kienle, C., Kohler, H. R. and Gerhardt, A. (2009). Behavioural and developmental toxicity of chlorpyrifos and nickel chloride to zebrafish (Danio rerio) embryos and larvae. Ecotoxicology and Environmental Safety 72, 1740-1747.","158"]
["Freshwater/metal/plant","160-1",70,0.72164948453608246,"No acceptability criteria stated","Spirodela polyrhiza","turion (dormant front)","14 d","EC50","growth (yield)",4500,"Macrophyte","Tracheophyta","Liliopsida","Freshwater","28 ± 1","Chronic","6.0 ± 0.3","N.A.","Montvydiene, D., and Marciulioniene, D. (2004) Assessment of Toxic Interactions of HeavyMetals in a Multicomponent Mixture Using Lepidium sativum and Spirodela polyrrhiza. Wiley Periodicals, Inc.. 351-358","160"]
["Freshwater/metal/plant","170-1",69,0.71134020618556704,"Note: low quality paper. No acceptability criteria stated or inferred.","Chlorella pyrenoidosa","late log phase growth cells","14 d","NOEC","Growth (absorbance measurement)",4000,"Microalga","Chlorophyta","Chlorophyceae","Freshwater","25 ± 2","Chronic",6.8,"N.A.","Wong, P.K. and Wong, C.K. (1990). Toxicity of nickel and nickel electroplating water to Chlorella pyrenoidosa. Bulletin of Environmental Contamination and Toxicology 45:752-759.","170","Note: low quality paper. No acceptability criteria stated or inferred."]
["Freshwater/metal/non- plant","162-24",94,0.94,"","Chironomus tentans","second instar larvae","10 d","NOEC","Growth (AFDW)",2195.1,"Macroinvertebrate","Arthropoda","Insecta","Freshwater","25 ± 2","Chronic",6.9,"N.A.","Schlekat, C. E., Genderen, E. V., De Schamphelaerem K. A. C., Antunes, P. M. C., Rogevich, E. C., and Stubblefield, W. A. (2010) Cross-species extrpolation of chronic nickel Biotic Ligand Models. Science of the Total Environment 408, 6148-6157.","162"]
["Freshwater/metal/non- plant","2-3",57,0.56999999999999995,"DO NOT USE - statistical analysis is unreliabl","Micropterus salmoides","fertilised eggs","8 days","LC50","Mortality",2020,"Fish","Chordata","Actinopterygii","Freshwater","19–22","Chronic","7.2–7.8","N.A.","Birge W.J., Hudson J.E., Black J.A. and Westerman A.G. (1978) Embryo-larval bioassays on inorganic coal elements and in situ biomonitoring of coal-waste effluents. In: Symp. U.S. Fish Wildl. Serv., Surface Mining Fish Wildl. Needs in U.S., W.VA 97–104.","2"]
["Freshwater/metal/non- plant","168-14",81,0.81,"","Pimephales promelas","swim up fry","17 d","NOEC","mortality",1770,"Fish","Chordata","Actinopterygii","Freshwater","14.5 ± 1","Chronic",7.55,"N.A.","Deleebeeck, N.M.E., de Schamphelaere, K.A.C and Janssen, C.R. (2007). A bioavailability model predicting the toxicity of nickel to rainbow trout (Oncorhynchus mykiss) and fathead minnow (Pimephales  promelas) in synthetic and natural waters. Ecotoxicolgy and Environmental Safety 67:1-13.","168","17-d LC50 values also available"]
["Freshwater/metal/non- plant","4-7",78,0.78,"Check if 48-h rotifer is chronic endpoint (assumed yes due to reproductive endpoint (rapid life cycle)). Good paper for modelling; also quotes EC10 as Ni2+ activity, EC20 , EC50 but discrepenciies with Mg concentrations in media","Brachionus calyciflorus","Neonates (<2 h)","48 h","EC10","Reproduction",1576,"Microinvertebrate","Rotifera","Monogononta","Freshwater",20,"Chronic",8.1199999999999992,"N.A.","Nys, C., Janssen, C/R., Van Sprang, P. and De Schamphelaere, K.A.C. (2016) The effect of pH on chronic aquatic nickel toxicity is dependent on the pH itself: Extending the chronic nickel bioavailability models. Environmental Toxicology and Chemistry, 35:1097–1106.","4"]
["Freshwater/metal/non- plant","162-36",82,0.82,"","Brachionus calcyflorus","NR","48 h","NOEC","Population growth rate",1572.8,"Microinvertebrate","Rotifera","Monogononta","Freshwater","25 ± 2","Chronic",8,"N.A.","Schlekat, C. E., Genderen, E. V., De Schamphelaerem K. A. C., Antunes, P. M. C., Rogevich, E. C., and Stubblefield, W. A. (2010) Cross-species extrpolation of chronic nickel Biotic Ligand Models. Science of the Total Environment 408, 6148-6157.","162"]
["Freshwater/metal/non- plant","162-44",82,0.82,"","Brachionus calcyflorus","N.R.","48 h","EC20","Population growth rate",1497.6,"Microinvertebrate","Rotifera","Monogononta","Freshwater","25 ± 2","Chronic",7,"N.A.","Schlekat, C. E., Genderen, E. V., De Schamphelaerem K. A. C., Antunes, P. M. C., Rogevich, E. C., and Stubblefield, W. A. (2010) Cross-species extrpolation of chronic nickel Biotic Ligand Models. Science of the Total Environment 408, 6148-6157.","162"]
["Freshwater/metal/non- plant","168-13",79,0.79,"","Pimephales promelas","swim up fry","17 d","NOEC","mortality",1420,"Fish","Chordata","Actinopterygii","Freshwater","14.1 ± 0.19","Chronic",7.52,"N.A.","Deleebeeck, N.M.E., de Schamphelaere, K.A.C and Janssen, C.R. (2007). A bioavailability model predicting the toxicity of nickel to rainbow trout (Oncorhynchus mykiss) and fathead minnow (Pimephales  promelas) in synthetic and natural waters. Ecotoxicolgy and Environmental Safety 67:1-13.","168","17-d LC50 values also available"]
["Freshwater/metal/non- plant","168-1",79,0.79,"","Pimephales promelas","swim up fry","17 d","NOEC","mortality",1390,"Fish","Chordata","Actinopterygii","Freshwater","13.9 ± 0.2","Chronic",5.48,"N.A.","Deleebeeck, N.M.E., de Schamphelaere, K.A.C and Janssen, C.R. (2007). A bioavailability model predicting the toxicity of nickel to rainbow trout (Oncorhynchus mykiss) and fathead minnow (Pimephales  promelas) in synthetic and natural waters. Ecotoxicolgy and Environmental Safety 67:1-13.","168","17-d LC50 values also available"]
["Freshwater/metal/non- plant","162-43",82,0.82,"","Brachionus calcyflorus","N.R.","48 h","EC10","Population growth rate",1379.3,"Microinvertebrate","Rotifera","Monogononta","Freshwater","25 ± 2","Chronic",7,"N.A.","Schlekat, C. E., Genderen, E. V., De Schamphelaerem K. A. C., Antunes, P. M. C., Rogevich, E. C., and Stubblefield, W. A. (2010) Cross-species extrpolation of chronic nickel Biotic Ligand Models. Science of the Total Environment 408, 6148-6157.","162"]
["Freshwater/metal/non- plant","11-1",56,0.56000000000000005,"Data does not specify standard method or test acceptability criteria. Note that LC10 value was less than lowest concentration tested (5 mg/L)","Rhinella arenarum","embryo","7 d","LC10","Survival",1270,"Amphibian","Chordata","Amphibia","Freshwater",20,"Chronic","7–8","N.A.","Herkovits, J., Perez-Coll, C.S. and Herkovits, D. (2000) Evaluation of nickel-zinc interactions by means of bioassays with amphibian embryos. Ecotoxicology and Environmental Safety, 45:266–273  ","11"]
["Freshwater/metal/non- plant","162-45",82,0.82,"","Brachionus calcyflorus","N.R.","48 h","NOEC","Population growth rate",1261.0999999999999,"Microinvertebrate","Rotifera","Monogononta","Freshwater","25 ± 2","Chronic",7,"N.A.","Schlekat, C. E., Genderen, E. V., De Schamphelaerem K. A. C., Antunes, P. M. C., Rogevich, E. C., and Stubblefield, W. A. (2010) Cross-species extrpolation of chronic nickel Biotic Ligand Models. Science of the Total Environment 408, 6148-6157.","162"]
["Freshwater/metal/non- plant","162-35",82,0.82,"","Brachionus calcyflorus","NR","48 h","EC20","Population growth rate",1141.0999999999999,"Microinvertebrate","Rotifera","Monogononta","Freshwater","25 ± 2","Chronic",8,"N.A.","Schlekat, C. E., Genderen, E. V., De Schamphelaerem K. A. C., Antunes, P. M. C., Rogevich, E. C., and Stubblefield, W. A. (2010) Cross-species extrpolation of chronic nickel Biotic Ligand Models. Science of the Total Environment 408, 6148-6157.","162"]
["Freshwater/metal/non- plant","8-4",83,0.83,"Data does not specify standard method or test acceptability criteria (assumed good). Replication also unclear","Salmo gairdneri","fertilised eyed eggs","52 d","NOEL","Survival",1100,"Fish","Chordata","Actinopterygii","Freshwater",12.5,"Chronic",7.1,"N.A.","Nebeker, A.V., Savonen, C. and Stevens, D.G. (1985) Sensitivity of rainbow trout early life stages to nickel chloride. Environmental Toxicology and Chemsistry, 4:233–239.","8"]
["Freshwater/metal/non- plant","4-8",78,0.78,"Check if 48-h rotifer is chronic endpoint (assumed yes due to reproductive endpoint (rapid life cycle)). Good paper for modelling; also quotes EC10 as Ni2+ activity, EC20 , EC50 but discrepenciies with Mg concentrations in media","Brachionus calyciflorus","Neonates (<2 h)","48 h","EC10","Reproduction",1098,"Microinvertebrate","Rotifera","Monogononta","Freshwater",20,"Chronic",8.5500000000000007,"N.A.","Nys, C., Janssen, C/R., Van Sprang, P. and De Schamphelaere, K.A.C. (2016) The effect of pH on chronic aquatic nickel toxicity is dependent on the pH itself: Extending the chronic nickel bioavailability models. Environmental Toxicology and Chemistry, 35:1097–1106.","4"]
["Freshwater/metal/non- plant","162-21",94,0.94,"","Chironomus tentans","second instar larvae","10 d","EC20","Growth (AFDW)",1028.8,"Macroinvertebrate","Arthropoda","Insecta","Freshwater","25 ± 2","Chronic",7.6,"N.A.","Schlekat, C. E., Genderen, E. V., De Schamphelaerem K. A. C., Antunes, P. M. C., Rogevich, E. C., and Stubblefield, W. A. (2010) Cross-species extrpolation of chronic nickel Biotic Ligand Models. Science of the Total Environment 408, 6148-6157.","162"]
["Freshwater/metal/non- plant","162-32",82,0.82,"","Brachionus calcyflorus","NR","48 h","EC20","Population growth rate",990.4,"Microinvertebrate","Rotifera","Monogononta","Freshwater","25 ± 2","Chronic",8.5,"N.A.","Schlekat, C. E., Genderen, E. V., De Schamphelaerem K. A. C., Antunes, P. M. C., Rogevich, E. C., and Stubblefield, W. A. (2010) Cross-species extrpolation of chronic nickel Biotic Ligand Models. Science of the Total Environment 408, 6148-6157.","162"]
["Freshwater/metal/non- plant","173-4",62,0.62,"NOTE: acceptability criteria not stated or inferred.","Daphnia magna","exponentially growing populatiuon of daphnids","21 d","EC50","population growth",950,"Microinvertebrate","Arthropoda","Branchiopoda","Freshwater","20°C","Chronic",8.1,"N.A.","Ensernik, E.L., Maas-Diepevee, J.L. and Van Leeuwen, C.J. (1991). Combined effects of metals; an ecotoxicological evaluation. Water Research 25: 679-687.","173","NOTE: acceptability criteria not stated or inferred."]
["Freshwater/metal/non- plant","162-34",82,0.82,"","Brachionus calcyflorus","NR","48 h","EC10","Population growth rate",945.2,"Microinvertebrate","Rotifera","Monogononta","Freshwater","25 ± 2","Chronic",8,"N.A.","Schlekat, C. E., Genderen, E. V., De Schamphelaerem K. A. C., Antunes, P. M. C., Rogevich, E. C., and Stubblefield, W. A. (2010) Cross-species extrpolation of chronic nickel Biotic Ligand Models. Science of the Total Environment 408, 6148-6157.","162"]
["Freshwater/metal/plant","165-1",85,0.85,"","Chlorella sp","exponentially growing cells","72 h","EC10","Growth rate",900,"Microalga","Chlorophyta","Chlorophyceae","Freshwater","29 ± 2","Chronic",7.3,"N.A.","Peters, A. Merrington, G. Kosmala-Grzechnik, S. (2014). Parameterisation of Biotic Ligand Models for nickel to Australian Test Species. Wca environment Project Number P0313-12-13, 41 pp.","165"]
["Freshwater/metal/non- plant","168-8",79,0.79,"","Pimephales promelas","swim up fry","17 d","NOEC","mortality",788,"Fish","Chordata","Actinopterygii","Freshwater","14.4 ± 0.06","Chronic",7.55,"N.A.","Deleebeeck, N.M.E., de Schamphelaere, K.A.C and Janssen, C.R. (2007). A bioavailability model predicting the toxicity of nickel to rainbow trout (Oncorhynchus mykiss) and fathead minnow (Pimephales  promelas) in synthetic and natural waters. Ecotoxicolgy and Environmental Safety 67:1-13.","168","17-d LC50 values also available"]
["Freshwater/metal/non- plant","162-19",94,0.94,"","Chironomus tentans","second instar larvae","10 d","EC10","Growth (AFDW)",782.2,"Macroinvertebrate","Arthropoda","Insecta","Freshwater","25 ± 2","Chronic",7.6,"N.A.","Schlekat, C. E., Genderen, E. V., De Schamphelaerem K. A. C., Antunes, P. M. C., Rogevich, E. C., and Stubblefield, W. A. (2010) Cross-species extrpolation of chronic nickel Biotic Ligand Models. Science of the Total Environment 408, 6148-6157.","162"]
["Freshwater/metal/non- plant","1-1",71,0.71,"data also available for 7, 8 & 9 days; 10 d result reported here was the most sensitive toxicity value","Cyprinus carpio","larvae","10.7 d","LC50","Mortality",750,"Fish","Chordata","Actinopterygii","Freshwater","23-25","Chronic",7.4,"N.A.","Blaylock B.G. and Frank M.L. (1979) A comparison of the toxicity of nickel to the developing eggs and larvae of carp (Cyprinus carpio). Bulletin of Environmental Contamination and Toxicology 21, 604–611. ","1"]
["Freshwater/metal/non- plant","166-1",69,0.69,"","Cyprinus carpio","1 d old larvae","10 d","LC50","Survival",750,"Fish","Chordata","Actinopterygii","Freshwater","23-25","Chronic",7.4,"N.A.","Blaylock, B.G. and Frank, M.L. (1979). A coparison of the toxicity of nickel to the developing eggs and larvae of carp (Cyprinus carpio). Bull. Environm. Contam. Toxicol. 21: 604-611","166"]
["Freshwater/metal/non- plant","8-7",83,0.83,"Data does not specify standard method or test acceptability criteria (assumed good). Replication also unclear","Salmo gairdneri","larvae (pre-swim up)","38 d","NOEL","Survival",700,"Fish","Chordata","Actinopterygii","Freshwater",12.7,"Chronic",7.2,"N.A.","Nebeker, A.V., Savonen, C. and Stevens, D.G. (1985) Sensitivity of rainbow trout early life stages to nickel chloride. Environmental Toxicology and Chemsistry, 4:233–239.","8"]
["Freshwater/metal/non- plant","162-31",82,0.82,"","Brachionus calcyflorus","NR","48 h","EC10","Population growth rate",662.6,"Microinvertebrate","Rotifera","Monogononta","Freshwater","25 ± 2","Chronic",8.5,"N.A.","Schlekat, C. E., Genderen, E. V., De Schamphelaerem K. A. C., Antunes, P. M. C., Rogevich, E. C., and Stubblefield, W. A. (2010) Cross-species extrpolation of chronic nickel Biotic Ligand Models. Science of the Total Environment 408, 6148-6157.","162"]
["Freshwater/metal/non- plant","162-20",94,0.94,"","Chironomus tentans","second instar larvae","10 d","NOEC","Growth (AFDW)",631.70000000000005,"Macroinvertebrate","Arthropoda","Insecta","Freshwater","25 ± 2","Chronic",7.6,"N.A.","Schlekat, C. E., Genderen, E. V., De Schamphelaerem K. A. C., Antunes, P. M. C., Rogevich, E. C., and Stubblefield, W. A. (2010) Cross-species extrpolation of chronic nickel Biotic Ligand Models. Science of the Total Environment 408, 6148-6157.","162"]
["Freshwater/metal/non- plant","168-16",81,0.81,"","Pimephales promelas","swim up fry","17 d","NOEC","mortality",582,"Fish","Chordata","Actinopterygii","Freshwater","14.5 ± 1","Chronic",7.39,"N.A.","Deleebeeck, N.M.E., de Schamphelaere, K.A.C and Janssen, C.R. (2007). A bioavailability model predicting the toxicity of nickel to rainbow trout (Oncorhynchus mykiss) and fathead minnow (Pimephales  promelas) in synthetic and natural waters. Ecotoxicolgy and Environmental Safety 67:1-13.","168","17-d LC50 values also available"]
["Freshwater/metal/plant","156-1",63,0.64948453608247425,"The highest possible grade for this datum is acceptable. Note also - no mention of control acceptability","Scenedesmus quadricauda","exponentially growing cells","12 d","EC50","Growth rate",580,"Microalga","Chlorophyta","Chlorophyceae","Freshwater","N.R.","Chronic","N.R.","N.A.","Fargasova, A., Bumbalova, A., Havranek, E. (1999). Ecotoxicological effects and uptake of metals (Cu+, Cu2+, Mn2+, Mo6+, Ni2+, V5+) in freshwater alga Scenedesmus quadricauda. Chemospeher 38:1165-1173.","156","Rejected: no acceptability critera, and this species already represented by data with strong QA"]
["Freshwater/metal/non- plant","168-17",81,0.81,"","Pimephales promelas","swim up fry","17 d","NOEC","mortality",576,"Fish","Chordata","Actinopterygii","Freshwater","14.5 ± 1","Chronic",8.0500000000000007,"N.A.","Deleebeeck, N.M.E., de Schamphelaere, K.A.C and Janssen, C.R. (2007). A bioavailability model predicting the toxicity of nickel to rainbow trout (Oncorhynchus mykiss) and fathead minnow (Pimephales  promelas) in synthetic and natural waters. Ecotoxicolgy and Environmental Safety 67:1-13.","168","17-d LC50 values also available"]
["Freshwater/metal/plant","156-3",63,0.64948453608247425,"The highest possible grade for this datum is acceptable. Note also - no mention of control acceptability","Scenedesmus quadricauda","exponentially growing cells","12 d","EC50","Biomass (Chl a)",570,"Microalga","Chlorophyta","Chlorophyceae","Freshwater","N.R.","Chronic","N.R.","N.A.","Fargasova, A., Bumbalova, A., Havranek, E. (1999). Ecotoxicological effects and uptake of metals (Cu+, Cu2+, Mn2+, Mo6+, Ni2+, V5+) in freshwater alga Scenedesmus quadricauda. Chemospeher 38:1165-1173.","156","Rejected: no acceptability critera, and this species already represented by data with strong QA"]
["Freshwater/metal/non- plant","168-18",81,0.81,"","Pimephales promelas","swim up fry","17 d","NOEC","mortality",560,"Fish","Chordata","Actinopterygii","Freshwater","14.5 ± 1","Chronic",8.19,"N.A.","Deleebeeck, N.M.E., de Schamphelaere, K.A.C and Janssen, C.R. (2007). A bioavailability model predicting the toxicity of nickel to rainbow trout (Oncorhynchus mykiss) and fathead minnow (Pimephales  promelas) in synthetic and natural waters. Ecotoxicolgy and Environmental Safety 67:1-13.","168","17-d LC50 values also available"]
["Freshwater/metal/non- plant","162-23",94,0.94,"","Chironomus tentans","second instar larvae","10 d","EC20","Growth (AFDW)",551,"Macroinvertebrate","Arthropoda","Insecta","Freshwater","25 ± 2","Chronic",6.9,"N.A.","Schlekat, C. E., Genderen, E. V., De Schamphelaerem K. A. C., Antunes, P. M. C., Rogevich, E. C., and Stubblefield, W. A. (2010) Cross-species extrpolation of chronic nickel Biotic Ligand Models. Science of the Total Environment 408, 6148-6157.","162"]
["Freshwater/metal/non- plant","162-18",94,0.94,"","Chironomus tentans","second instar larvae","10 d","EC20","Growth (AFDW)",544,"Macroinvertebrate","Arthropoda","Insecta","Freshwater","25 ± 2","Chronic",8.1,"N.A.","Schlekat, C. E., Genderen, E. V., De Schamphelaerem K. A. C., Antunes, P. M. C., Rogevich, E. C., and Stubblefield, W. A. (2010) Cross-species extrpolation of chronic nickel Biotic Ligand Models. Science of the Total Environment 408, 6148-6157.","162"]
["Freshwater/metal/non- plant","173-5",62,0.62,"NOTE: acceptability criteria not stated or inferred.","Daphnia magna","exponentially growing populatiuon of daphnids","21 d","EC10","population growth",540,"Microinvertebrate","Arthropoda","Branchiopoda","Freshwater","20°C","Chronic",8.1,"N.A.","Ensernik, E.L., Maas-Diepevee, J.L. and Van Leeuwen, C.J. (1991). Combined effects of metals; an ecotoxicological evaluation. Water Research 25: 679-687.","173","NOTE: acceptability criteria not stated or inferred."]
["Freshwater/metal/non- plant","162-29",94,0.94,"","Chironomus tentans","second instar larvae","10 d","EC20","Growth (AFDW)",501.7,"Macroinvertebrate","Arthropoda","Insecta","Freshwater","25 ± 2","Chronic",7.3,"N.A.","Schlekat, C. E., Genderen, E. V., De Schamphelaerem K. A. C., Antunes, P. M. C., Rogevich, E. C., and Stubblefield, W. A. (2010) Cross-species extrpolation of chronic nickel Biotic Ligand Models. Science of the Total Environment 408, 6148-6157.","162"]
["Freshwater/metal/non- plant","162-33",82,0.82,"","Brachionus calcyflorus","NR","48 h","NOEC","Population growth rate",501.2,"Microinvertebrate","Rotifera","Monogononta","Freshwater","25 ± 2","Chronic",8.5,"N.A.","Schlekat, C. E., Genderen, E. V., De Schamphelaerem K. A. C., Antunes, P. M. C., Rogevich, E. C., and Stubblefield, W. A. (2010) Cross-species extrpolation of chronic nickel Biotic Ligand Models. Science of the Total Environment 408, 6148-6157.","162"]
["Freshwater/metal/plant","156-2",63,0.64948453608247425,"The highest possible grade for this datum is acceptable. Note also - no mention of control acceptability","Scenedesmus quadricauda","exponentially growing cells","12 d","EC50","Total Chl",440,"Microalga","Chlorophyta","Chlorophyceae","Freshwater","N.R.","Chronic","N.R.","N.A.","Fargasova, A., Bumbalova, A., Havranek, E. (1999). Ecotoxicological effects and uptake of metals (Cu+, Cu2+, Mn2+, Mo6+, Ni2+, V5+) in freshwater alga Scenedesmus quadricauda. Chemospeher 38:1165-1173.","156","Rejected: no acceptability critera, and this species already represented by data with strong QA"]
["Freshwater/metal/plant","162-50",93,0.95876288659793818,"","Lemna minor","3-frond colonies","7 d","EC10","growth rate (root length)",435.3,"Macrophyte","Tracheophyta","Liliopsida","Freshwater","25 ± 1","Chronic",6.9,"N.A.","Schlekat, C. E., Genderen, E. V., De Schamphelaerem K. A. C., Antunes, P. M. C., Rogevich, E. C., and Stubblefield, W. A. (2010) Cross-species extrpolation of chronic nickel Biotic Ligand Models. Science of the Total Environment 408, 6148-6157.","162"]
["Freshwater/metal/non- plant","168-7",79,0.79,"","Pimephales promelas","swim up fry","17 d","NOEC","mortality",431,"Fish","Chordata","Actinopterygii","Freshwater","13.5 ± 0.14","Chronic",7.53,"N.A.","Deleebeeck, N.M.E., de Schamphelaere, K.A.C and Janssen, C.R. (2007). A bioavailability model predicting the toxicity of nickel to rainbow trout (Oncorhynchus mykiss) and fathead minnow (Pimephales  promelas) in synthetic and natural waters. Ecotoxicolgy and Environmental Safety 67:1-13.","168","17-d LC50 values also available"]
["Freshwater/metal/non- plant","8-5",83,0.83,"Data does not specify standard method or test acceptability criteria (assumed good). Replication also unclear","Salmo gairdneri","fertilised eyed eggs","52 d","NOEL","Growth (fork length)",431,"Fish","Chordata","Actinopterygii","Freshwater",12.5,"Chronic",7.1,"N.A.","Nebeker, A.V., Savonen, C. and Stevens, D.G. (1985) Sensitivity of rainbow trout early life stages to nickel chloride. Environmental Toxicology and Chemsistry, 4:233–239.","8"]
["Freshwater/metal/plant","169-39",88,0.90721649484536082,"","Pseudokirchneriella subcapitata","exponentially growing cells","72 h","EC10","Growth rate",425,"Microalga","Chlorophyta","Chlorophyceae","Freshwater","25°C","Chronic",7.29,"N.A.","Deleebeeck, N.M.E., de Schamphelaere, K.A.C and Janssen, C.R. (2009). Effects of Mg2+ and H+ on the toxicity of Ni2+ to the unicellular green alga Pseudokirchneriella subcapitata: Model development and validation with surface waters. Science of the Total Environment 407:1901-1914.","169"]
["Freshwater/metal/non- plant","2-5",57,0.56999999999999995,"DO NOT USE - statistical analysis is unreliabl","Ambystoma opacum","fertilised eggs","8 days","LC50","Mortality",420,"Amphibian","Chordata","Amphibia","Freshwater","19–22","Chronic","7.2–7.8","N.A.","Birge W.J., Hudson J.E., Black J.A. and Westerman A.G. (1978) Embryo-larval bioassays on inorganic coal elements and in situ biomonitoring of coal-waste effluents. In: Symp. U.S. Fish Wildl. Serv., Surface Mining Fish Wildl. Needs in U.S., W.VA 97–104.","2"]
["Freshwater/metal/non- plant","164-1",64,0.64,"The highest possible grade for this datum is acceptable. No acceptability criteria stated.","Mesocyclops pehpeinsis","<12h nauplii","9 d","EC50","larval development",410,"Microinvertebrate","Arthropoda","Hexanauplia","Freshwater","25°C","Chronic","N.R.","N.A.","Wong, C.K. and Pak, A.P. (2004). Acute and subchronic toxicity of the Heavy metals copper, chromium, nickel, and zinc, individually and in mixture, to the freshwater copepod Mesocyclops pehpeinsis, Bull. Environ. Contam. Toxicol, 73:190-196.","164"]
["Freshwater/metal/non- plant","162-22",94,0.94,"","Chironomus tentans","second instar larvae","10 d","EC10","Growth (AFDW)",405.4,"Macroinvertebrate","Arthropoda","Insecta","Freshwater","25 ± 2","Chronic",6.9,"N.A.","Schlekat, C. E., Genderen, E. V., De Schamphelaerem K. A. C., Antunes, P. M. C., Rogevich, E. C., and Stubblefield, W. A. (2010) Cross-species extrpolation of chronic nickel Biotic Ligand Models. Science of the Total Environment 408, 6148-6157.","162"]
["Freshwater/metal/non- plant","162-16",94,0.94,"","Chironomus tentans","second instar larvae","10 d","EC10","Growth (AFDW)",404.3,"Macroinvertebrate","Arthropoda","Insecta","Freshwater","25 ± 2","Chronic",8.1,"N.A.","Schlekat, C. E., Genderen, E. V., De Schamphelaerem K. A. C., Antunes, P. M. C., Rogevich, E. C., and Stubblefield, W. A. (2010) Cross-species extrpolation of chronic nickel Biotic Ligand Models. Science of the Total Environment 408, 6148-6157.","162"]
["Freshwater/metal/plant","156-4",63,0.64948453608247425,"The highest possible grade for this datum is acceptable. Note also - no mention of control acceptability","Scenedesmus quadricauda","exponentially growing cells","12 d","EC50","Biomass (Chl b)",390,"Microalga","Chlorophyta","Chlorophyceae","Freshwater","N.R.","Chronic","N.R.","N.A.","Fargasova, A., Bumbalova, A., Havranek, E. (1999). Ecotoxicological effects and uptake of metals (Cu+, Cu2+, Mn2+, Mo6+, Ni2+, V5+) in freshwater alga Scenedesmus quadricauda. Chemospeher 38:1165-1173.","156","Rejected: no acceptability critera, and this species already represented by data with strong QA"]
["Freshwater/metal/non- plant","162-17",94,0.94,"","Chironomus tentans","second instar larvae","10 d","NOEC","Growth (AFDW)",375.6,"Macroinvertebrate","Arthropoda","Insecta","Freshwater","25 ± 2","Chronic",8.1,"N.A.","Schlekat, C. E., Genderen, E. V., De Schamphelaerem K. A. C., Antunes, P. M. C., Rogevich, E. C., and Stubblefield, W. A. (2010) Cross-species extrpolation of chronic nickel Biotic Ligand Models. Science of the Total Environment 408, 6148-6157.","162"]
["Freshwater/metal/non- plant","162-26",94,0.94,"","Chironomus tentans","second instar larvae","10 d","EC20","Growth (AFDW)",372.3,"Macroinvertebrate","Arthropoda","Insecta","Freshwater","25 ± 2","Chronic",7.2,"N.A.","Schlekat, C. E., Genderen, E. V., De Schamphelaerem K. A. C., Antunes, P. M. C., Rogevich, E. C., and Stubblefield, W. A. (2010) Cross-species extrpolation of chronic nickel Biotic Ligand Models. Science of the Total Environment 408, 6148-6157.","162"]
["Freshwater/metal/plant","169-16",85,0.87628865979381443,"","Pseudokirchneriella subcapitata","exponentially growing cells","72 h","EC10","Growth rate",365,"Microalga","Chlorophyta","Chlorophyceae","Freshwater","25°C","Chronic",7.52,"N.A.","Deleebeeck, N.M.E., de Schamphelaere, K.A.C and Janssen, C.R. (2009). Effects of Mg2+ and H+ on the toxicity of Ni2+ to the unicellular green alga Pseudokirchneriella subcapitata: Model development and validation with surface waters. Science of the Total Environment 407:1901-1914.","169"]
["Freshwater/metal/non- plant","173-1",62,0.62,"NOTE: acceptability criteria not stated or inferred.","Daphnia magna","<24h old neonate","21 d","LC50","Survival",360,"Microinvertebrate","Arthropoda","Branchiopoda","Freshwater","20°C","Chronic",8.1,"N.A.","Ensernik, E.L., Maas-Diepevee, J.L. and Van Leeuwen, C.J. (1991). Combined effects of metals; an ecotoxicological evaluation. Water Research 25: 679-687.","173","NOTE: acceptability criteria not stated or inferred."]
["Freshwater/metal/non- plant","168-2",79,0.79,"","Pimephales promelas","swim up fry","17 d","NOEC","mortality",352,"Fish","Chordata","Actinopterygii","Freshwater","13.9±0.2","Chronic",6.76,"N.A.","Deleebeeck, N.M.E., de Schamphelaere, K.A.C and Janssen, C.R. (2007). A bioavailability model predicting the toxicity of nickel to rainbow trout (Oncorhynchus mykiss) and fathead minnow (Pimephales  promelas) in synthetic and natural waters. Ecotoxicolgy and Environmental Safety 67:1-13.","168","17-d LC50 values also available"]
["Freshwater/metal/plant","162-49",93,0.95876288659793818,"","Lemna minor","3-frond colonies","7 d","NOEC","growth rate (root length)",350,"Macrophyte","Tracheophyta","Liliopsida","Freshwater","25 ± 1","Chronic",8,"N.A.","Schlekat, C. E., Genderen, E. V., De Schamphelaerem K. A. C., Antunes, P. M. C., Rogevich, E. C., and Stubblefield, W. A. (2010) Cross-species extrpolation of chronic nickel Biotic Ligand Models. Science of the Total Environment 408, 6148-6157.","162"]
["Freshwater/metal/non- plant","168-4",79,0.79,"","Pimephales promelas","swim up fry","17 d","NOEC","mortality",350,"Fish","Chordata","Actinopterygii","Freshwater","14.7±0.15","Chronic",7.67,"N.A.","Deleebeeck, N.M.E., de Schamphelaere, K.A.C and Janssen, C.R. (2007). A bioavailability model predicting the toxicity of nickel to rainbow trout (Oncorhynchus mykiss) and fathead minnow (Pimephales  promelas) in synthetic and natural waters. Ecotoxicolgy and Environmental Safety 67:1-13.","168","17-d LC50 values also available"]
["Freshwater/metal/non- plant","168-12",79,0.79,"","Pimephales promelas","swim up fry","17 d","NOEC","mortality",340,"Fish","Chordata","Actinopterygii","Freshwater","14.6 ± 0.12","Chronic",7.62,"N.A.","Deleebeeck, N.M.E., de Schamphelaere, K.A.C and Janssen, C.R. (2007). A bioavailability model predicting the toxicity of nickel to rainbow trout (Oncorhynchus mykiss) and fathead minnow (Pimephales  promelas) in synthetic and natural waters. Ecotoxicolgy and Environmental Safety 67:1-13.","168","17-d LC50 values also available"]
["Freshwater/metal/plant","169-66",85,0.87628865979381443,"","Pseudokirchneriella subcapitata","exponentially growing cells","72 h","NOEC","Growth rate",327,"Microalga","Chlorophyta","Chlorophyceae","Freshwater","25°C","Chronic",6.13,"N.A.","Deleebeeck, N.M.E., de Schamphelaere, K.A.C and Janssen, C.R. (2009). Effects of Mg2+ and H+ on the toxicity of Ni2+ to the unicellular green alga Pseudokirchneriella subcapitata: Model development and validation with surface waters. Science of the Total Environment 407:1901-1914.","169"]
["Freshwater/metal/non- plant","173-2",62,0.62,"NOTE: acceptability criteria not stated or inferred.","Daphnia magna","<24h old neonate","21 d","LOEC","Survival",320,"Microinvertebrate","Arthropoda","Branchiopoda","Freshwater","20°C","Chronic",8.1,"N.A.","Ensernik, E.L., Maas-Diepevee, J.L. and Van Leeuwen, C.J. (1991). Combined effects of metals; an ecotoxicological evaluation. Water Research 25: 679-687.","173","NOTE: acceptability criteria not stated or inferred."]
["Freshwater/metal/non- plant","173-3",62,0.62,"NOTE: acceptability criteria not stated or inferred.","Daphnia magna","<24h old neonate","21 d","LOEC","length",320,"Microinvertebrate","Arthropoda","Branchiopoda","Freshwater","20°C","Chronic",8.1,"N.A.","Ensernik, E.L., Maas-Diepevee, J.L. and Van Leeuwen, C.J. (1991). Combined effects of metals; an ecotoxicological evaluation. Water Research 25: 679-687.","173","NOTE: acceptability criteria not stated or inferred."]
["Freshwater/metal/plant","169-33",88,0.90721649484536082,"","Pseudokirchneriella subcapitata","exponentially growing cells","72 h","EC10","Growth rate",314,"Microalga","Chlorophyta","Chlorophyceae","Freshwater","25°C","Chronic","7.37/7.47","N.A.","Deleebeeck, N.M.E., de Schamphelaere, K.A.C and Janssen, C.R. (2009). Effects of Mg2+ and H+ on the toxicity of Ni2+ to the unicellular green alga Pseudokirchneriella subcapitata: Model development and validation with surface waters. Science of the Total Environment 407:1901-1914.","169"]
["Freshwater/metal/plant","169-23",85,0.87628865979381443,"","Pseudokirchneriella subcapitata","exponentially growing cells","72 h","EC10","Growth rate",312,"Microalga","Chlorophyta","Chlorophyceae","Freshwater","25°C","Chronic",6.13,"N.A.","Deleebeeck, N.M.E., de Schamphelaere, K.A.C and Janssen, C.R. (2009). Effects of Mg2+ and H+ on the toxicity of Ni2+ to the unicellular green alga Pseudokirchneriella subcapitata: Model development and validation with surface waters. Science of the Total Environment 407:1901-1914.","169"]
["Freshwater/metal/non- plant","162-25",94,0.94,"","Chironomus tentans","second instar larvae","10 d","EC10","Growth (AFDW)",305.7,"Macroinvertebrate","Arthropoda","Insecta","Freshwater","25 ± 2","Chronic",7.2,"N.A.","Schlekat, C. E., Genderen, E. V., De Schamphelaerem K. A. C., Antunes, P. M. C., Rogevich, E. C., and Stubblefield, W. A. (2010) Cross-species extrpolation of chronic nickel Biotic Ligand Models. Science of the Total Environment 408, 6148-6157.","162"]
["Freshwater/metal/plant","175-3",88,0.90721649484536082,"","Monoraphidium arcuatum (in multispecies assay)","exponentially growing cells","72 h","EC10","Growth rate",305,"Microalga","Chlorophyta","Chlorophyceae","Freshwater",27,"Chronic",7.5,"N.A.","McKnight et al 2018 (unpublished data)","175"]
["Freshwater/metal/plant","169-41",88,0.90721649484536082,"","Pseudokirchneriella subcapitata","exponentially growing cells","72 h","EC10","Growth rate",301,"Microalga","Chlorophyta","Chlorophyceae","Freshwater","25°C","Chronic",7.78,"N.A.","Deleebeeck, N.M.E., de Schamphelaere, K.A.C and Janssen, C.R. (2009). Effects of Mg2+ and H+ on the toxicity of Ni2+ to the unicellular green alga Pseudokirchneriella subcapitata: Model development and validation with surface waters. Science of the Total Environment 407:1901-1914.","169"]
["Freshwater/metal/non- plant","162-27",94,0.94,"","Chironomus tentans","second instar larvae","10 d","NOEC","Growth (AFDW)",297.5,"Macroinvertebrate","Arthropoda","Insecta","Freshwater","25 ± 2","Chronic",7.2,"N.A.","Schlekat, C. E., Genderen, E. V., De Schamphelaerem K. A. C., Antunes, P. M. C., Rogevich, E. C., and Stubblefield, W. A. (2010) Cross-species extrpolation of chronic nickel Biotic Ligand Models. Science of the Total Environment 408, 6148-6157.","162"]
["Freshwater/metal/non- plant","167-43",84,0.84,"","Daphnia magna","<24h old neonate","21 d","NOEC","Reproduction",293,"Microinvertebrate","Arthropoda","Branchiopoda","Freshwater","NR","Chronic",6.79,"N.A.","Deleebeeck, N.M.E., de Schamphelaere, K.A.C. and Janssen, C.R. (2008). A Novel method for predicting chronic bioavailability and toxicity to Daphnia magna in artificial and natural waters. Environemtnal Toxicology and Chemistry 27: 2097-2107.","167","4.0 µg/L Ni in base water"]
["Freshwater/metal/plant","169-27",85,0.87628865979381443,"","Pseudokirchneriella subcapitata","exponentially growing cells","72 h","EC10","Growth rate",292,"Microalga","Chlorophyta","Chlorophyceae","Freshwater","25°C","Chronic",7.15,"N.A.","Deleebeeck, N.M.E., de Schamphelaere, K.A.C and Janssen, C.R. (2009). Effects of Mg2+ and H+ on the toxicity of Ni2+ to the unicellular green alga Pseudokirchneriella subcapitata: Model development and validation with surface waters. Science of the Total Environment 407:1901-1914.","169"]
["Freshwater/metal/plant","169-59",85,0.87628865979381443,"","Pseudokirchneriella subcapitata","exponentially growing cells","72 h","NOEC","Growth rate",292,"Microalga","Chlorophyta","Chlorophyceae","Freshwater","25°C","Chronic",7.52,"N.A.","Deleebeeck, N.M.E., de Schamphelaere, K.A.C and Janssen, C.R. (2009). Effects of Mg2+ and H+ on the toxicity of Ni2+ to the unicellular green alga Pseudokirchneriella subcapitata: Model development and validation with surface waters. Science of the Total Environment 407:1901-1914.","169"]
["Freshwater/metal/non- plant","167-67",84,0.84,"","Daphnia magna","<24h old neonate","21 d","EC20","Reproduction",291,"Microinvertebrate","Arthropoda","Branchiopoda","Freshwater","NR","Chronic",6.79,"N.A.","Deleebeeck, N.M.E., de Schamphelaere, K.A.C. and Janssen, C.R. (2008). A Novel method for predicting chronic bioavailability and toxicity to Daphnia magna in artificial and natural waters. Environemtnal Toxicology and Chemistry 27: 2097-2107.","167","4.0 µg/L Ni in base water"]
["Freshwater/metal/plant","169-57",85,0.87628865979381443,"","Pseudokirchneriella subcapitata","exponentially growing cells","72 h","NOEC","Growth rate",285,"Microalga","Chlorophyta","Chlorophyceae","Freshwater","25°C","Chronic",7.53,"N.A.","Deleebeeck, N.M.E., de Schamphelaere, K.A.C and Janssen, C.R. (2009). Effects of Mg2+ and H+ on the toxicity of Ni2+ to the unicellular green alga Pseudokirchneriella subcapitata: Model development and validation with surface waters. Science of the Total Environment 407:1901-1914.","169"]
["Freshwater/metal/plant","169-15",85,0.87628865979381443,"","Pseudokirchneriella subcapitata","exponentially growing cells","72 h","EC10","Growth rate",284,"Microalga","Chlorophyta","Chlorophyceae","Freshwater","25°C","Chronic",7.54,"N.A.","Deleebeeck, N.M.E., de Schamphelaere, K.A.C and Janssen, C.R. (2009). Effects of Mg2+ and H+ on the toxicity of Ni2+ to the unicellular green alga Pseudokirchneriella subcapitata: Model development and validation with surface waters. Science of the Total Environment 407:1901-1914.","169"]
["Freshwater/metal/plant","165-4",85,0.85,"","Chlorella sp","exponentially growing cells","72 h","EC10","Growth rate",278,"Microalga","Chlorophyta","Chlorophyceae","Freshwater","29 ± 2","Chronic",7.9,"N.A.","Peters, A. Merrington, G. Kosmala-Grzechnik, S. (2014). Parameterisation of Biotic Ligand Models for nickel to Australian Test Species. Wca environment Project Number P0313-12-13, 41 pp.","165"]
["Freshwater/metal/non- plant","167-71",84,0.84,"","Daphnia magna","<24h old neonate","21 d","EC20","Reproduction",272,"Microinvertebrate","Arthropoda","Branchiopoda","Freshwater","NR","Chronic",7.71,"N.A.","Deleebeeck, N.M.E., de Schamphelaere, K.A.C. and Janssen, C.R. (2008). A Novel method for predicting chronic bioavailability and toxicity to Daphnia magna in artificial and natural waters. Environemtnal Toxicology and Chemistry 27: 2097-2107.","167","Low reliability value. No CLs. And NOEC was <97.5. Also, 4 µg Ni/L in base water"]
["Freshwater/metal/non- plant","168-15",81,0.81,"","Pimephales promelas","swim up fry","17 d","NOEC","mortality",265,"Fish","Chordata","Actinopterygii","Freshwater","14.5 ± 1","Chronic",5.63,"N.A.","Deleebeeck, N.M.E., de Schamphelaere, K.A.C and Janssen, C.R. (2007). A bioavailability model predicting the toxicity of nickel to rainbow trout (Oncorhynchus mykiss) and fathead minnow (Pimephales  promelas) in synthetic and natural waters. Ecotoxicolgy and Environmental Safety 67:1-13.","168","17-d LC50 values also available"]
["Freshwater/metal/non- plant","167-19",84,0.84,"","Daphnia magna","<24h old neonate","21 d","EC10","Reproduction",256,"Microinvertebrate","Arthropoda","Branchiopoda","Freshwater","NR","Chronic",6.79,"N.A.","Deleebeeck, N.M.E., de Schamphelaere, K.A.C. and Janssen, C.R. (2008). A Novel method for predicting chronic bioavailability and toxicity to Daphnia magna in artificial and natural waters. Environemtnal Toxicology and Chemistry 27: 2097-2107.","167","4.0 µg/L Ni in base water"]
["Freshwater/metal/plant","169-13",85,0.87628865979381443,"","Pseudokirchneriella subcapitata","exponentially growing cells","72 h","EC10","Growth rate",252,"Microalga","Chlorophyta","Chlorophyceae","Freshwater","25°C","Chronic",7.54,"N.A.","Deleebeeck, N.M.E., de Schamphelaere, K.A.C and Janssen, C.R. (2009). Effects of Mg2+ and H+ on the toxicity of Ni2+ to the unicellular green alga Pseudokirchneriella subcapitata: Model development and validation with surface waters. Science of the Total Environment 407:1901-1914.","169"]
["Freshwater/metal/non- plant","162-28",94,0.94,"","Chironomus tentans","second instar larvae","10 d","EC10","Growth (AFDW)",251.1,"Macroinvertebrate","Arthropoda","Insecta","Freshwater","25 ± 2","Chronic",7.3,"N.A.","Schlekat, C. E., Genderen, E. V., De Schamphelaerem K. A. C., Antunes, P. M. C., Rogevich, E. C., and Stubblefield, W. A. (2010) Cross-species extrpolation of chronic nickel Biotic Ligand Models. Science of the Total Environment 408, 6148-6157.","162"]
["Freshwater/metal/non- plant","163-1",68,0.68,"No acceptability criteria stated, but control data supplied.","Moina macrocopa","<24h old neonate","15-17d","NOEC","Survival",250,"Microinvertebrate","Arthropoda","Branchiopoda","Freshwater","25°C","Chronic","6.5-7.0","N.A.","Wong, C.K., Wong, P.K., Tao, H. (1991). Toxicity of nickel and nickel electroplating water to the freshwater cladoceran Moina macrocopa. Bull. Environ. Contam. Toxicol. 47:448-454.","163"]
["Freshwater/metal/non- plant","167-23",84,0.84,"","Daphnia magna","<24h old neonate","21 d","EC10","Reproduction",230,"Microinvertebrate","Arthropoda","Branchiopoda","Freshwater","NR","Chronic",7.71,"N.A.","Deleebeeck, N.M.E., de Schamphelaere, K.A.C. and Janssen, C.R. (2008). A Novel method for predicting chronic bioavailability and toxicity to Daphnia magna in artificial and natural waters. Environemtnal Toxicology and Chemistry 27: 2097-2107.","167","Low reliability value. No CLs. And NOEC was <97.5. Also, 4 µg Ni/L in base water"]
["Freshwater/metal/non- plant","168-5",79,0.79,"","Pimephales promelas","swim up fry","17 d","NOEC","mortality",225,"Fish","Chordata","Actinopterygii","Freshwater","14.7 ± 0.2","Chronic",8.4700000000000006,"N.A.","Deleebeeck, N.M.E., de Schamphelaere, K.A.C and Janssen, C.R. (2007). A bioavailability model predicting the toxicity of nickel to rainbow trout (Oncorhynchus mykiss) and fathead minnow (Pimephales  promelas) in synthetic and natural waters. Ecotoxicolgy and Environmental Safety 67:1-13.","168","17-d LC50 values also available"]
["Freshwater/metal/plant","169-34",88,0.90721649484536082,"","Pseudokirchneriella subcapitata","exponentially growing cells","72 h","EC10","Growth rate",219,"Microalga","Chlorophyta","Chlorophyceae","Freshwater","25°C","Chronic","7.37/7.47","N.A.","Deleebeeck, N.M.E., de Schamphelaere, K.A.C and Janssen, C.R. (2009). Effects of Mg2+ and H+ on the toxicity of Ni2+ to the unicellular green alga Pseudokirchneriella subcapitata: Model development and validation with surface waters. Science of the Total Environment 407:1901-1914.","169"]
["Freshwater/metal/plant","169-14",85,0.87628865979381443,"","Pseudokirchneriella subcapitata","exponentially growing cells","72 h","EC10","Growth rate",213,"Microalga","Chlorophyta","Chlorophyceae","Freshwater","25°C","Chronic",7.53,"N.A.","Deleebeeck, N.M.E., de Schamphelaere, K.A.C and Janssen, C.R. (2009). Effects of Mg2+ and H+ on the toxicity of Ni2+ to the unicellular green alga Pseudokirchneriella subcapitata: Model development and validation with surface waters. Science of the Total Environment 407:1901-1914.","169"]
["Freshwater/metal/non- plant","165-11",85,0.85,"","Hydra viridissima","asexually reproducing (budding) hydriods","96 h","EC10","population growth",210,"Microinvertebrate","Cnidaria","Hydrozoa","Freshwater","27 ± 2","Chronic",7.3,"N.A.","Peters, A. Merrington, G. Kosmala-Grzechnik, S. (2014). Parameterisation of Biotic Ligand Models for nickel to Australian Test Species. Wca environment Project Number P0313-12-13, 41 pp.","165"]
["Freshwater/metal/plant","169-70",85,0.87628865979381443,"","Pseudokirchneriella subcapitata","exponentially growing cells","72 h","NOEC","Growth rate",187,"Microalga","Chlorophyta","Chlorophyceae","Freshwater","25°C","Chronic",7.15,"N.A.","Deleebeeck, N.M.E., de Schamphelaere, K.A.C and Janssen, C.R. (2009). Effects of Mg2+ and H+ on the toxicity of Ni2+ to the unicellular green alga Pseudokirchneriella subcapitata: Model development and validation with surface waters. Science of the Total Environment 407:1901-1914.","169"]
["Freshwater/metal/non- plant","177-9",93,0.93,"","Melanotaenia splendida splendida","embryo","13 days","EC50","Embryo hatching success/imbalance",185,"Fish","Chordata","Actinopterygii","Wellington River","25 ± 2","Chronic","7.7-7.9","N.A.","Ecotox Services Australia. 2014. Toxicity of Nickel Under Varying Physico-chemical Conditions. Prepared for Nickel Producers Environmental Research Association (NiPERA). Test Report. May 2014.","177"]
["Freshwater/metal/non- plant","168-11",79,0.79,"","Pimephales promelas","swim up fry","17 d","NOEC","mortality",182,"Fish","Chordata","Actinopterygii","Freshwater","13.5 ± 0.18","Chronic",7.63,"N.A.","Deleebeeck, N.M.E., de Schamphelaere, K.A.C and Janssen, C.R. (2007). A bioavailability model predicting the toxicity of nickel to rainbow trout (Oncorhynchus mykiss) and fathead minnow (Pimephales  promelas) in synthetic and natural waters. Ecotoxicolgy and Environmental Safety 67:1-13.","168","17-d LC50 values also available"]
["Freshwater/metal/plant","169-67",85,0.87628865979381443,"","Pseudokirchneriella subcapitata","exponentially growing cells","72 h","NOEC","Growth rate",181,"Microalga","Chlorophyta","Chlorophyceae","Freshwater","25°C","Chronic",6.08,"N.A.","Deleebeeck, N.M.E., de Schamphelaere, K.A.C and Janssen, C.R. (2009). Effects of Mg2+ and H+ on the toxicity of Ni2+ to the unicellular green alga Pseudokirchneriella subcapitata: Model development and validation with surface waters. Science of the Total Environment 407:1901-1914.","169"]
["Freshwater/metal/plant","169-26",85,0.87628865979381443,"","Pseudokirchneriella subcapitata","exponentially growing cells","72 h","EC10","Growth rate",180,"Microalga","Chlorophyta","Chlorophyceae","Freshwater","25°C","Chronic",7.16,"N.A.","Deleebeeck, N.M.E., de Schamphelaere, K.A.C and Janssen, C.R. (2009). Effects of Mg2+ and H+ on the toxicity of Ni2+ to the unicellular green alga Pseudokirchneriella subcapitata: Model development and validation with surface waters. Science of the Total Environment 407:1901-1914.","169"]
["Freshwater/metal/plant","5-1",86,0.88659793814432986,"Good paper for modelling; also quotes EC10 as Ni2+ activity, EC20 , EC50. Media is natural water (i.e. with OC) with measured major ions, DOC and pH control","Pseudokirchneriella subcapitata","4 days old (exponential growth phase)","48 h","EC10","Growth rate (cell division rate)",180,"Microalga","Chlorophyta","Chlorophyceae","Freshwater",24,"Chronic",7.2,"N.A.","Nys, C., Van Regenmortel, T., Janssen, C.R., Blust, R., Smolders, E. and De Schamphelaere, K.A.C. (2017) Comparison of chronic mixture toxicity of nickel-zinc-copper and nickel-zinc-copper-cadmium mixtures between Ceriodaphnia dubia and Pseudokirchneriella subcapitata. Environmental Toxicology and Chemistry, 36:1056–1066.","5"]
["Freshwater/metal/non- plant","165-12",85,0.85,"","Hydra viridissima","asexually reproducing (budding) hydriods","96 h","EC10","population growth",175,"Microinvertebrate","Cnidaria","Hydrozoa","Freshwater","27 ± 2","Chronic",7.2,"N.A.","Peters, A. Merrington, G. Kosmala-Grzechnik, S. (2014). Parameterisation of Biotic Ligand Models for nickel to Australian Test Species. Wca environment Project Number P0313-12-13, 41 pp.","165"]
["Freshwater/metal/plant","162-47",93,0.95876288659793818,"","Lemna minor","3-frond colonies","7 d","NOEC","growth rate (root length)",174,"Macrophyte","Tracheophyta","Liliopsida","Freshwater","25 ± 1","Chronic",8.3000000000000007,"N.A.","Schlekat, C. E., Genderen, E. V., De Schamphelaerem K. A. C., Antunes, P. M. C., Rogevich, E. C., and Stubblefield, W. A. (2010) Cross-species extrpolation of chronic nickel Biotic Ligand Models. Science of the Total Environment 408, 6148-6157.","162"]
["Freshwater/metal/plant","175-5",88,0.90721649484536082,"","Pediastrum duplex meyan (in multispecies assay)","exponentially growing cells","72 h","EC10","Growth rate",173,"Microalga","Chlorophyta","Chlorophyceae","Freshwater",27,"Chronic",7.5,"N.A.","McKnight et al 2018 (unpublished data)","175"]
["Freshwater/metal/non- plant","168-3",79,0.79,"","Pimephales promelas","swim up fry","17 d","NOEC","mortality",173,"Fish","Chordata","Actinopterygii","Freshwater","14.4 ± 0.2","Chronic",7.19,"N.A.","Deleebeeck, N.M.E., de Schamphelaere, K.A.C and Janssen, C.R. (2007). A bioavailability model predicting the toxicity of nickel to rainbow trout (Oncorhynchus mykiss) and fathead minnow (Pimephales  promelas) in synthetic and natural waters. Ecotoxicolgy and Environmental Safety 67:1-13.","168","17-d LC50 values also available"]
["Freshwater/metal/non- plant","168-10",79,0.79,"","Pimephales promelas","swim up fry","17 d","NOEC","mortality",172,"Fish","Chordata","Actinopterygii","Freshwater","14.1 ± 0.17","Chronic",7.52,"N.A.","Deleebeeck, N.M.E., de Schamphelaere, K.A.C and Janssen, C.R. (2007). A bioavailability model predicting the toxicity of nickel to rainbow trout (Oncorhynchus mykiss) and fathead minnow (Pimephales  promelas) in synthetic and natural waters. Ecotoxicolgy and Environmental Safety 67:1-13.","168","17-d LC50 values also available"]
["Freshwater/metal/non- plant","168-9",79,0.79,"","Pimephales promelas","swim up fry","17 d","NOEC","mortality",170,"Fish","Chordata","Actinopterygii","Freshwater","13.7 ± 0.12","Chronic",7.59,"N.A.","Deleebeeck, N.M.E., de Schamphelaere, K.A.C and Janssen, C.R. (2007). A bioavailability model predicting the toxicity of nickel to rainbow trout (Oncorhynchus mykiss) and fathead minnow (Pimephales  promelas) in synthetic and natural waters. Ecotoxicolgy and Environmental Safety 67:1-13.","168","17-d LC50 values also available"]
["Freshwater/metal/plant","169-12",85,0.87628865979381443,"","Pseudokirchneriella subcapitata","exponentially growing cells","72 h","EC10","Growth rate",162,"Microalga","Chlorophyta","Chlorophyceae","Freshwater","25°C","Chronic",7.53,"N.A.","Deleebeeck, N.M.E., de Schamphelaere, K.A.C and Janssen, C.R. (2009). Effects of Mg2+ and H+ on the toxicity of Ni2+ to the unicellular green alga Pseudokirchneriella subcapitata: Model development and validation with surface waters. Science of the Total Environment 407:1901-1914.","169"]
["Freshwater/metal/non- plant","13-3",70,0.67,"The highest possible grade for this datum is acceptable.","Daphnia magna","Neonate (<1 d)","21 d","NOEC","Survival",160,"Microinvertebrate - microcrustacean","Arthropoda","Branchiopoda","Freshwater",21,"Chronic",7.7,"N.A.","Kszos, L.A., Stewart, A.J. and Taylor, P.A. (1992) An evaluation of nickel toxicity to Ceriodaphnia dubia and Daphnia magna in a contaminated stream and in laboratory tests. Environmental Toxicology and Chemistry 11:1001–1012","13"]
["Freshwater/metal/non- plant","167-70",84,0.84,"","Daphnia magna","<24h old neonate","21 d","EC20","Reproduction",160,"Microinvertebrate","Arthropoda","Branchiopoda","Freshwater","NR","Chronic",8.09,"N.A.","Deleebeeck, N.M.E., de Schamphelaere, K.A.C. and Janssen, C.R. (2008). A Novel method for predicting chronic bioavailability and toxicity to Daphnia magna in artificial and natural waters. Environemtnal Toxicology and Chemistry 27: 2097-2107.","167","1.0 µg/L Ni in base water"]
["Freshwater/metal/plant","169-35",88,0.90721649484536082,"","Pseudokirchneriella subcapitata","exponentially growing cells","72 h","EC10","Growth rate",154,"Microalga","Chlorophyta","Chlorophyceae","Freshwater","25°C","Chronic","7.99/8.01","N.A.","Deleebeeck, N.M.E., de Schamphelaere, K.A.C and Janssen, C.R. (2009). Effects of Mg2+ and H+ on the toxicity of Ni2+ to the unicellular green alga Pseudokirchneriella subcapitata: Model development and validation with surface waters. Science of the Total Environment 407:1901-1914.","169"]
["Freshwater/metal/plant","169-40",88,0.90721649484536082,"","Pseudokirchneriella subcapitata","exponentially growing cells","72 h","EC10","Growth rate",154,"Microalga","Chlorophyta","Chlorophyceae","Freshwater","25°C","Chronic",6.53,"N.A.","Deleebeeck, N.M.E., de Schamphelaere, K.A.C and Janssen, C.R. (2009). Effects of Mg2+ and H+ on the toxicity of Ni2+ to the unicellular green alga Pseudokirchneriella subcapitata: Model development and validation with surface waters. Science of the Total Environment 407:1901-1914.","169"]
["Freshwater/metal/plant","169-56",85,0.87628865979381443,"","Pseudokirchneriella subcapitata","exponentially growing cells","72 h","NOEC","Growth rate",154,"Microalga","Chlorophyta","Chlorophyceae","Freshwater","25°C","Chronic",7.54,"N.A.","Deleebeeck, N.M.E., de Schamphelaere, K.A.C and Janssen, C.R. (2009). Effects of Mg2+ and H+ on the toxicity of Ni2+ to the unicellular green alga Pseudokirchneriella subcapitata: Model development and validation with surface waters. Science of the Total Environment 407:1901-1914.","169"]
["Freshwater/metal/plant","165-6",85,0.85,"","Lemna aequinoctialis","6 fronds","96 h","EC10","growth (yield)",151,"Macrophyte","Tracheophyta","Liliopsida","Freshwater","29 ± 2","Chronic",7.3,"N.A.","Peters, A. Merrington, G. Kosmala-Grzechnik, S. (2014). Parameterisation of Biotic Ligand Models for nickel to Australian Test Species. Wca environment Project Number P0313-12-13, 41 pp.","165"]
["Freshwater/metal/plant","165-3",85,0.85,"","Chlorella sp","exponentially growing cells","72 h","EC10","Growth rate",148,"Microalga","Chlorophyta","Chlorophyceae","Freshwater","29 ± 2","Chronic",8.1999999999999993,"N.A.","Peters, A. Merrington, G. Kosmala-Grzechnik, S. (2014). Parameterisation of Biotic Ligand Models for nickel to Australian Test Species. Wca environment Project Number P0313-12-13, 41 pp.","165"]
["Freshwater/metal/plant","169-24",85,0.87628865979381443,"","Pseudokirchneriella subcapitata","exponentially growing cells","72 h","EC10","Growth rate",145,"Microalga","Chlorophyta","Chlorophyceae","Freshwater","25°C","Chronic",6.08,"N.A.","Deleebeeck, N.M.E., de Schamphelaere, K.A.C and Janssen, C.R. (2009). Effects of Mg2+ and H+ on the toxicity of Ni2+ to the unicellular green alga Pseudokirchneriella subcapitata: Model development and validation with surface waters. Science of the Total Environment 407:1901-1914.","169"]
["Freshwater/metal/plant","169-76",88,0.90721649484536082,"","Pseudokirchneriella subcapitata","exponentially growing cells","72 h","NOEC","Growth rate",145,"Microalga","Chlorophyta","Chlorophyceae","Freshwater","25°C","Chronic","7.37/7.47","N.A.","Deleebeeck, N.M.E., de Schamphelaere, K.A.C and Janssen, C.R. (2009). Effects of Mg2+ and H+ on the toxicity of Ni2+ to the unicellular green alga Pseudokirchneriella subcapitata: Model development and validation with surface waters. Science of the Total Environment 407:1901-1914.","169"]
["Freshwater/metal/non- plant","162-41",82,0.82,"","Brachionus calcyflorus","N.R.","48 h","EC20","Population growth rate",143.9,"Microinvertebrate","Rotifera","Monogononta","Freshwater","25 ± 2","Chronic",7.5,"N.A.","Schlekat, C. E., Genderen, E. V., De Schamphelaerem K. A. C., Antunes, P. M. C., Rogevich, E. C., and Stubblefield, W. A. (2010) Cross-species extrpolation of chronic nickel Biotic Ligand Models. Science of the Total Environment 408, 6148-6157.","162"]
["Freshwater/metal/non- plant","168-6",79,0.79,"","Pimephales promelas","swim up fry","17 d","NOEC","mortality",140,"Fish","Chordata","Actinopterygii","Freshwater","13.5 ± 0.08","Chronic",7.53,"N.A.","Deleebeeck, N.M.E., de Schamphelaere, K.A.C and Janssen, C.R. (2007). A bioavailability model predicting the toxicity of nickel to rainbow trout (Oncorhynchus mykiss) and fathead minnow (Pimephales  promelas) in synthetic and natural waters. Ecotoxicolgy and Environmental Safety 67:1-13.","168","17-d LC50 values also available"]
["Freshwater/metal/non- plant","167-22",84,0.84,"","Daphnia magna","<24h old neonate","21 d","EC10","Reproduction",139,"Microinvertebrate","Arthropoda","Branchiopoda","Freshwater","NR","Chronic",8.09,"N.A.","Deleebeeck, N.M.E., de Schamphelaere, K.A.C. and Janssen, C.R. (2008). A Novel method for predicting chronic bioavailability and toxicity to Daphnia magna in artificial and natural waters. Environemtnal Toxicology and Chemistry 27: 2097-2107.","167","1.0 µg/L Ni in base water"]
["Freshwater/metal/non- plant","8-6",83,0.83,"Data does not specify standard method or test acceptability criteria (assumed good). Replication also unclear","Salmo gairdneri","fertilised eyed eggs","52 d","NOEL","Growth (wet weight)",134,"Fish","Chordata","Actinopterygii","Freshwater",12.5,"Chronic",7.1,"N.A.","Nebeker, A.V., Savonen, C. and Stevens, D.G. (1985) Sensitivity of rainbow trout early life stages to nickel chloride. Environmental Toxicology and Chemsistry, 4:233–239.","8"]
["Freshwater/metal/non- plant","8-8",83,0.83,"Data does not specify standard method or test acceptability criteria (assumed good). Replication also unclear","Salmo gairdneri","larvae (pre-swim up)","38 d","NOEL","Growth (fork length)",134,"Fish","Chordata","Actinopterygii","Freshwater",12.7,"Chronic",7.2,"N.A.","Nebeker, A.V., Savonen, C. and Stevens, D.G. (1985) Sensitivity of rainbow trout early life stages to nickel chloride. Environmental Toxicology and Chemsistry, 4:233–239.","8"]
["Freshwater/metal/non- plant","8-9",83,0.83,"Data does not specify standard method or test acceptability criteria (assumed good). Replication also unclear","Salmo gairdneri","larvae (pre-swim up)","38 d","NOEL","Growth (wet weight)",134,"Fish","Chordata","Actinopterygii","Freshwater",12.7,"Chronic",7.2,"N.A.","Nebeker, A.V., Savonen, C. and Stevens, D.G. (1985) Sensitivity of rainbow trout early life stages to nickel chloride. Environmental Toxicology and Chemsistry, 4:233–239.","8"]
["Freshwater/metal/plant","169-77",88,0.90721649484536082,"","Pseudokirchneriella subcapitata","exponentially growing cells","72 h","NOEC","Growth rate",132,"Microalga","Chlorophyta","Chlorophyceae","Freshwater","25°C","Chronic","7.37/7.47","N.A.","Deleebeeck, N.M.E., de Schamphelaere, K.A.C and Janssen, C.R. (2009). Effects of Mg2+ and H+ on the toxicity of Ni2+ to the unicellular green alga Pseudokirchneriella subcapitata: Model development and validation with surface waters. Science of the Total Environment 407:1901-1914.","169"]
["Freshwater/metal/plant","4-1",86,0.876,"Good paper for modelling; also quotes EC10 as Ni2+ activity, EC20 , EC50 but discrepenciies with Mg concentrations in media","Pseudokirchneriella subcapitata","4 days old (exponential growth phase)","72 h","EC10","Growth rate (cell division rate)",132,"Microalga","Chlorophyta","Chlorophyceae","Freshwater","25°C","Chronic",8.17,"N.A.","Nys, C., Janssen, C/R., Van Sprang, P. and De Schamphelaere, K.A.C. (2016) The effect of pH on chronic aquatic nickel toxicity is dependent on the pH itself: Extending the chronic nickel bioavailability models. Environmental Toxicology and Chemistry, 35:1097–1106.","4"]
["Freshwater/metal/non- plant","167-72",84,0.84,"","Daphnia magna","<24h old neonate","21 d","EC20","Reproduction",129,"Microinvertebrate","Arthropoda","Branchiopoda","Freshwater","NR","Chronic",8.02,"N.A.","Deleebeeck, N.M.E., de Schamphelaere, K.A.C. and Janssen, C.R. (2008). A Novel method for predicting chronic bioavailability and toxicity to Daphnia magna in artificial and natural waters. Environemtnal Toxicology and Chemistry 27: 2097-2107.","167","6.0 µg/L Ni in base water"]
["Freshwater/metal/non- plant","9-1",75,0.75,"Data does not specify standard method or test acceptability criteria (assumed good). Replication also unclear","Juga plicifera","Adults","21 d","NOEL","Survival",124,"Macroinvertebrate","Mullusca","Gastropoda","Freshwater",15,"Chronic",7.1,"N.A.","Nebeker, A.V., Stinchfield, A., Savonen, C. and Chapman, G.A. (1986) Effects of copper, nickel and zinc on three species of Oregon freshwater snails. Environmental Toxicology and Chemsistry, 5:807–811.","9"]
["Freshwater/metal/plant","169-11",85,0.87628865979381443,"","Pseudokirchneriella subcapitata","exponentially growing cells","72 h","EC10","Growth rate",124,"Microalga","Chlorophyta","Chlorophyceae","Freshwater","25°C","Chronic",7.52,"N.A.","Deleebeeck, N.M.E., de Schamphelaere, K.A.C and Janssen, C.R. (2009). Effects of Mg2+ and H+ on the toxicity of Ni2+ to the unicellular green alga Pseudokirchneriella subcapitata: Model development and validation with surface waters. Science of the Total Environment 407:1901-1914.","169"]
["Freshwater/metal/plant","165-2",85,0.85,"","Chlorella sp","exponentially growing cells","72 h","EC10","Growth rate",122,"Microalga","Chlorophyta","Chlorophyceae","Freshwater","29 ± 2","Chronic",7.2,"N.A.","Peters, A. Merrington, G. Kosmala-Grzechnik, S. (2014). Parameterisation of Biotic Ligand Models for nickel to Australian Test Species. Wca environment Project Number P0313-12-13, 41 pp.","165"]
["Freshwater/metal/non- plant","167-24",84,0.84,"","Daphnia magna","<24h old neonate","21 d","EC10","Reproduction",117,"Microinvertebrate","Arthropoda","Branchiopoda","Freshwater","NR","Chronic",8.02,"N.A.","Deleebeeck, N.M.E., de Schamphelaere, K.A.C. and Janssen, C.R. (2008). A Novel method for predicting chronic bioavailability and toxicity to Daphnia magna in artificial and natural waters. Environemtnal Toxicology and Chemistry 27: 2097-2107.","167","6.0 µg/L Ni in base water"]
["Freshwater/metal/non- plant","177-10",93,0.93,"","Melanotaenia splendida splendida","embryo","12-d","EC50","Embryo hatching success/imbalance",116,"Fish","Chordata","Actinopterygii","Tea Tree River","25 ± 2","Chronic","6.9-7.2","N.A.","Ecotox Services Australia. 2014. Toxicity of Nickel Under Varying Physico-chemical Conditions. Prepared for Nickel Producers Environmental Research Association (NiPERA). Test Report. May 2014.","177"]
["Freshwater/metal/non- plant","171-9",83,0.83,"","Daphnia longispina","<48h old neonate","17 d","EC10","Reproduction",113,"Microinvertebrate","Arthropoda","Branchiopoda","Freshwater","20°C","Chronic",7.18,"N.A.","Deleebeeck, N.M. E, Muyssen, B.T.A, De Laender, F, Janssen, C.R., De Schamphelaere, K.A.C (2007). Comparison of nickel toxicity to cladocerans in soft versus hard surface waters, Aquatic Toxicology 84: 223-235.","171"]
["Freshwater/metal/non- plant","177-14",93,0.93,"","Melanotaenia splendida splendida","embryo","13 days","NOEC","Embryo hatching success/imbalance",110,"Fish","Chordata","Actinopterygii","Wellington River","25 ± 2","Chronic","7.7-7.9","N.A.","Ecotox Services Australia. 2014. Toxicity of Nickel Under Varying Physico-chemical Conditions. Prepared for Nickel Producers Environmental Research Association (NiPERA). Test Report. May 2014.","177"]
["Freshwater/metal/non- plant","4-5",82,0.82,"Good paper for modelling; also quotes EC10 as Ni2+ activity, EC20 , EC50 but discrepenciies with Mg concentrations in media","Daphnia magna","Neonate (<1 d)","21 d","EC10","Reproduction",109,"Macroinvertebrate - crustacean","Arthropoda","Branchiopoda","Freshwater",20,"Chronic",8.16,"N.A.","Nys, C., Janssen, C/R., Van Sprang, P. and De Schamphelaere, K.A.C. (2016) The effect of pH on chronic aquatic nickel toxicity is dependent on the pH itself: Extending the chronic nickel bioavailability models. Environmental Toxicology and Chemistry, 35:1097–1106.","4"]
["Freshwater/metal/plant","169-10",85,0.87628865979381443,"","Pseudokirchneriella subcapitata","exponentially growing cells","72 h","EC10","Growth rate",108,"Microalga","Chlorophyta","Chlorophyceae","Freshwater","25°C","Chronic",7.5,"N.A.","Deleebeeck, N.M.E., de Schamphelaere, K.A.C and Janssen, C.R. (2009). Effects of Mg2+ and H+ on the toxicity of Ni2+ to the unicellular green alga Pseudokirchneriella subcapitata: Model development and validation with surface waters. Science of the Total Environment 407:1901-1914.","169"]
["Freshwater/metal/plant","169-69",85,0.87628865979381443,"","Pseudokirchneriella subcapitata","exponentially growing cells","72 h","NOEC","Growth rate",104,"Microalga","Chlorophyta","Chlorophyceae","Freshwater","25°C","Chronic",7.16,"N.A.","Deleebeeck, N.M.E., de Schamphelaere, K.A.C and Janssen, C.R. (2009). Effects of Mg2+ and H+ on the toxicity of Ni2+ to the unicellular green alga Pseudokirchneriella subcapitata: Model development and validation with surface waters. Science of the Total Environment 407:1901-1914.","169"]
["Freshwater/metal/non- plant","162-40",82,0.82,"","Brachionus calcyflorus","N.R.","48 h","EC10","Population growth rate",103.9,"Microinvertebrate","Rotifera","Monogononta","Freshwater","25 ± 2","Chronic",7.5,"N.A.","Schlekat, C. E., Genderen, E. V., De Schamphelaerem K. A. C., Antunes, P. M. C., Rogevich, E. C., and Stubblefield, W. A. (2010) Cross-species extrpolation of chronic nickel Biotic Ligand Models. Science of the Total Environment 408, 6148-6157.","162"]
["Freshwater/metal/plant","154-22",81,0.83505154639175261,"","Coelastrum microporum","exponentially growing cells","72 h","EC10","Growth rate",100,"Microalga","Chlorophyta","Chlorophyceae","Freshwater","25°C","Chronic","N.R.","N.A.","Deleebeeck, N.M.E. De Laender, F., Chepurnov, V.A., Vyerman, W., Janseen, C.R. De Schamphelaere, K.A.C. (2009). A single bioavailability model can accurately predict Ni toxicity to green microalgae in soft and hard surface waters. Water Research 43:1935-1947.","154"]
["Freshwater/metal/plant","169-82",88,0.90721649484536082,"","Pseudokirchneriella subcapitata","exponentially growing cells","72 h","NOEC","Growth rate",98.6,"Microalga","Chlorophyta","Chlorophyceae","Freshwater","25°C","Chronic",7.29,"N.A.","Deleebeeck, N.M.E., de Schamphelaere, K.A.C and Janssen, C.R. (2009). Effects of Mg2+ and H+ on the toxicity of Ni2+ to the unicellular green alga Pseudokirchneriella subcapitata: Model development and validation with surface waters. Science of the Total Environment 407:1901-1914.","169"]
["Freshwater/metal/non- plant","15-5",81,0.81,"Multigenerational study : this data is for first generation (endpoint 3rd brood)","Daphnia magna","Neonate (<1 d)","3rd brood (in control)","EC10","Reproduction",98.5,"Macroinvertebrate","Arthropoda","Branchiopoda","Freshwater",25,"Chronic",8,"N.A.","Pereira, C.M.S., Everaert, G., Blust, R. and De Schamphelaere K.A.C. (2018) Multigenerational effects of nickel on Daphnia magna depend on temperature and the magnitude of the effect in the first generation. Environmental Toxicology and Chemistry 37:1877–1888",15]
["Freshwater/metal/plant","169-43",85,0.87628865979381443,"","Pseudokirchneriella subcapitata","exponentially growing cells","72 h","EC10","Growth rate",98.5,"Microalga","Chlorophyta","Chlorophyceae","Freshwater","25°C","Chronic",7.42,"N.A.","Deleebeeck, N.M.E., de Schamphelaere, K.A.C and Janssen, C.R. (2009). Effects of Mg2+ and H+ on the toxicity of Ni2+ to the unicellular green alga Pseudokirchneriella subcapitata: Model development and validation with surface waters. Science of the Total Environment 407:1901-1914.","169"]
["Freshwater/metal/plant","154-42",81,0.83505154639175261,"","Chlorella sp.","exponentially growing cells","72 h","NOEC","Growth rate",98.2,"Microalga","Chlorophyta","Chlorophyceae","Freshwater","25°C","Chronic","N.R.","N.A.","Deleebeeck, N.M.E. De Laender, F., Chepurnov, V.A., Vyerman, W., Janseen, C.R. De Schamphelaere, K.A.C. (2009). A single bioavailability model can accurately predict Ni toxicity to green microalgae in soft and hard surface waters. Water Research 43:1935-1947.","154"]
["Freshwater/metal/plant","154-5",81,0.83505154639175261,"","Desmodesmus sp","exponentially growing cells","72 h","EC10","Growth rate",98,"Microalga","Chlorophyta","Chlorophyceae","Freshwater","25°C","Chronic","N.R.","N.A.","Deleebeeck, N.M.E. De Laender, F., Chepurnov, V.A., Vyerman, W., Janseen, C.R. De Schamphelaere, K.A.C. (2009). A single bioavailability model can accurately predict Ni toxicity to green microalgae in soft and hard surface waters. Water Research 43:1935-1947.","154"]
["Freshwater/metal/plant","169-83",88,0.90721649484536082,"","Pseudokirchneriella subcapitata","exponentially growing cells","72 h","NOEC","Growth rate",97.7,"Microalga","Chlorophyta","Chlorophyceae","Freshwater","25°C","Chronic",6.53,"N.A.","Deleebeeck, N.M.E., de Schamphelaere, K.A.C and Janssen, C.R. (2009). Effects of Mg2+ and H+ on the toxicity of Ni2+ to the unicellular green alga Pseudokirchneriella subcapitata: Model development and validation with surface waters. Science of the Total Environment 407:1901-1914.","169"]
["Freshwater/metal/plant","154-8",81,0.83505154639175261,"","Desmodesmus sp","exponentially growing cells","72 h","NOEC","Growth rate",96.2,"Microalga","Chlorophyta","Chlorophyceae","Freshwater","25°C","Chronic","N.R.","N.A.","Deleebeeck, N.M.E. De Laender, F., Chepurnov, V.A., Vyerman, W., Janseen, C.R. De Schamphelaere, K.A.C. (2009). A single bioavailability model can accurately predict Ni toxicity to green microalgae in soft and hard surface waters. Water Research 43:1935-1947.","154"]
["Freshwater/metal/non- plant","177-8",93,0.93,"","Melanotaenia splendida splendida","embryo","12-d","EC50","Embryo hatching success/imbalance",96,"Fish","Chordata","Actinopterygii","Peechalba River","25 ± 2","Chronic","7.9-8.10","N.A.","Ecotox Services Australia. 2014. Toxicity of Nickel Under Varying Physico-chemical Conditions. Prepared for Nickel Producers Environmental Research Association (NiPERA). Test Report. May 2014.","177"]
["Freshwater/metal/non- plant","4-6",82,0.82,"Good paper for modelling; also quotes EC10 as Ni2+ activity, EC20 , EC50 but discrepenciies with Mg concentrations in media","Daphnia magna","Neonate (<1 d)","21 d","EC10","Reproduction",94,"Macroinvertebrate - crustacean","Arthropoda","Branchiopoda","Freshwater",20,"Chronic",8.67,"N.A.","Nys, C., Janssen, C/R., Van Sprang, P. and De Schamphelaere, K.A.C. (2016) The effect of pH on chronic aquatic nickel toxicity is dependent on the pH itself: Extending the chronic nickel bioavailability models. Environmental Toxicology and Chemistry, 35:1097–1106.","4"]
["Freshwater/metal/non- plant","15-3",81,0.81,"Multigenerational study : this data is for first generation (endpoint 5th brood)","Daphnia magna","Neonate (<1 d)","5th brood (in control)","EC10","Reproduction",93.3,"Macroinvertebrate","Arthropoda","Branchiopoda","Freshwater",25,"Chronic",8,"N.A.","Pereira, C.M.S., Everaert, G., Blust, R. and De Schamphelaere K.A.C. (2018) Multigenerational effects of nickel on Daphnia magna depend on temperature and the magnitude of the effect in the first generation. Environmental Toxicology and Chemistry 37:1877–1888",15]
["Freshwater/metal/plant","169-30",85,0.87628865979381443,"","Pseudokirchneriella subcapitata","exponentially growing cells","72 h","EC10","Growth rate",91.2,"Microalga","Chlorophyta","Chlorophyceae","Freshwater","25°C","Chronic",7.85,"N.A.","Deleebeeck, N.M.E., de Schamphelaere, K.A.C and Janssen, C.R. (2009). Effects of Mg2+ and H+ on the toxicity of Ni2+ to the unicellular green alga Pseudokirchneriella subcapitata: Model development and validation with surface waters. Science of the Total Environment 407:1901-1914.","169"]
["Freshwater/metal/plant","154-43",81,0.83505154639175261,"","Chlorella sp.","exponentially growing cells","72 h","EC10","Growth rate",90.5,"Microalga","Chlorophyta","Chlorophyceae","Freshwater","25°C","Chronic","N.R.","N.A.","Deleebeeck, N.M.E. De Laender, F., Chepurnov, V.A., Vyerman, W., Janseen, C.R. De Schamphelaere, K.A.C. (2009). A single bioavailability model can accurately predict Ni toxicity to green microalgae in soft and hard surface waters. Water Research 43:1935-1947.","154"]
["Freshwater/metal/non- plant","10-1",69,0.69,"very basic paper (tested 73 chemicals)","Daphnia magna","Neonate (<1 d)","21 d","NOEC","Reproduction",90,"Macroinvertebrate","Arthropoda","Branchiopoda","Freshwater",25,"Chronic",8,"N.A.","Kuhn, R.., Pattard, M., Pernak, K-D. and Winter, A. (1989) Results of the harmful effects of water pollutants to Daphnia magna in the 21 day reproductive test. Water Research, 23:510-510","10"]
["Freshwater/metal/non- plant","10-2",69,0.69,"very basic paper (tested 73 chemicals)","Daphnia magna","Neonate (<1 d)","21 d","NOEC","Survival",90,"Macroinvertebrate","Arthropoda","Branchiopoda","Freshwater",25,"Chronic",8,"N.A.","Kuhn, R.., Pattard, M., Pernak, K-D. and Winter, A. (1989) Results of the harmful effects of water pollutants to Daphnia magna in the 21 day reproductive test. Water Research, 23:510-510","10"]
["Freshwater/metal/non- plant","167-46",84,0.84,"","Daphnia magna","<24h old neonate","21 d","NOEC","Reproduction",90,"Microinvertebrate","Arthropoda","Branchiopoda","Freshwater","NR","Chronic",8.09,"N.A.","Deleebeeck, N.M.E., de Schamphelaere, K.A.C. and Janssen, C.R. (2008). A Novel method for predicting chronic bioavailability and toxicity to Daphnia magna in artificial and natural waters. Environemtnal Toxicology and Chemistry 27: 2097-2107.","167","1.0 µg/L Ni in base water"]
["Freshwater/metal/non- plant","167-48",84,0.84,"","Daphnia magna","<24h old neonate","21 d","NOEC","Reproduction",90,"Microinvertebrate","Arthropoda","Branchiopoda","Freshwater","NR","Chronic",8.02,"N.A.","Deleebeeck, N.M.E., de Schamphelaere, K.A.C. and Janssen, C.R. (2008). A Novel method for predicting chronic bioavailability and toxicity to Daphnia magna in artificial and natural waters. Environemtnal Toxicology and Chemistry 27: 2097-2107.","167","6.0 µg/L Ni in base water"]
["Freshwater/metal/plant","169-31",88,0.90721649484536082,"","Pseudokirchneriella subcapitata","exponentially growing cells","72 h","EC10","Growth rate",90,"Microalga","Chlorophyta","Chlorophyceae","Freshwater","25°C","Chronic",6.35,"N.A.","Deleebeeck, N.M.E., de Schamphelaere, K.A.C and Janssen, C.R. (2009). Effects of Mg2+ and H+ on the toxicity of Ni2+ to the unicellular green alga Pseudokirchneriella subcapitata: Model development and validation with surface waters. Science of the Total Environment 407:1901-1914.","169"]
["Freshwater/metal/plant","169-55",85,0.87628865979381443,"","Pseudokirchneriella subcapitata","exponentially growing cells","72 h","NOEC","Growth rate",88.9,"Microalga","Chlorophyta","Chlorophyceae","Freshwater","25°C","Chronic",7.53,"N.A.","Deleebeeck, N.M.E., de Schamphelaere, K.A.C and Janssen, C.R. (2009). Effects of Mg2+ and H+ on the toxicity of Ni2+ to the unicellular green alga Pseudokirchneriella subcapitata: Model development and validation with surface waters. Science of the Total Environment 407:1901-1914.","169"]
["Freshwater/metal/plant","169-32",88,0.90721649484536082,"","Pseudokirchneriella subcapitata","exponentially growing cells","72 h","EC10","Growth rate",88.2,"Microalga","Chlorophyta","Chlorophyceae","Freshwater","25°C","Chronic",6.35,"N.A.","Deleebeeck, N.M.E., de Schamphelaere, K.A.C and Janssen, C.R. (2009). Effects of Mg2+ and H+ on the toxicity of Ni2+ to the unicellular green alga Pseudokirchneriella subcapitata: Model development and validation with surface waters. Science of the Total Environment 407:1901-1914.","169"]
["Freshwater/metal/plant","154-1",81,0.83505154639175261,"","Desmodesmus sp","exponentially growing cells","72 h","EC10","Growth rate",86.8,"Microalga","Chlorophyta","Chlorophyceae","Freshwater","25°C","Chronic","N.R.","N.A.","Deleebeeck, N.M.E. De Laender, F., Chepurnov, V.A., Vyerman, W., Janseen, C.R. De Schamphelaere, K.A.C. (2009). A single bioavailability model can accurately predict Ni toxicity to green microalgae in soft and hard surface waters. Water Research 43:1935-1947.","154"]
["Freshwater/metal/non- plant","176-7",56,0.56000000000000005,"","Hydra viridissima","asexually reproducing (budding) hydriods","96 h","EC10","population growth",86,"Microinvertebrate","Cnidaria","Hydrozoa","Synthetic Magela Creek Water (SMCW)","27 oC","Chronic",6.5,"N.A.","Peters A and Merrington G (2015) Nickel toxicity to Hydra viridissima in soft waters. Report by wca environment Ltd. Project PO-439 Oxfordshire, United Kingdom.","176"]
["Freshwater/metal/non- plant","167-59",81,0.81,"","Daphnia magna","<24h old neonate","21 d","EC20","Reproduction",84.3,"Microinvertebrate","Arthropoda","Branchiopoda","Freshwater","NR","Chronic",6.8,"N.A.","Deleebeeck, N.M.E., de Schamphelaere, K.A.C. and Janssen, C.R. (2008). A Novel method for predicting chronic bioavailability and toxicity to Daphnia magna in artificial and natural waters. Environemtnal Toxicology and Chemistry 27: 2097-2107.","167"]
["Freshwater/metal/plant","169-53",85,0.87628865979381443,"","Pseudokirchneriella subcapitata","exponentially growing cells","72 h","NOEC","Growth rate",83,"Microalga","Chlorophyta","Chlorophyceae","Freshwater","25°C","Chronic",7.5,"N.A.","Deleebeeck, N.M.E., de Schamphelaere, K.A.C and Janssen, C.R. (2009). Effects of Mg2+ and H+ on the toxicity of Ni2+ to the unicellular green alga Pseudokirchneriella subcapitata: Model development and validation with surface waters. Science of the Total Environment 407:1901-1914.","169"]
["Freshwater/metal/plant","169-78",88,0.90721649484536082,"","Pseudokirchneriella subcapitata","exponentially growing cells","72 h","NOEC","Growth rate",78.400000000000006,"Microalga","Chlorophyta","Chlorophyceae","Freshwater","25°C","Chronic","7.99/8.01","N.A.","Deleebeeck, N.M.E., de Schamphelaere, K.A.C and Janssen, C.R. (2009). Effects of Mg2+ and H+ on the toxicity of Ni2+ to the unicellular green alga Pseudokirchneriella subcapitata: Model development and validation with surface waters. Science of the Total Environment 407:1901-1914.","169"]
["Freshwater/metal/non- plant","177-4",93,0.93,"","Melanotaenia splendida splendida","embryo","13 days","EC10","Embryo hatching success/imbalance",77,"Fish","Chordata","Actinopterygii","Wellington River","25 ± 2","Chronic","7.7-7.9","N.A.","Ecotox Services Australia. 2014. Toxicity of Nickel Under Varying Physico-chemical Conditions. Prepared for Nickel Producers Environmental Research Association (NiPERA). Test Report. May 2014.","177"]
["Freshwater/metal/non- plant","167-11",81,0.81,"","Daphnia magna","<24h old neonate","21 d","EC10","Reproduction",76.7,"Microinvertebrate","Arthropoda","Branchiopoda","Freshwater","NR","Chronic",6.8,"N.A.","Deleebeeck, N.M.E., de Schamphelaere, K.A.C. and Janssen, C.R. (2008). A Novel method for predicting chronic bioavailability and toxicity to Daphnia magna in artificial and natural waters. Environemtnal Toxicology and Chemistry 27: 2097-2107.","167"]
["Freshwater/metal/plant","169-9",85,0.87628865979381443,"","Pseudokirchneriella subcapitata","exponentially growing cells","72 h","EC10","Growth rate",75.2,"Microalga","Chlorophyta","Chlorophyceae","Freshwater","25°C","Chronic",7.51,"N.A.","Deleebeeck, N.M.E., de Schamphelaere, K.A.C and Janssen, C.R. (2009). Effects of Mg2+ and H+ on the toxicity of Ni2+ to the unicellular green alga Pseudokirchneriella subcapitata: Model development and validation with surface waters. Science of the Total Environment 407:1901-1914.","169"]
["Freshwater/metal/plant","4-2",86,0.876,"Good paper for modelling; also quotes EC10 as Ni2+ activity, EC20 , EC50 but discrepenciies with Mg concentrations in media","Pseudokirchneriella subcapitata","4 days old (exponential growth phase)","72 h","EC10","Growth rate (cell division rate)",75,"Microalga","Chlorophyta","Chlorophyceae","Freshwater","25°C","Chronic",8.65,"N.A.","Nys, C., Janssen, C/R., Van Sprang, P. and De Schamphelaere, K.A.C. (2016) The effect of pH on chronic aquatic nickel toxicity is dependent on the pH itself: Extending the chronic nickel bioavailability models. Environmental Toxicology and Chemistry, 35:1097–1106.","4"]
["Freshwater/metal/plant","162-48",93,0.95876288659793818,"","Lemna minor","3-frond colonies","7 d","EC10","growth rate (root length)",73.900000000000006,"Macrophyte","Tracheophyta","Liliopsida","Freshwater","25 ± 1","Chronic",8,"N.A.","Schlekat, C. E., Genderen, E. V., De Schamphelaerem K. A. C., Antunes, P. M. C., Rogevich, E. C., and Stubblefield, W. A. (2010) Cross-species extrpolation of chronic nickel Biotic Ligand Models. Science of the Total Environment 408, 6148-6157.","162"]
["Freshwater/metal/plant","169-36",88,0.90721649484536082,"","Pseudokirchneriella subcapitata","exponentially growing cells","72 h","EC10","Growth rate",73.7,"Microalga","Chlorophyta","Chlorophyceae","Freshwater","25°C","Chronic","7.99/8.01","N.A.","Deleebeeck, N.M.E., de Schamphelaere, K.A.C and Janssen, C.R. (2009). Effects of Mg2+ and H+ on the toxicity of Ni2+ to the unicellular green alga Pseudokirchneriella subcapitata: Model development and validation with surface waters. Science of the Total Environment 407:1901-1914.","169"]
["Freshwater/metal/non- plant","167-60",81,0.81,"","Daphnia magna","<24h old neonate","21 d","EC20","Reproduction",73.2,"Microinvertebrate","Arthropoda","Branchiopoda","Freshwater","NR","Chronic",6.81,"N.A.","Deleebeeck, N.M.E., de Schamphelaere, K.A.C. and Janssen, C.R. (2008). A Novel method for predicting chronic bioavailability and toxicity to Daphnia magna in artificial and natural waters. Environemtnal Toxicology and Chemistry 27: 2097-2107.","167"]
["Freshwater/metal/plant","169-75",88,0.90721649484536082,"","Pseudokirchneriella subcapitata","exponentially growing cells","72 h","NOEC","Growth rate",73,"Microalga","Chlorophyta","Chlorophyceae","Freshwater","25°C","Chronic",6.35,"N.A.","Deleebeeck, N.M.E., de Schamphelaere, K.A.C and Janssen, C.R. (2009). Effects of Mg2+ and H+ on the toxicity of Ni2+ to the unicellular green alga Pseudokirchneriella subcapitata: Model development and validation with surface waters. Science of the Total Environment 407:1901-1914.","169"]
["Freshwater/metal/non- plant","177-6",93,0.93,"","Melanotaenia splendida splendida","embryo","12-d","EC50","Embryo hatching success/imbalance",72,"Fish","Chordata","Actinopterygii","Woronora River water","25 ± 2","Chronic","7.1-7.4","N.A.","Ecotox Services Australia. 2014. Toxicity of Nickel Under Varying Physico-chemical Conditions. Prepared for Nickel Producers Environmental Research Association (NiPERA). Test Report. May 2014.","177"]
["Freshwater/metal/plant","169-65",85,0.87628865979381443,"","Pseudokirchneriella subcapitata","exponentially growing cells","72 h","NOEC","Growth rate",68.400000000000006,"Microalga","Chlorophyta","Chlorophyceae","Freshwater","25°C","Chronic",6.23,"N.A.","Deleebeeck, N.M.E., de Schamphelaere, K.A.C and Janssen, C.R. (2009). Effects of Mg2+ and H+ on the toxicity of Ni2+ to the unicellular green alga Pseudokirchneriella subcapitata: Model development and validation with surface waters. Science of the Total Environment 407:1901-1914.","169"]
["Freshwater/metal/plant","154-2",81,0.83505154639175261,"","Desmodesmus sp","exponentially growing cells","72 h","EC10","Growth rate",67.7,"Microalga","Chlorophyta","Chlorophyceae","Freshwater","25°C","Chronic","N.R.","N.A.","Deleebeeck, N.M.E. De Laender, F., Chepurnov, V.A., Vyerman, W., Janseen, C.R. De Schamphelaere, K.A.C. (2009). A single bioavailability model can accurately predict Ni toxicity to green microalgae in soft and hard surface waters. Water Research 43:1935-1947.","154"]
["Freshwater/metal/plant","154-6",81,0.83505154639175261,"","Desmodesmus sp","exponentially growing cells","72 h","EC10","Growth rate",67.7,"Microalga","Chlorophyta","Chlorophyceae","Freshwater","25°C","Chronic","N.R.","N.A.","Deleebeeck, N.M.E. De Laender, F., Chepurnov, V.A., Vyerman, W., Janseen, C.R. De Schamphelaere, K.A.C. (2009). A single bioavailability model can accurately predict Ni toxicity to green microalgae in soft and hard surface waters. Water Research 43:1935-1947.","154"]
["Freshwater/metal/plant","169-37",85,0.87628865979381443,"","Pseudokirchneriella subcapitata","exponentially growing cells","72 h","EC10","Growth rate",67.099999999999994,"Microalga","Chlorophyta","Chlorophyceae","Freshwater","25°C","Chronic",7.7,"N.A.","Deleebeeck, N.M.E., de Schamphelaere, K.A.C and Janssen, C.R. (2009). Effects of Mg2+ and H+ on the toxicity of Ni2+ to the unicellular green alga Pseudokirchneriella subcapitata: Model development and validation with surface waters. Science of the Total Environment 407:1901-1914.","169"]
["Freshwater/metal/plant","169-74",88,0.90721649484536082,"","Pseudokirchneriella subcapitata","exponentially growing cells","72 h","NOEC","Growth rate",67.099999999999994,"Microalga","Chlorophyta","Chlorophyceae","Freshwater","25°C","Chronic",6.35,"N.A.","Deleebeeck, N.M.E., de Schamphelaere, K.A.C and Janssen, C.R. (2009). Effects of Mg2+ and H+ on the toxicity of Ni2+ to the unicellular green alga Pseudokirchneriella subcapitata: Model development and validation with surface waters. Science of the Total Environment 407:1901-1914.","169"]
["Freshwater/metal/plant","154-18",81,0.83505154639175261,"","Coelastrum microporum","exponentially growing cells","72 h","EC10","Growth rate",66.7,"Microalga","Chlorophyta","Chlorophyceae","Freshwater","25°C","Chronic","N.R.","N.A.","Deleebeeck, N.M.E. De Laender, F., Chepurnov, V.A., Vyerman, W., Janseen, C.R. De Schamphelaere, K.A.C. (2009). A single bioavailability model can accurately predict Ni toxicity to green microalgae in soft and hard surface waters. Water Research 43:1935-1947.","154"]
["Freshwater/metal/non- plant","7-1",81,0.71,"Data does not specify standard method or test acceptability criteria. Exposure duration unclear (up to 8 month)","Clistoronia magnifica","larvae","8 months","NOEL","Life cycle (second generation larvae)",66,"Macroinvertebrate","Arthropoda","Trichoptera","Freshwater",15,"Chronic","6.8–7.4","N.A.","Nebeker, A.V., Savonen, C., Baker, R.J. and McCrady, J.K. (1984) Effects of copper, nickel and zinc on the life cycle of the caddisfly Clistoronia magnifica (Limnephilidae). Environmental Toxicology and Chemsistry, 3:645–649.","7"]
["Freshwater/metal/non- plant","7-2",71,0.71,"Data does not specify standard method or test acceptability criteria. Exposure duration unclear (up to 8 month)","Clistoronia magnifica","larvae","8 months","NOEL","Life cycle (first generation)",66,"Macroinvertebrate","Arthropoda","Trichoptera","Freshwater",15,"Chronic","6.8–7.4","N.A.","Nebeker, A.V., Savonen, C., Baker, R.J. and McCrady, J.K. (1984) Effects of copper, nickel and zinc on the life cycle of the caddisfly Clistoronia magnifica (Limnephilidae). Environmental Toxicology and Chemsistry, 3:645–649.","7"]
["Freshwater/metal/plant","169-73",85,0.87628865979381443,"","Pseudokirchneriella subcapitata","exponentially growing cells","72 h","NOEC","Growth rate",65,"Microalga","Chlorophyta","Chlorophyceae","Freshwater","25°C","Chronic",7.85,"N.A.","Deleebeeck, N.M.E., de Schamphelaere, K.A.C and Janssen, C.R. (2009). Effects of Mg2+ and H+ on the toxicity of Ni2+ to the unicellular green alga Pseudokirchneriella subcapitata: Model development and validation with surface waters. Science of the Total Environment 407:1901-1914.","169"]
["Freshwater/metal/plant","154-41",81,0.83505154639175261,"","Chlorella sp.","exponentially growing cells","72 h","EC10","Growth rate",64.7,"Microalga","Chlorophyta","Chlorophyceae","Freshwater","25°C","Chronic","N.R.","N.A.","Deleebeeck, N.M.E. De Laender, F., Chepurnov, V.A., Vyerman, W., Janseen, C.R. De Schamphelaere, K.A.C. (2009). A single bioavailability model can accurately predict Ni toxicity to green microalgae in soft and hard surface waters. Water Research 43:1935-1947.","154"]
["Freshwater/metal/non- plant","162-42",82,0.82,"","Brachionus calcyflorus","N.R.","48 h","NOEC","Population growth rate",63.9,"Microinvertebrate","Rotifera","Monogononta","Freshwater","25 ± 2","Chronic",7.5,"N.A.","Schlekat, C. E., Genderen, E. V., De Schamphelaerem K. A. C., Antunes, P. M. C., Rogevich, E. C., and Stubblefield, W. A. (2010) Cross-species extrpolation of chronic nickel Biotic Ligand Models. Science of the Total Environment 408, 6148-6157.","162"]
["Freshwater/metal/plant","169-42",88,0.90721649484536082,"","Pseudokirchneriella subcapitata","exponentially growing cells","72 h","EC10","Growth rate",62.5,"Microalga","Chlorophyta","Chlorophyceae","Freshwater","25°C","Chronic",7.42,"N.A.","Deleebeeck, N.M.E., de Schamphelaere, K.A.C and Janssen, C.R. (2009). Effects of Mg2+ and H+ on the toxicity of Ni2+ to the unicellular green alga Pseudokirchneriella subcapitata: Model development and validation with surface waters. Science of the Total Environment 407:1901-1914.","169"]
["Freshwater/metal/non- plant","8-1",83,0.83,"Data does not specify standard method or test acceptability criteria (assumed good). Replication also unclear","Salmo gairdneri","fertilised eggs","85 d","NOEL","Survival",62,"Fish","Chordata","Actinopterygii","Freshwater",12,"Chronic",7,"N.A.","Nebeker, A.V., Savonen, C. and Stevens, D.G. (1985) Sensitivity of rainbow trout early life stages to nickel chloride. Environmental Toxicology and Chemsistry, 4:233–239.","8"]
["Freshwater/metal/non- plant","174-25",88,0.88,"","Hyallela azteca","7-8d juvenile","14 d","LC20","Survival",61,"Microinvertebrate","Arthropoda","Branchiopoda","Freshwater","23°C","Chronic","8.0-8.3","N.A.","Keithly, J. Brooker, J.A., DeForest, D.K., Wu, B.K. and Brix, K.V. (2004). Acute and chronic toxic ity of nickel to a cladoceran (Ceriodaphnia dubia) and an amphipod (Hyallela azteca). Environmental Toxicology and Chemistry 23: 691-696.","174"]
["Freshwater/metal/non- plant","177-11",93,0.93,"","Melanotaenia splendida splendida","embryo","12-d","NOEC","Embryo hatching success/imbalance",61,"Fish","Chordata","Actinopterygii","Woronora River water","25 ± 2","Chronic","7.1-7.4","N.A.","Ecotox Services Australia. 2014. Toxicity of Nickel Under Varying Physico-chemical Conditions. Prepared for Nickel Producers Environmental Research Association (NiPERA). Test Report. May 2014.","177"]
["Freshwater/metal/plant","157-2",76,0.78350515463917525,"","Lemna minor","N.R.","7 d","EC50","growth (yield)",59.6,"Macrophyte","Tracheophyta","Liliopsida","Freshwater","25°C","Chronic","8.15-8.23","N.A.","Gopalapillai, Y. Hale, B., Vigneault, B. (2013). Effect of major cations (Ca2+, Mg2+, Na+, K+) and anoins (SO42-, Cl-, NO3-) on Ni accumulation and toxicity in aquatic plant (Lemna minor L.): implications for Ni risk assessment. Environmental toxicology and chemistry 32:810-821.","157"]
["Freshwater/metal/non- plant","167-69",84,0.84,"","Daphnia magna","<24h old neonate","21 d","EC20","Reproduction",59.1,"Microinvertebrate","Arthropoda","Branchiopoda","Freshwater","NR","Chronic",7.09,"N.A.","Deleebeeck, N.M.E., de Schamphelaere, K.A.C. and Janssen, C.R. (2008). A Novel method for predicting chronic bioavailability and toxicity to Daphnia magna in artificial and natural waters. Environemtnal Toxicology and Chemistry 27: 2097-2107.","167","extrapolated value. Lowest test conc was 60.1. Also 2.0 µg Ni/L in base water"]
["Freshwater/metal/plant","165-5",85,0.85,"","Chlorella sp","exponentially growing cells","72 h","EC10","Growth rate",59,"Microalga","Chlorophyta","Chlorophyceae","Freshwater","29 ± 2","Chronic",6.4,"N.A.","Peters, A. Merrington, G. Kosmala-Grzechnik, S. (2014). Parameterisation of Biotic Ligand Models for nickel to Australian Test Species. Wca environment Project Number P0313-12-13, 41 pp.","165"]
["Freshwater/metal/non- plant","167-12",81,0.81,"","Daphnia magna","<24h old neonate","21 d","EC10","Reproduction",58.6,"Microinvertebrate","Arthropoda","Branchiopoda","Freshwater","NR","Chronic",6.81,"N.A.","Deleebeeck, N.M.E., de Schamphelaere, K.A.C. and Janssen, C.R. (2008). A Novel method for predicting chronic bioavailability and toxicity to Daphnia magna in artificial and natural waters. Environemtnal Toxicology and Chemistry 27: 2097-2107.","167"]
["Freshwater/metal/non- plant","167-58",81,0.81,"","Daphnia magna","<24h old neonate","21 d","EC20","Reproduction",58.3,"Microinvertebrate","Arthropoda","Branchiopoda","Freshwater","NR","Chronic",6.8,"N.A.","Deleebeeck, N.M.E., de Schamphelaere, K.A.C. and Janssen, C.R. (2008). A Novel method for predicting chronic bioavailability and toxicity to Daphnia magna in artificial and natural waters. Environemtnal Toxicology and Chemistry 27: 2097-2107.","167"]
["Freshwater/metal/non- plant","174-27",88,0.88,"","Hyallela azteca","7-8d juvenile","14 d","LOEC","Survival",58,"Microinvertebrate","Arthropoda","Branchiopoda","Freshwater","23°C","Chronic","8.0-8.3","N.A.","Keithly, J. Brooker, J.A., DeForest, D.K., Wu, B.K. and Brix, K.V. (2004). Acute and chronic toxic ity of nickel to a cladoceran (Ceriodaphnia dubia) and an amphipod (Hyallela azteca). Environmental Toxicology and Chemistry 23: 691-696.","174"]
["Freshwater/metal/plant","165-10",85,0.87628865979381443,"","Lemna aequinoctialis","6 fronds","96 h","EC10","growth (yield)",58,"Macrophyte","Tracheophyta","Liliopsida","Freshwater","29 ± 2","Chronic",6.4,"N.A.","Peters, A. Merrington, G. Kosmala-Grzechnik, S. (2014). Parameterisation of Biotic Ligand Models for nickel to Australian Test Species. Wca environment Project Number P0313-12-13, 41 pp.","165"]
["Freshwater/metal/plant","169-22",85,0.87628865979381443,"","Pseudokirchneriella subcapitata","exponentially growing cells","72 h","EC10","Growth rate",57.6,"Microalga","Chlorophyta","Chlorophyceae","Freshwater","25°C","Chronic",6.23,"N.A.","Deleebeeck, N.M.E., de Schamphelaere, K.A.C and Janssen, C.R. (2009). Effects of Mg2+ and H+ on the toxicity of Ni2+ to the unicellular green alga Pseudokirchneriella subcapitata: Model development and validation with surface waters. Science of the Total Environment 407:1901-1914.","169"]
["Freshwater/metal/non- plant","16-3",88,0.88,"Data represents combind data using 4 clones of D. magna","Daphnia magna","Neonate (<1 d)","21 d","EC10","Reproduction",55.6,"Macroinvertebrate","Arthropoda","Branchiopoda","Freshwater",25,"Chronic","7.4–7.7","N.A.","Pereira, C.M.S., Everaert, G., Blust, R. and De Schamphelaere K.A.C. (2017) Effect of temperature on chronic toxicity of copper, zinc, and nickel to Daphnia magna Environmental Toxicology and Chemistry 36:1909–1916",16]
["Freshwater/metal/non- plant","12-1",72,0.72,"NOECs determined by data in Table 3 and text (p<0.05)","Clistoronia magnifica","larvae","19 weeks","NOEC","Survival",55,"Macroinvertebrate","Arthropoda","Trichoptera","Freshwater","10–13","Chronic",4.0999999999999996,"N.A.","van Frankenhuyzen K. and Geen G.H. (1987) Effects of low pH and nickel on growth and survival of the shredding caddisfly Clistoronia magnifica (Limnephilidae) Canadian Journal of Zoology 65, 1729–1732","12"]
["Freshwater/metal/non- plant","165-14",85,0.85,"","Hydra viridissima","asexually reproducing (budding) hydriods","96 h","EC10","population growth",55,"Microinvertebrate","Cnidaria","Hydrozoa","Freshwater","27 ± 2","Chronic",7.9,"N.A.","Peters, A. Merrington, G. Kosmala-Grzechnik, S. (2014). Parameterisation of Biotic Ligand Models for nickel to Australian Test Species. Wca environment Project Number P0313-12-13, 41 pp.","165"]
["Freshwater/metal/plant","154-21",81,0.83505154639175261,"","Coelastrum microporum","exponentially growing cells","72 h","EC10","Growth rate",54.3,"Microalga","Chlorophyta","Chlorophyceae","Freshwater","25°C","Chronic","N.R.","N.A.","Deleebeeck, N.M.E. De Laender, F., Chepurnov, V.A., Vyerman, W., Janseen, C.R. De Schamphelaere, K.A.C. (2009). A single bioavailability model can accurately predict Ni toxicity to green microalgae in soft and hard surface waters. Water Research 43:1935-1947.","154"]
["Freshwater/metal/plant","169-47",85,0.87628865979381443,"","Pseudokirchneriella subcapitata","exponentially growing cells","72 h","NOEC","Growth rate",54,"Microalga","Chlorophyta","Chlorophyceae","Freshwater","25°C","Chronic",7.39,"N.A.","Deleebeeck, N.M.E., de Schamphelaere, K.A.C and Janssen, C.R. (2009). Effects of Mg2+ and H+ on the toxicity of Ni2+ to the unicellular green alga Pseudokirchneriella subcapitata: Model development and validation with surface waters. Science of the Total Environment 407:1901-1914.","169"]
["Freshwater/metal/non- plant","167-21",84,0.84,"","Daphnia magna","<24h old neonate","21 d","EC10","Reproduction",52.3,"Microinvertebrate","Arthropoda","Branchiopoda","Freshwater","NR","Chronic",7.09,"N.A.","Deleebeeck, N.M.E., de Schamphelaere, K.A.C. and Janssen, C.R. (2008). A Novel method for predicting chronic bioavailability and toxicity to Daphnia magna in artificial and natural waters. Environemtnal Toxicology and Chemistry 27: 2097-2107.","167","This EC10 value extrapolated, lowest conc was 60.1. Also 2.0 µg/L Ni in base water"]
["Freshwater/metal/non- plant","177-15",93,0.93,"","Melanotaenia splendida splendida","embryo","12-d","NOEC","Embryo hatching success/imbalance",52,"Fish","Chordata","Actinopterygii","Tea Tree River","25 ± 2","Chronic","6.9-7.2","N.A.","Ecotox Services Australia. 2014. Toxicity of Nickel Under Varying Physico-chemical Conditions. Prepared for Nickel Producers Environmental Research Association (NiPERA). Test Report. May 2014.","177"]
["Freshwater/metal/plant","175-2",88,0.90721649484536082,"","Monoraphidium arcuatum ","exponentially growing cells","72 h","EC10","Growth rate",52,"Microalga","Chlorophyta","Chlorophyceae","Freshwater",27,"Chronic",7.8,"N.A.","McKnight et al 2018 (unpublished data)","175"]
["Freshwater/metal/plant","169-18",85,0.87628865979381443,"","Pseudokirchneriella subcapitata","exponentially growing cells","72 h","EC10","Growth rate",51.9,"Microalga","Chlorophyta","Chlorophyceae","Freshwater","25°C","Chronic",6.45,"N.A.","Deleebeeck, N.M.E., de Schamphelaere, K.A.C and Janssen, C.R. (2009). Effects of Mg2+ and H+ on the toxicity of Ni2+ to the unicellular green alga Pseudokirchneriella subcapitata: Model development and validation with surface waters. Science of the Total Environment 407:1901-1914.","169"]
["Freshwater/metal/plant","169-4",85,0.87628865979381443,"","Pseudokirchneriella subcapitata","exponentially growing cells","72 h","EC10","Growth rate",51.9,"Microalga","Chlorophyta","Chlorophyceae","Freshwater","25°C","Chronic",7.39,"N.A.","Deleebeeck, N.M.E., de Schamphelaere, K.A.C and Janssen, C.R. (2009). Effects of Mg2+ and H+ on the toxicity of Ni2+ to the unicellular green alga Pseudokirchneriella subcapitata: Model development and validation with surface waters. Science of the Total Environment 407:1901-1914.","169"]
["Freshwater/metal/non- plant","177-12",93,0.93,"","Melanotaenia splendida splendida","embryo","12-d","NOEC","Embryo hatching success/imbalance",50,"Fish","Chordata","Actinopterygii","Magela Creek","25 ± 2","Chronic",6.3,"N.A.","Ecotox Services Australia. 2014. Toxicity of Nickel Under Varying Physico-chemical Conditions. Prepared for Nickel Producers Environmental Research Association (NiPERA). Test Report. May 2014.","177"]
["Freshwater/metal/non- plant","2-1",57,0.56999999999999995,"DO NOT USE - statistical analysis is unreliable ","Salmo gairdneri","fertilised eggs","28 days","LC50","Mortality",50,"Fish","Chordata","Actinopterygii","Freshwater","12–13","Chronic","7.2–7.8","N.A.","Birge W.J., Hudson J.E., Black J.A. and Westerman A.G. (1978) Embryo-larval bioassays on inorganic coal elements and in situ biomonitoring of coal-waste effluents. In: Symp. U.S. Fish Wildl. Serv., Surface Mining Fish Wildl. Needs in U.S., W.VA 97–104.","2"]
["Freshwater/metal/plant","169-50",85,0.87628865979381443,"","Pseudokirchneriella subcapitata","exponentially growing cells","72 h","NOEC","Growth rate",48.6,"Microalga","Chlorophyta","Chlorophyceae","Freshwater","25°C","Chronic",7.44,"N.A.","Deleebeeck, N.M.E., de Schamphelaere, K.A.C and Janssen, C.R. (2009). Effects of Mg2+ and H+ on the toxicity of Ni2+ to the unicellular green alga Pseudokirchneriella subcapitata: Model development and validation with surface waters. Science of the Total Environment 407:1901-1914.","169"]
["Freshwater/metal/non- plant","167-36",81,0.81,"","Daphnia magna","<24h old neonate","21 d","NOEC","Reproduction",48.5,"Microinvertebrate","Arthropoda","Branchiopoda","Freshwater","NR","Chronic",6.81,"N.A.","Deleebeeck, N.M.E., de Schamphelaere, K.A.C. and Janssen, C.R. (2008). A Novel method for predicting chronic bioavailability and toxicity to Daphnia magna in artificial and natural waters. Environemtnal Toxicology and Chemistry 27: 2097-2107.","167"]
["Freshwater/metal/non- plant","171-12",78,0.78,"","Daphnia longispina","<48h old neonate","21 d","LC50","Survival",48.3,"Microinvertebrate","Arthropoda","Branchiopoda","Freshwater","20°C","Chronic",7.18,"N.A.","Deleebeeck, N.M. E, Muyssen, B.T.A, De Laender, F, Janssen, C.R., De Schamphelaere, K.A.C (2007). Comparison of nickel toxicity to cladocerans in soft versus hard surface waters, Aquatic Toxicology 84: 223-235.","171"]
["Freshwater/metal/non- plant","167-35",81,0.81,"","Daphnia magna","<24h old neonate","21 d","NOEC","Reproduction",48.2,"Microinvertebrate","Arthropoda","Branchiopoda","Freshwater","NR","Chronic",6.8,"N.A.","Deleebeeck, N.M.E., de Schamphelaere, K.A.C. and Janssen, C.R. (2008). A Novel method for predicting chronic bioavailability and toxicity to Daphnia magna in artificial and natural waters. Environemtnal Toxicology and Chemistry 27: 2097-2107.","167"]
["Freshwater/metal/plant","169-61",85,0.87628865979381443,"","Pseudokirchneriella subcapitata","exponentially growing cells","72 h","NOEC","Growth rate",47.9,"Microalga","Chlorophyta","Chlorophyceae","Freshwater","25°C","Chronic",6.45,"N.A.","Deleebeeck, N.M.E., de Schamphelaere, K.A.C and Janssen, C.R. (2009). Effects of Mg2+ and H+ on the toxicity of Ni2+ to the unicellular green alga Pseudokirchneriella subcapitata: Model development and validation with surface waters. Science of the Total Environment 407:1901-1914.","169"]
["Freshwater/metal/non- plant","167-57",81,0.81,"","Daphnia magna","<24h old neonate","21 d","EC20","Reproduction",47.7,"Microinvertebrate","Arthropoda","Branchiopoda","Freshwater","NR","Chronic",6.82,"N.A.","Deleebeeck, N.M.E., de Schamphelaere, K.A.C. and Janssen, C.R. (2008). A Novel method for predicting chronic bioavailability and toxicity to Daphnia magna in artificial and natural waters. Environemtnal Toxicology and Chemistry 27: 2097-2107.","167"]
["Freshwater/metal/plant","169-17",85,0.87628865979381443,"","Pseudokirchneriella subcapitata","exponentially growing cells","72 h","EC10","Growth rate",47.5,"Microalga","Chlorophyta","Chlorophyceae","Freshwater","25°C","Chronic",6.01,"N.A.","Deleebeeck, N.M.E., de Schamphelaere, K.A.C and Janssen, C.R. (2009). Effects of Mg2+ and H+ on the toxicity of Ni2+ to the unicellular green alga Pseudokirchneriella subcapitata: Model development and validation with surface waters. Science of the Total Environment 407:1901-1914.","169"]
["Freshwater/metal/plant","169-52",85,0.87628865979381443,"","Pseudokirchneriella subcapitata","exponentially growing cells","72 h","NOEC","Growth rate",47.3,"Microalga","Chlorophyta","Chlorophyceae","Freshwater","25°C","Chronic",7.51,"N.A.","Deleebeeck, N.M.E., de Schamphelaere, K.A.C and Janssen, C.R. (2009). Effects of Mg2+ and H+ on the toxicity of Ni2+ to the unicellular green alga Pseudokirchneriella subcapitata: Model development and validation with surface waters. Science of the Total Environment 407:1901-1914.","169"]
["Freshwater/metal/non- plant","171-30",78,0.78,"","Simocephalus serrulatus","<48h old neonate","17 d","LC50","Survival",47.3,"Microinvertebrate","Arthropoda","Branchiopoda","Freshwater","20°C","Chronic",7.18,"N.A.","Deleebeeck, N.M. E, Muyssen, B.T.A, De Laender, F, Janssen, C.R., De Schamphelaere, K.A.C (2007). Comparison of nickel toxicity to cladocerans in soft versus hard surface waters, Aquatic Toxicology 84: 223-235.","171"]
["Freshwater/metal/non- plant","167-10",81,0.81,"","Daphnia magna","<24h old neonate","21 d","EC10","Reproduction",47,"Microinvertebrate","Arthropoda","Branchiopoda","Freshwater","NR","Chronic",6.8,"N.A.","Deleebeeck, N.M.E., de Schamphelaere, K.A.C. and Janssen, C.R. (2008). A Novel method for predicting chronic bioavailability and toxicity to Daphnia magna in artificial and natural waters. Environemtnal Toxicology and Chemistry 27: 2097-2107.","167"]
["Freshwater/metal/non- plant","171-29",83,0.83,"","Simocephalus serrulatus","<48h old neonate","17 d","EC10","Reproduction",45.3,"Microinvertebrate","Arthropoda","Branchiopoda","Freshwater","20°C","Chronic",7.18,"N.A.","Deleebeeck, N.M. E, Muyssen, B.T.A, De Laender, F, Janssen, C.R., De Schamphelaere, K.A.C (2007). Comparison of nickel toxicity to cladocerans in soft versus hard surface waters, Aquatic Toxicology 84: 223-235.","171"]
["Freshwater/metal/plant","154-31",81,0.83505154639175261,"","Chlamydomonas sp","exponentially growing cells","72 h","EC10","Growth rate",45,"Microalga","Chlorophyta","Chlorophyceae","Freshwater","25°C","Chronic","N.R.","N.A.","Deleebeeck, N.M.E. De Laender, F., Chepurnov, V.A., Vyerman, W., Janseen, C.R. De Schamphelaere, K.A.C. (2009). A single bioavailability model can accurately predict Ni toxicity to green microalgae in soft and hard surface waters. Water Research 43:1935-1947.","154"]
["Freshwater/metal/non- plant","167-53",81,0.81,"","Daphnia magna","<24h old neonate","21 d","EC20","Reproduction",45,"Microinvertebrate","Arthropoda","Branchiopoda","Freshwater","NR","Chronic",6.79,"N.A.","Deleebeeck, N.M.E., de Schamphelaere, K.A.C. and Janssen, C.R. (2008). A Novel method for predicting chronic bioavailability and toxicity to Daphnia magna in artificial and natural waters. Environemtnal Toxicology and Chemistry 27: 2097-2107.","167"]
["Freshwater/metal/non- plant","176-8",56,0.56000000000000005,"","Hydra viridissima","asexually reproducing (budding) hydriods","96 h","EC10","population growth",45,"Microinvertebrate","Cnidaria","Hydrozoa","Synthetic Magela Creek Water (SMCW)","27 oC","Chronic",6.5,"N.A.","Peters A and Merrington G (2015) Nickel toxicity to Hydra viridissima in soft waters. Report by wca environment Ltd. Project PO-439 Oxfordshire, United Kingdom.","176"]
["Freshwater/metal/plant","169-38",85,0.87628865979381443,"","Pseudokirchneriella subcapitata","exponentially growing cells","72 h","EC10","Growth rate",44.6,"Microalga","Chlorophyta","Chlorophyceae","Freshwater","25°C","Chronic",7.7,"N.A.","Deleebeeck, N.M.E., de Schamphelaere, K.A.C and Janssen, C.R. (2009). Effects of Mg2+ and H+ on the toxicity of Ni2+ to the unicellular green alga Pseudokirchneriella subcapitata: Model development and validation with surface waters. Science of the Total Environment 407:1901-1914.","169"]
["Freshwater/metal/plant","169-20",85,0.87628865979381443,"","Pseudokirchneriella subcapitata","exponentially growing cells","72 h","EC10","Growth rate",44.3,"Microalga","Chlorophyta","Chlorophyceae","Freshwater","25°C","Chronic",7.65,"N.A.","Deleebeeck, N.M.E., de Schamphelaere, K.A.C and Janssen, C.R. (2009). Effects of Mg2+ and H+ on the toxicity of Ni2+ to the unicellular green alga Pseudokirchneriella subcapitata: Model development and validation with surface waters. Science of the Total Environment 407:1901-1914.","169"]
["Freshwater/metal/plant","169-29",85,0.87628865979381443,"","Pseudokirchneriella subcapitata","exponentially growing cells","72 h","EC10","Growth rate",44.3,"Microalga","Chlorophyta","Chlorophyceae","Freshwater","25°C","Chronic",7.88,"N.A.","Deleebeeck, N.M.E., de Schamphelaere, K.A.C and Janssen, C.R. (2009). Effects of Mg2+ and H+ on the toxicity of Ni2+ to the unicellular green alga Pseudokirchneriella subcapitata: Model development and validation with surface waters. Science of the Total Environment 407:1901-1914.","169"]
["Freshwater/metal/plant","154-3",81,0.83505154639175261,"","Desmodesmus sp","exponentially growing cells","72 h","NOEC","Growth rate",43.7,"Microalga","Chlorophyta","Chlorophyceae","Freshwater","25°C","Chronic","N.R.","N.A.","Deleebeeck, N.M.E. De Laender, F., Chepurnov, V.A., Vyerman, W., Janseen, C.R. De Schamphelaere, K.A.C. (2009). A single bioavailability model can accurately predict Ni toxicity to green microalgae in soft and hard surface waters. Water Research 43:1935-1947.","154"]
["Freshwater/metal/plant","154-35",81,0.83505154639175261,"","Ankistrodesmus falcatus","exponentially growing cells","72 h","EC10","Growth rate",43.6,"Microalga","Chlorophyta","Chlorophyceae","Freshwater","25°C","Chronic","N.R.","N.A.","Deleebeeck, N.M.E. De Laender, F., Chepurnov, V.A., Vyerman, W., Janseen, C.R. De Schamphelaere, K.A.C. (2009). A single bioavailability model can accurately predict Ni toxicity to green microalgae in soft and hard surface waters. Water Research 43:1935-1947.","154"]
["Freshwater/metal/non- plant","167-29",81,0.81,"","Daphnia magna","<24h old neonate","21 d","NOEC","Reproduction",43.3,"Microinvertebrate","Arthropoda","Branchiopoda","Freshwater","NR","Chronic",6.79,"N.A.","Deleebeeck, N.M.E., de Schamphelaere, K.A.C. and Janssen, C.R. (2008). A Novel method for predicting chronic bioavailability and toxicity to Daphnia magna in artificial and natural waters. Environemtnal Toxicology and Chemistry 27: 2097-2107.","167"]
["Freshwater/metal/plant","154-7",81,0.83505154639175261,"","Desmodesmus sp","exponentially growing cells","72 h","NOEC","Growth rate",43.3,"Microalga","Chlorophyta","Chlorophyceae","Freshwater","25°C","Chronic","N.R.","N.A.","Deleebeeck, N.M.E. De Laender, F., Chepurnov, V.A., Vyerman, W., Janseen, C.R. De Schamphelaere, K.A.C. (2009). A single bioavailability model can accurately predict Ni toxicity to green microalgae in soft and hard surface waters. Water Research 43:1935-1947.","154"]
["Freshwater/metal/plant","154-36",81,0.83505154639175261,"","Ankistrodesmus falcatus","exponentially growing cells","72 h","NOEC","Growth rate",43,"Microalga","Chlorophyta","Chlorophyceae","Freshwater","25°C","Chronic","N.R.","N.A.","Deleebeeck, N.M.E. De Laender, F., Chepurnov, V.A., Vyerman, W., Janseen, C.R. De Schamphelaere, K.A.C. (2009). A single bioavailability model can accurately predict Ni toxicity to green microalgae in soft and hard surface waters. Water Research 43:1935-1947.","154"]
["Freshwater/metal/non- plant","167-9",81,0.81,"","Daphnia magna","<24h old neonate","21 d","EC10","Reproduction",42.5,"Microinvertebrate","Arthropoda","Branchiopoda","Freshwater","NR","Chronic",6.82,"N.A.","Deleebeeck, N.M.E., de Schamphelaere, K.A.C. and Janssen, C.R. (2008). A Novel method for predicting chronic bioavailability and toxicity to Daphnia magna in artificial and natural waters. Environemtnal Toxicology and Chemistry 27: 2097-2107.","167"]
["Freshwater/metal/non- plant","167-54",81,0.81,"","Daphnia magna","<24h old neonate","21 d","EC20","Reproduction",42.4,"Microinvertebrate","Arthropoda","Branchiopoda","Freshwater","NR","Chronic",6.8,"N.A.","Deleebeeck, N.M.E., de Schamphelaere, K.A.C. and Janssen, C.R. (2008). A Novel method for predicting chronic bioavailability and toxicity to Daphnia magna in artificial and natural waters. Environemtnal Toxicology and Chemistry 27: 2097-2107.","167"]
["Freshwater/metal/plant","169-6",85,0.87628865979381443,"","Pseudokirchneriella subcapitata","exponentially growing cells","72 h","EC10","Growth rate",42.1,"Microalga","Chlorophyta","Chlorophyceae","Freshwater","25°C","Chronic",7.41,"N.A.","Deleebeeck, N.M.E., de Schamphelaere, K.A.C and Janssen, C.R. (2009). Effects of Mg2+ and H+ on the toxicity of Ni2+ to the unicellular green alga Pseudokirchneriella subcapitata: Model development and validation with surface waters. Science of the Total Environment 407:1901-1914.","169"]
["Freshwater/metal/plant","169-81",85,0.87628865979381443,"","Pseudokirchneriella subcapitata","exponentially growing cells","72 h","NOEC","Growth rate",41.9,"Microalga","Chlorophyta","Chlorophyceae","Freshwater","25°C","Chronic",7.7,"N.A.","Deleebeeck, N.M.E., de Schamphelaere, K.A.C and Janssen, C.R. (2009). Effects of Mg2+ and H+ on the toxicity of Ni2+ to the unicellular green alga Pseudokirchneriella subcapitata: Model development and validation with surface waters. Science of the Total Environment 407:1901-1914.","169"]
["Freshwater/metal/non- plant","167-63",81,0.81,"","Daphnia magna","<24h old neonate","21 d","EC20","Reproduction",40.6,"Microinvertebrate","Arthropoda","Branchiopoda","Freshwater","NR","Chronic",6.97,"N.A.","Deleebeeck, N.M.E., de Schamphelaere, K.A.C. and Janssen, C.R. (2008). A Novel method for predicting chronic bioavailability and toxicity to Daphnia magna in artificial and natural waters. Environemtnal Toxicology and Chemistry 27: 2097-2107.","167"]
["Freshwater/metal/non- plant","167-68",84,0.84,"","Daphnia magna","<24h old neonate","21 d","EC20","Reproduction",40.5,"Microinvertebrate","Arthropoda","Branchiopoda","Freshwater","NR","Chronic",6.15,"N.A.","Deleebeeck, N.M.E., de Schamphelaere, K.A.C. and Janssen, C.R. (2008). A Novel method for predicting chronic bioavailability and toxicity to Daphnia magna in artificial and natural waters. Environemtnal Toxicology and Chemistry 27: 2097-2107.","167","2.5 µg/L Ni in base water"]
["Freshwater/metal/plant","169-7",85,0.87628865979381443,"","Pseudokirchneriella subcapitata","exponentially growing cells","72 h","EC10","Growth rate",40.5,"Microalga","Chlorophyta","Chlorophyceae","Freshwater","25°C","Chronic",7.44,"N.A.","Deleebeeck, N.M.E., de Schamphelaere, K.A.C and Janssen, C.R. (2009). Effects of Mg2+ and H+ on the toxicity of Ni2+ to the unicellular green alga Pseudokirchneriella subcapitata: Model development and validation with surface waters. Science of the Total Environment 407:1901-1914.","169"]
["Freshwater/metal/non- plant","153-1",61,0.61,"The highest possible grade for this datum is acceptable. Control values and variability assessed, but acceptablity criteria not defined.","Brachydanio rerio","blastula stage (2-4h after spawning)","15 d","NOEC","Hatching",40,"Fish","Chordata","Actinopterygii","Freshwater","25-26","Chronic","7.5-7.7","N.A.","Dave, G. and Xiu, R. (1991). Toxicity of mercury, copper, nickel, lead, and cobalt to embryos and larvae of zebrafish, Brachydanio rerio. Arch Environ. Cotam. Toxicol. 21:126-134.","153","Note: questionable statistics. Used overlap of 95% CLs to define NOEC and LOEC. Endpoints are done by-eye by the author. However conc-response is evident. Survival also assessed, but no effects at concentrations tested."]
["Freshwater/metal/non- plant","17-1",62,0.62,"Data is first generation of multi-generation tests (pre-exposure to 160 µg/L)","Daphnia magna","neonate (24-44 h old)","Not Reported","NOEC","Reproduction",40,"Macroinvertebrate","Arthropoda","Branchiopoda","Freshwater",20.5,"Chronic","7.7-7.9","N.A.","Munzinger, A. (1990) Effects of nickel on Daphnia magna during chronic exposure and alterations in the toxicity to generations pre-exposed to nickel. Water Research 24:845–852","17"]
["Freshwater/metal/plant","154-12",81,0.83505154639175261,"","Pediastrum duplex","exponentially growing cells","72 h","NOEC","Growth rate",39.5,"Microalga","Chlorophyta","Chlorophyceae","Freshwater","25°C","Chronic","N.R.","N.A.","Deleebeeck, N.M.E. De Laender, F., Chepurnov, V.A., Vyerman, W., Janseen, C.R. De Schamphelaere, K.A.C. (2009). A single bioavailability model can accurately predict Ni toxicity to green microalgae in soft and hard surface waters. Water Research 43:1935-1947.","154"]
["Freshwater/metal/plant","154-16",81,0.83505154639175261,"","Pseudokirchneriella sp.","exponentially growing cells","72 h","NOEC","Growth rate",39.5,"Microalga","Chlorophyta","Chlorophyceae","Freshwater","25°C","Chronic","N.R.","N.A.","Deleebeeck, N.M.E. De Laender, F., Chepurnov, V.A., Vyerman, W., Janseen, C.R. De Schamphelaere, K.A.C. (2009). A single bioavailability model can accurately predict Ni toxicity to green microalgae in soft and hard surface waters. Water Research 43:1935-1947.","154"]
["Freshwater/metal/non- plant","177-7",93,0.93,"","Melanotaenia splendida splendida","embryo","12-d","EC50","Embryo hatching success/imbalance",39,"Fish","Chordata","Actinopterygii","Magela Creek","25 ± 2","Chronic",6.3,"N.A.","Ecotox Services Australia. 2014. Toxicity of Nickel Under Varying Physico-chemical Conditions. Prepared for Nickel Producers Environmental Research Association (NiPERA). Test Report. May 2014.","177"]
["Freshwater/metal/non- plant","171-20",78,0.78,"","Simocephalus vetulus","<48h old neonate","21 d","LC50","Survival",38.799999999999997,"Microinvertebrate","Arthropoda","Branchiopoda","Freshwater","20°C","Chronic",7.18,"N.A.","Deleebeeck, N.M. E, Muyssen, B.T.A, De Laender, F, Janssen, C.R., De Schamphelaere, K.A.C (2007). Comparison of nickel toxicity to cladocerans in soft versus hard surface waters, Aquatic Toxicology 84: 223-235.","171"]
["Freshwater/metal/plant","154-17",81,0.83505154639175261,"","Coelastrum microporum","exponentially growing cells","72 h","EC10","Growth rate",38.6,"Microalga","Chlorophyta","Chlorophyceae","Freshwater","25°C","Chronic","N.R.","N.A.","Deleebeeck, N.M.E. De Laender, F., Chepurnov, V.A., Vyerman, W., Janseen, C.R. De Schamphelaere, K.A.C. (2009). A single bioavailability model can accurately predict Ni toxicity to green microalgae in soft and hard surface waters. Water Research 43:1935-1947.","154"]
["Freshwater/metal/non- plant","167-64",81,0.81,"","Daphnia magna","<24h old neonate","21 d","EC20","Reproduction",37.299999999999997,"Microinvertebrate","Arthropoda","Branchiopoda","Freshwater","NR","Chronic",7.35,"N.A.","Deleebeeck, N.M.E., de Schamphelaere, K.A.C. and Janssen, C.R. (2008). A Novel method for predicting chronic bioavailability and toxicity to Daphnia magna in artificial and natural waters. Environemtnal Toxicology and Chemistry 27: 2097-2107.","167"]
["Freshwater/metal/plant","169-3",85,0.87628865979381443,"","Pseudokirchneriella subcapitata","exponentially growing cells","72 h","EC10","Growth rate",37.299999999999997,"Microalga","Chlorophyta","Chlorophyceae","Freshwater","25°C","Chronic",7.4,"N.A.","Deleebeeck, N.M.E., de Schamphelaere, K.A.C and Janssen, C.R. (2009). Effects of Mg2+ and H+ on the toxicity of Ni2+ to the unicellular green alga Pseudokirchneriella subcapitata: Model development and validation with surface waters. Science of the Total Environment 407:1901-1914.","169"]
["Freshwater/metal/plant","169-19",85,0.87628865979381443,"","Pseudokirchneriella subcapitata","exponentially growing cells","72 h","EC10","Growth rate",37,"Microalga","Chlorophyta","Chlorophyceae","Freshwater","25°C","Chronic",7.29,"N.A.","Deleebeeck, N.M.E., de Schamphelaere, K.A.C and Janssen, C.R. (2009). Effects of Mg2+ and H+ on the toxicity of Ni2+ to the unicellular green alga Pseudokirchneriella subcapitata: Model development and validation with surface waters. Science of the Total Environment 407:1901-1914.","169"]
["Freshwater/metal/plant","169-2",85,0.87628865979381443,"","Pseudokirchneriella subcapitata","exponentially growing cells","72 h","EC10","Growth rate",36.6,"Microalga","Chlorophyta","Chlorophyceae","Freshwater","25°C","Chronic",7.38,"N.A.","Deleebeeck, N.M.E., de Schamphelaere, K.A.C and Janssen, C.R. (2009). Effects of Mg2+ and H+ on the toxicity of Ni2+ to the unicellular green alga Pseudokirchneriella subcapitata: Model development and validation with surface waters. Science of the Total Environment 407:1901-1914.","169"]
["Freshwater/metal/non- plant","171-16",78,0.78,"","Ceriodaphnia pulchella","<48h old neonate","17 d","LC50","Survival",36,"Microinvertebrate","Arthropoda","Branchiopoda","Freshwater","20°C","Chronic",7.18,"N.A.","Deleebeeck, N.M. E, Muyssen, B.T.A, De Laender, F, Janssen, C.R., De Schamphelaere, K.A.C (2007). Comparison of nickel toxicity to cladocerans in soft versus hard surface waters, Aquatic Toxicology 84: 223-235.","171"]
["Freshwater/metal/plant","162-54",93,0.95876288659793818,"","Lemna minor","3-frond colonies","7 d","EC10","growth rate (root length)",36,"Macrophyte","Tracheophyta","Liliopsida","Freshwater","25 ± 1","Chronic",7.6,"N.A.","Schlekat, C. E., Genderen, E. V., De Schamphelaerem K. A. C., Antunes, P. M. C., Rogevich, E. C., and Stubblefield, W. A. (2010) Cross-species extrpolation of chronic nickel Biotic Ligand Models. Science of the Total Environment 408, 6148-6157.","162"]
["Freshwater/metal/plant","14-1",48,0.49484536082474229,"USE DATA. EC10 reported was generated in an initial experiment and not reported in full in this study. The data point was include in data compilation becasue the study is recent and from a lab that has generated numerous high quality Ni toxicity data in the past. Authors have been approached for additional information to improve scoring assessment","Navicula pelliculosa","5 days old","3 days","EC10","Growth rate (fluorescence)",36,"Microalga","Bacillariophyta","Bacillariophyceae","Freshwater",21,"Chronic",7,"N.A.","Nagai, T. and De Schamphelaere, K.A.C. (2016) The effect of binart mixtures of zinc, copper, cadmium, and nickel on the growth of the freshwater diatom Navicula pelliculosa and comparison with mixture toxicity model predictions. Environmental Toxicology and Chemsitry, 35:2765–2773.","14"]
["Freshwater/metal/plant","169-21",85,0.87628865979381443,"","Pseudokirchneriella subcapitata","exponentially growing cells","72 h","EC10","Growth rate",35.9,"Microalga","Chlorophyta","Chlorophyceae","Freshwater","25°C","Chronic",7.92,"N.A.","Deleebeeck, N.M.E., de Schamphelaere, K.A.C and Janssen, C.R. (2009). Effects of Mg2+ and H+ on the toxicity of Ni2+ to the unicellular green alga Pseudokirchneriella subcapitata: Model development and validation with surface waters. Science of the Total Environment 407:1901-1914.","169"]
["Freshwater/metal/non- plant","165-13",85,0.85,"","Hydra viridissima","asexually reproducing (budding) hydriods","96 h","EC10","population growth",35,"Microinvertebrate","Cnidaria","Hydrozoa","Freshwater","27 ± 2","Chronic",8.1999999999999993,"N.A.","Peters, A. Merrington, G. Kosmala-Grzechnik, S. (2014). Parameterisation of Biotic Ligand Models for nickel to Australian Test Species. Wca environment Project Number P0313-12-13, 41 pp.","165"]
["Freshwater/metal/non- plant","177-5",93,0.93,"","Melanotaenia splendida splendida","embryo","12-d","EC10","Embryo hatching success/imbalance",35,"Fish","Chordata","Actinopterygii","Tea Tree River","25 ± 2","Chronic","6.9-7.2","N.A.","Ecotox Services Australia. 2014. Toxicity of Nickel Under Varying Physico-chemical Conditions. Prepared for Nickel Producers Environmental Research Association (NiPERA). Test Report. May 2014.","177"]
["Freshwater/metal/non- plant","167-15",81,0.81,"","Daphnia magna","<24h old neonate","21 d","EC10","Reproduction",34.700000000000003,"Microinvertebrate","Arthropoda","Branchiopoda","Freshwater","NR","Chronic",6.97,"N.A.","Deleebeeck, N.M.E., de Schamphelaere, K.A.C. and Janssen, C.R. (2008). A Novel method for predicting chronic bioavailability and toxicity to Daphnia magna in artificial and natural waters. Environemtnal Toxicology and Chemistry 27: 2097-2107.","167"]
["Freshwater/metal/plant","169-46",85,0.87628865979381443,"","Pseudokirchneriella subcapitata","exponentially growing cells","72 h","NOEC","Growth rate",34.5,"Microalga","Chlorophyta","Chlorophyceae","Freshwater","25°C","Chronic",7.4,"N.A.","Deleebeeck, N.M.E., de Schamphelaere, K.A.C and Janssen, C.R. (2009). Effects of Mg2+ and H+ on the toxicity of Ni2+ to the unicellular green alga Pseudokirchneriella subcapitata: Model development and validation with surface waters. Science of the Total Environment 407:1901-1914.","169"]
["Freshwater/metal/non- plant","167-62",81,0.81,"","Daphnia magna","<24h old neonate","21 d","EC20","Reproduction",34.200000000000003,"Microinvertebrate","Arthropoda","Branchiopoda","Freshwater","NR","Chronic",6.4,"N.A.","Deleebeeck, N.M.E., de Schamphelaere, K.A.C. and Janssen, C.R. (2008). A Novel method for predicting chronic bioavailability and toxicity to Daphnia magna in artificial and natural waters. Environemtnal Toxicology and Chemistry 27: 2097-2107.","167"]
["Freshwater/metal/non- plant","167-5",81,0.81,"","Daphnia magna","<24h old neonate","21 d","EC10","Reproduction",34,"Microinvertebrate","Arthropoda","Branchiopoda","Freshwater","NR","Chronic",6.79,"N.A.","Deleebeeck, N.M.E., de Schamphelaere, K.A.C. and Janssen, C.R. (2008). A Novel method for predicting chronic bioavailability and toxicity to Daphnia magna in artificial and natural waters. Environemtnal Toxicology and Chemistry 27: 2097-2107.","167"]
["Freshwater/metal/non- plant","171-13",78,0.78,"","Alona affinis","<48h old neonate","16 d","LC50","Survival",33.4,"Microinvertebrate","Arthropoda","Branchiopoda","Freshwater","20°C","Chronic",7.18,"N.A.","Deleebeeck, N.M. E, Muyssen, B.T.A, De Laender, F, Janssen, C.R., De Schamphelaere, K.A.C (2007). Comparison of nickel toxicity to cladocerans in soft versus hard surface waters, Aquatic Toxicology 84: 223-235.","171","no reproduction detected"]
["Freshwater/metal/plant","169-63",85,0.87628865979381443,"","Pseudokirchneriella subcapitata","exponentially growing cells","72 h","NOEC","Growth rate",33.4,"Microalga","Chlorophyta","Chlorophyceae","Freshwater","25°C","Chronic",7.65,"N.A.","Deleebeeck, N.M.E., de Schamphelaere, K.A.C and Janssen, C.R. (2009). Effects of Mg2+ and H+ on the toxicity of Ni2+ to the unicellular green alga Pseudokirchneriella subcapitata: Model development and validation with surface waters. Science of the Total Environment 407:1901-1914.","169"]
["Freshwater/metal/non- plant","167-61",81,0.81,"","Daphnia magna","<24h old neonate","21 d","EC20","Reproduction",33.200000000000003,"Microinvertebrate","Arthropoda","Branchiopoda","Freshwater","NR","Chronic",5.87,"N.A.","Deleebeeck, N.M.E., de Schamphelaere, K.A.C. and Janssen, C.R. (2008). A Novel method for predicting chronic bioavailability and toxicity to Daphnia magna in artificial and natural waters. Environemtnal Toxicology and Chemistry 27: 2097-2107.","167"]
["Freshwater/metal/non- plant","171-1",83,0.83,null,"Ceriodaphnia quadrangula","<48h old neonate","17 d","EC10","Reproduction",33.1,"Microinvertebrate","Arthropoda","Branchiopoda","Freshwater","20°C","Chronic",7.18,"N.A.","Deleebeeck, N.M. E, Muyssen, B.T.A, De Laender, F, Janssen, C.R., De Schamphelaere, K.A.C (2007). Comparison of nickel toxicity to cladocerans in soft versus hard surface waters, Aquatic Toxicology 84: 223-235.","171"]
["Freshwater/metal/non- plant","172-2",64,0.64,"","Hyallela azteca","0-1 week old young","4 weeks","LC50","Survival",33,"Macroinvertebrate","Arthropoda","Malacostraca","Freshwater","23°C","Chronic","N.R.","N.A.","Borgmann, U., Neron, R. and Norwood, W.P. (2001). Quantification of bioavailable nickel in sediments and toxic thresholds to Hyallela azteca. Environmental Pollution 111: 189-198.","172","Note - experiment repeated 3 times."]
["Freshwater/metal/non- plant","167-20",84,0.84,"","Daphnia magna","<24h old neonate","21 d","EC10","Reproduction",32.700000000000003,"Microinvertebrate","Arthropoda","Branchiopoda","Freshwater","NR","Chronic",6.15,"N.A.","Deleebeeck, N.M.E., de Schamphelaere, K.A.C. and Janssen, C.R. (2008). A Novel method for predicting chronic bioavailability and toxicity to Daphnia magna in artificial and natural waters. Environemtnal Toxicology and Chemistry 27: 2097-2107.","167","2.5 µg/L Ni in base water"]
["Freshwater/metal/plant","154-9",81,0.83505154639175261,"","Pediastrum duplex","exponentially growing cells","72 h","EC10","Growth rate",32.200000000000003,"Microalga","Chlorophyta","Chlorophyceae","Freshwater","25°C","Chronic","N.R.","N.A.","Deleebeeck, N.M.E. De Laender, F., Chepurnov, V.A., Vyerman, W., Janseen, C.R. De Schamphelaere, K.A.C. (2009). A single bioavailability model can accurately predict Ni toxicity to green microalgae in soft and hard surface waters. Water Research 43:1935-1947.","154"]
["Freshwater/metal/non- plant","167-16",81,0.81,"","Daphnia magna","<24h old neonate","21 d","EC10","Reproduction",32,"Microinvertebrate","Arthropoda","Branchiopoda","Freshwater","NR","Chronic",7.35,"N.A.","Deleebeeck, N.M.E., de Schamphelaere, K.A.C. and Janssen, C.R. (2008). A Novel method for predicting chronic bioavailability and toxicity to Daphnia magna in artificial and natural waters. Environemtnal Toxicology and Chemistry 27: 2097-2107.","167"]
["Freshwater/metal/non- plant","165-15",85,0.85,"","Hydra viridissima","asexually reproducing (budding) hydriods","96 h","EC10","population growth",32,"Microinvertebrate","Cnidaria","Hydrozoa","Freshwater","27 ± 2","Chronic",6.4,"N.A.","Peters, A. Merrington, G. Kosmala-Grzechnik, S. (2014). Parameterisation of Biotic Ligand Models for nickel to Australian Test Species. Wca environment Project Number P0313-12-13, 41 pp.","165"]
["Freshwater/metal/non- plant","176-5",56,0.56000000000000005,"","Hydra viridissima","asexually reproducing (budding) hydriods","96 h","EC10","population growth",32,"Microinvertebrate","Cnidaria","Hydrozoa","Synthetic Magela Creek Water (SMCW)","27 oC","Chronic",6.5,"N.A.","Peters A and Merrington G (2015) Nickel toxicity to Hydra viridissima in soft waters. Report by wca environment Ltd. Project PO-439 Oxfordshire, United Kingdom.","176"]
["Freshwater/metal/plant","169-48",85,0.87628865979381443,"","Pseudokirchneriella subcapitata","exponentially growing cells","72 h","NOEC","Growth rate",31.9,"Microalga","Chlorophyta","Chlorophyceae","Freshwater","25°C","Chronic",7.39,"N.A.","Deleebeeck, N.M.E., de Schamphelaere, K.A.C and Janssen, C.R. (2009). Effects of Mg2+ and H+ on the toxicity of Ni2+ to the unicellular green alga Pseudokirchneriella subcapitata: Model development and validation with surface waters. Science of the Total Environment 407:1901-1914.","169"]
["Freshwater/metal/plant","169-28",85,0.87628865979381443,"","Pseudokirchneriella subcapitata","exponentially growing cells","72 h","EC10","Growth rate",31.5,"Microalga","Chlorophyta","Chlorophyceae","Freshwater","25°C","Chronic",7.95,"N.A.","Deleebeeck, N.M.E., de Schamphelaere, K.A.C and Janssen, C.R. (2009). Effects of Mg2+ and H+ on the toxicity of Ni2+ to the unicellular green alga Pseudokirchneriella subcapitata: Model development and validation with surface waters. Science of the Total Environment 407:1901-1914.","169"]
["Freshwater/metal/plant","169-5",85,0.87628865979381443,"","Pseudokirchneriella subcapitata","exponentially growing cells","72 h","EC10","Growth rate",31.5,"Microalga","Chlorophyta","Chlorophyceae","Freshwater","25°C","Chronic",7.39,"N.A.","Deleebeeck, N.M.E., de Schamphelaere, K.A.C and Janssen, C.R. (2009). Effects of Mg2+ and H+ on the toxicity of Ni2+ to the unicellular green alga Pseudokirchneriella subcapitata: Model development and validation with surface waters. Science of the Total Environment 407:1901-1914.","169"]
["Freshwater/metal/non- plant","16-2",88,0.88,"Data represents combind data using 4 clones of D. magna","Daphnia magna","Neonate (<1 d)","21 d","EC10","Reproduction",31.3,"Macroinvertebrate","Arthropoda","Branchiopoda","Freshwater",20,"Chronic","7.4–7.7","N.A.","Pereira, C.M.S., Everaert, G., Blust, R. and De Schamphelaere K.A.C. (2017) Effect of temperature on chronic toxicity of copper, zinc, and nickel to Daphnia magna Environmental Toxicology and Chemistry 36:1909–1916",16]
["Freshwater/metal/non- plant","167-6",81,0.81,"","Daphnia magna","<24h old neonate","21 d","EC10","Reproduction",31.2,"Microinvertebrate","Arthropoda","Branchiopoda","Freshwater","NR","Chronic",6.8,"N.A.","Deleebeeck, N.M.E., de Schamphelaere, K.A.C. and Janssen, C.R. (2008). A Novel method for predicting chronic bioavailability and toxicity to Daphnia magna in artificial and natural waters. Environemtnal Toxicology and Chemistry 27: 2097-2107.","167"]
["Freshwater/metal/non- plant","6-1",86,0.86,"Good paper for modelling; also quotes EC10 as Ni2+ activity, EC20 , EC50. Media is natural water (i.e. with OC) with measured major ions, DOC and pH control","Ceriodaphnia dubia","Neonate (<1 d)","7 d","EC10","Reproduction",31,"Microinvertebrate","Arthropoda","Branchiopoda","Freshwater",25,"Chronic",7.1,"N.A.","Nys, C., Janssen, C.R. and De Schamphelaere, K.A.C. (2017) Development and validation of a metal mixture bioavailability model (MMBM) to predict chronic toxicity of Ni-Zn-Pb mixtures to Ceriodaphnia dubia. Environmental Pollution, 220:1271–1281.","6"]
["Freshwater/metal/plant","169-1",85,0.87628865979381443,"","Pseudokirchneriella subcapitata","exponentially growing cells","72 h","EC10","Growth rate",30.3,"Microalga","Chlorophyta","Chlorophyceae","Freshwater","25°C","Chronic",7.4,"N.A.","Deleebeeck, N.M.E., de Schamphelaere, K.A.C and Janssen, C.R. (2009). Effects of Mg2+ and H+ on the toxicity of Ni2+ to the unicellular green alga Pseudokirchneriella subcapitata: Model development and validation with surface waters. Science of the Total Environment 407:1901-1914.","169"]
["Freshwater/metal/non- plant","3-1",74,0.74,"specify at least three partial effect concentrations, pre-work to obtain appropriate test concentrations; repeated tests (at least 3 times)","Daphnia magna","Neonate (<1 d)","21 d","EC16","Reproduction",30,"Macroinvertebrate - crustacean","Arthropoda","Branchiopoda","Freshwater",18,"Chronic","7.4–8.2","N.A.","Biesinger K.E. and Christensen G.M. (1972) Effects of various metals on survival, growth, reproduction, and metabolism of Daphnia magna. J. Fish. Res. Bd. Canada 29, 1691–1700.","3"]
["Freshwater/metal/non- plant","177-1",93,0.93,"","Melanotaenia splendida splendida","embryo","12-d","EC10","Embryo hatching success/imbalance",30,"Fish","Chordata","Actinopterygii","Woronora River water","25 ± 2","Chronic","7.1-7.4","N.A.","Ecotox Services Australia. 2014. Toxicity of Nickel Under Varying Physico-chemical Conditions. Prepared for Nickel Producers Environmental Research Association (NiPERA). Test Report. May 2014.","177"]
["Freshwater/metal/non- plant","177-13",93,0.93,"","Melanotaenia splendida splendida","embryo","12-d","NOEC","Embryo hatching success/imbalance",30,"Fish","Chordata","Actinopterygii","Peechalba River","25 ± 2","Chronic","7.9-8.10","N.A.","Ecotox Services Australia. 2014. Toxicity of Nickel Under Varying Physico-chemical Conditions. Prepared for Nickel Producers Environmental Research Association (NiPERA). Test Report. May 2014.","177"]
["Freshwater/metal/non- plant","177-3",93,0.93,"","Melanotaenia splendida splendida","embryo","12-d","EC10","Embryo hatching success/imbalance",30,"Fish","Chordata","Actinopterygii","Peechalba River","25 ± 2","Chronic","7.9-8.10","N.A.","Ecotox Services Australia. 2014. Toxicity of Nickel Under Varying Physico-chemical Conditions. Prepared for Nickel Producers Environmental Research Association (NiPERA). Test Report. May 2014.","177"]
["Freshwater/metal/non- plant","167-65",81,0.81,"","Daphnia magna","<24h old neonate","21 d","EC20","Reproduction",29.7,"Microinvertebrate","Arthropoda","Branchiopoda","Freshwater","NR","Chronic",7.62,"N.A.","Deleebeeck, N.M.E., de Schamphelaere, K.A.C. and Janssen, C.R. (2008). A Novel method for predicting chronic bioavailability and toxicity to Daphnia magna in artificial and natural waters. Environemtnal Toxicology and Chemistry 27: 2097-2107.","167"]
["Freshwater/metal/plant","169-62",85,0.87628865979381443,"","Pseudokirchneriella subcapitata","exponentially growing cells","72 h","NOEC","Growth rate",29.4,"Microalga","Chlorophyta","Chlorophyceae","Freshwater","25°C","Chronic",7.29,"N.A.","Deleebeeck, N.M.E., de Schamphelaere, K.A.C and Janssen, C.R. (2009). Effects of Mg2+ and H+ on the toxicity of Ni2+ to the unicellular green alga Pseudokirchneriella subcapitata: Model development and validation with surface waters. Science of the Total Environment 407:1901-1914.","169"]
["Freshwater/metal/non- plant","171-26",78,0.78,"","Peracantha truncata","<48h old neonate","17 d","LC50","Survival",29.3,"Microinvertebrate","Arthropoda","Branchiopoda","Freshwater","20°C","Chronic",7.18,"N.A.","Deleebeeck, N.M. E, Muyssen, B.T.A, De Laender, F, Janssen, C.R., De Schamphelaere, K.A.C (2007). Comparison of nickel toxicity to cladocerans in soft versus hard surface waters, Aquatic Toxicology 84: 223-235.","171"]
["Freshwater/metal/plant","154-4",81,0.83505154639175261,"","Desmodesmus sp","exponentially growing cells","72 h","NOEC","Growth rate",29.1,"Microalga","Chlorophyta","Chlorophyceae","Freshwater","25°C","Chronic","N.R.","N.A.","Deleebeeck, N.M.E. De Laender, F., Chepurnov, V.A., Vyerman, W., Janseen, C.R. De Schamphelaere, K.A.C. (2009). A single bioavailability model can accurately predict Ni toxicity to green microalgae in soft and hard surface waters. Water Research 43:1935-1947.","154"]
["Freshwater/metal/non- plant","167-56",81,0.81,"","Daphnia magna","<24h old neonate","21 d","EC20","Reproduction",29,"Microinvertebrate","Arthropoda","Branchiopoda","Freshwater","NR","Chronic",6.81,"N.A.","Deleebeeck, N.M.E., de Schamphelaere, K.A.C. and Janssen, C.R. (2008). A Novel method for predicting chronic bioavailability and toxicity to Daphnia magna in artificial and natural waters. Environemtnal Toxicology and Chemistry 27: 2097-2107.","167"]
["Freshwater/metal/non- plant","174-26",88,0.88,"","Hyallela azteca","7-8d juvenile","14 d","NOEC","Survival",29,"Microinvertebrate","Arthropoda","Branchiopoda","Freshwater","23°C","Chronic","8.0-8.3","N.A.","Keithly, J. Brooker, J.A., DeForest, D.K., Wu, B.K. and Brix, K.V. (2004). Acute and chronic toxic ity of nickel to a cladoceran (Ceriodaphnia dubia) and an amphipod (Hyallela azteca). Environmental Toxicology and Chemistry 23: 691-696.","174"]
["Freshwater/metal/plant","154-47",81,0.83505154639175261,"","Desmodesmus spinosus","exponentially growing cells","72 h","EC10","Growth rate",28.9,"Microalga","Chlorophyta","Chlorophyceae","Freshwater","25°C","Chronic","N.R.","N.A.","Deleebeeck, N.M.E. De Laender, F., Chepurnov, V.A., Vyerman, W., Janseen, C.R. De Schamphelaere, K.A.C. (2009). A single bioavailability model can accurately predict Ni toxicity to green microalgae in soft and hard surface waters. Water Research 43:1935-1947.","154"]
["Freshwater/metal/plant","154-27",81,0.83505154639175261,"","Spermatozopsis exultans","exponentially growing cells","72 h","EC10","Growth rate",28.6,"Microalga","Chlorophyta","Chlorophyceae","Freshwater","25°C","Chronic","N.R.","N.A.","Deleebeeck, N.M.E. De Laender, F., Chepurnov, V.A., Vyerman, W., Janseen, C.R. De Schamphelaere, K.A.C. (2009). A single bioavailability model can accurately predict Ni toxicity to green microalgae in soft and hard surface waters. Water Research 43:1935-1947.","154"]
["Freshwater/metal/non- plant","5-2",86,0.86,"Good paper for modelling; also quotes EC10 as Ni2+ activity, EC20 , EC50. Media is natural water (i.e. with OC) with measured major ions, DOC and pH control","Ceriodaphnia dubia","Neonate (<1 d)","7 d","EC10","Reproduction",28,"Microinvertebrate","Arthropoda","Branchiopoda","Freshwater",25,"Chronic",7.4,"N.A.","Nys, C., Van Regenmortel, T., Janssen, C.R., Blust, R., Smolders, E. and De Schamphelaere, K.A.C. (2017) Comparison of chronic mixture toxicity of nickel-zinc-copper and nickel-zinc-copper-cadmium mixtures between Ceriodaphnia dubia and Pseudokirchneriella subcapitata. Environmental Toxicology and Chemistry, 36:1056–1066.","5"]
["Freshwater/metal/non- plant","176-6",56,0.56000000000000005,"","Hydra viridissima","asexually reproducing (budding) hydriods","96 h","EC10","population growth",28,"Microinvertebrate","Cnidaria","Hydrozoa","Synthetic Magela Creek Water (SMCW)","27 oC","Chronic",6.5,"N.A.","Peters A and Merrington G (2015) Nickel toxicity to Hydra viridissima in soft waters. Report by wca environment Ltd. Project PO-439 Oxfordshire, United Kingdom.","176"]
["Freshwater/metal/plant","4-3",80,0.876,"Good paper for modelling; also quotes EC10 as Ni2+ activity, EC20 , EC50 but discrepenciies with Mg concentrations in media","Lemna minor","NA","7 d","EC10","Growth rate",28,"Macrophyte","Streptophyta","Liliopsida","Freshwater","25°C","Chronic",8.2100000000000009,"N.A.","Nys, C., Janssen, C/R., Van Sprang, P. and De Schamphelaere, K.A.C. (2016) The effect of pH on chronic aquatic nickel toxicity is dependent on the pH itself: Extending the chronic nickel bioavailability models. Environmental Toxicology and Chemistry, 35:1097–1106.","4"]
["Freshwater/metal/plant","4-4",80,0.876,"Good paper for modelling; also quotes EC10 as Ni2+ activity, EC20 , EC50 but discrepenciies with Mg concentrations in media","Lemna minor","NA","7 d","EC10","Growth rate",28,"Macrophyte","Streptophyta","Liliopsida","Freshwater","25°C","Chronic",8.68,"N.A.","Nys, C., Janssen, C/R., Van Sprang, P. and De Schamphelaere, K.A.C. (2016) The effect of pH on chronic aquatic nickel toxicity is dependent on the pH itself: Extending the chronic nickel bioavailability models. Environmental Toxicology and Chemistry, 35:1097–1106.","4"]
["Freshwater/metal/non- plant","171-15",83,0.83,"","Ceriodaphnia pulchella","<48h old neonate","17 d","EC10","Reproduction",27.6,"Microinvertebrate","Arthropoda","Branchiopoda","Freshwater","20°C","Chronic",7.18,"N.A.","Deleebeeck, N.M. E, Muyssen, B.T.A, De Laender, F, Janssen, C.R., De Schamphelaere, K.A.C (2007). Comparison of nickel toxicity to cladocerans in soft versus hard surface waters, Aquatic Toxicology 84: 223-235.","171"]
["Freshwater/metal/non- plant","174-14",87,0.87,"","Ceriodaphnia dubia","<24h old neonate","7 d","LOEC","Survival",27.5,"Microinvertebrate","Arthropoda","Branchiopoda","Freshwater","25-26","Chronic",7.61,"N.A.","Keithly, J. Brooker, J.A., DeForest, D.K., Wu, B.K. and Brix, K.V. (2004). Acute and chronic toxic ity of nickel to a cladoceran (Ceriodaphnia dubia) and an amphipod (Hyallela azteca). Environmental Toxicology and Chemistry 23: 691-696.","174"]
["Freshwater/metal/plant","154-32",81,0.83505154639175261,"","Chlamydomonas sp","exponentially growing cells","72 h","NOEC","Growth rate",27.5,"Microalga","Chlorophyta","Chlorophyceae","Freshwater","25°C","Chronic","N.R.","N.A.","Deleebeeck, N.M.E. De Laender, F., Chepurnov, V.A., Vyerman, W., Janseen, C.R. De Schamphelaere, K.A.C. (2009). A single bioavailability model can accurately predict Ni toxicity to green microalgae in soft and hard surface waters. Water Research 43:1935-1947.","154"]
["Freshwater/metal/non- plant","167-51",81,0.81,"","Daphnia magna","<24h old neonate","21 d","EC20","Reproduction",27,"Microinvertebrate","Arthropoda","Branchiopoda","Freshwater","NR","Chronic",6.81,"N.A.","Deleebeeck, N.M.E., de Schamphelaere, K.A.C. and Janssen, C.R. (2008). A Novel method for predicting chronic bioavailability and toxicity to Daphnia magna in artificial and natural waters. Environemtnal Toxicology and Chemistry 27: 2097-2107.","167"]
["Freshwater/metal/plant","169-71",85,0.87628865979381443,"","Pseudokirchneriella subcapitata","exponentially growing cells","72 h","NOEC","Growth rate",26.9,"Microalga","Chlorophyta","Chlorophyceae","Freshwater","25°C","Chronic",7.95,"N.A.","Deleebeeck, N.M.E., de Schamphelaere, K.A.C and Janssen, C.R. (2009). Effects of Mg2+ and H+ on the toxicity of Ni2+ to the unicellular green alga Pseudokirchneriella subcapitata: Model development and validation with surface waters. Science of the Total Environment 407:1901-1914.","169"]
["Freshwater/metal/non- plant","162-12",94,0.94,"","Lymnaea stagnalis","<24h old","30 d","EC20","Growth (wet weight)",26.8,"Macroinvertebrate","Mollusca","Gastropoda","Freshwater","25 ± 2","Chronic",7.6,"N.A.","Schlekat, C. E., Genderen, E. V., De Schamphelaerem K. A. C., Antunes, P. M. C., Rogevich, E. C., and Stubblefield, W. A. (2010) Cross-species extrpolation of chronic nickel Biotic Ligand Models. Science of the Total Environment 408, 6148-6157.","162"]
["Freshwater/metal/plant","169-25",85,0.87628865979381443,"","Pseudokirchneriella subcapitata","exponentially growing cells","72 h","EC10","Growth rate",26.5,"Microalga","Chlorophyta","Chlorophyceae","Freshwater","25°C","Chronic",7.2,"N.A.","Deleebeeck, N.M.E., de Schamphelaere, K.A.C and Janssen, C.R. (2009). Effects of Mg2+ and H+ on the toxicity of Ni2+ to the unicellular green alga Pseudokirchneriella subcapitata: Model development and validation with surface waters. Science of the Total Environment 407:1901-1914.","169"]
["Freshwater/metal/plant","154-29",81,0.83505154639175261,"","Chlamydomonas sp","exponentially growing cells","72 h","EC10","Growth rate",26.4,"Microalga","Chlorophyta","Chlorophyceae","Freshwater","25°C","Chronic","N.R.","N.A.","Deleebeeck, N.M.E. De Laender, F., Chepurnov, V.A., Vyerman, W., Janseen, C.R. De Schamphelaere, K.A.C. (2009). A single bioavailability model can accurately predict Ni toxicity to green microalgae in soft and hard surface waters. Water Research 43:1935-1947.","154"]
["Freshwater/metal/plant","169-86",85,0.87628865979381443,"","Pseudokirchneriella subcapitata","exponentially growing cells","72 h","NOEC","Growth rate",26.4,"Microalga","Chlorophyta","Chlorophyceae","Freshwater","25°C","Chronic",7.42,"N.A.","Deleebeeck, N.M.E., de Schamphelaere, K.A.C and Janssen, C.R. (2009). Effects of Mg2+ and H+ on the toxicity of Ni2+ to the unicellular green alga Pseudokirchneriella subcapitata: Model development and validation with surface waters. Science of the Total Environment 407:1901-1914.","169"]
["Freshwater/metal/plant","169-49",85,0.87628865979381443,"","Pseudokirchneriella subcapitata","exponentially growing cells","72 h","NOEC","Growth rate",26.2,"Microalga","Chlorophyta","Chlorophyceae","Freshwater","25°C","Chronic",7.41,"N.A.","Deleebeeck, N.M.E., de Schamphelaere, K.A.C and Janssen, C.R. (2009). Effects of Mg2+ and H+ on the toxicity of Ni2+ to the unicellular green alga Pseudokirchneriella subcapitata: Model development and validation with surface waters. Science of the Total Environment 407:1901-1914.","169"]
["Freshwater/metal/non- plant","167-66",81,0.81,"","Daphnia magna","<24h old neonate","21 d","EC20","Reproduction",25.8,"Microinvertebrate","Arthropoda","Branchiopoda","Freshwater","NR","Chronic",8.2200000000000006,"N.A.","Deleebeeck, N.M.E., de Schamphelaere, K.A.C. and Janssen, C.R. (2008). A Novel method for predicting chronic bioavailability and toxicity to Daphnia magna in artificial and natural waters. Environemtnal Toxicology and Chemistry 27: 2097-2107.","167"]
["Freshwater/metal/non- plant","167-17",81,0.81,"","Daphnia magna","<24h old neonate","21 d","EC10","Reproduction",25.6,"Microinvertebrate","Arthropoda","Branchiopoda","Freshwater","NR","Chronic",7.62,"N.A.","Deleebeeck, N.M.E., de Schamphelaere, K.A.C. and Janssen, C.R. (2008). A Novel method for predicting chronic bioavailability and toxicity to Daphnia magna in artificial and natural waters. Environemtnal Toxicology and Chemistry 27: 2097-2107.","167"]
["Freshwater/metal/plant","169-8",85,0.87628865979381443,"","Pseudokirchneriella subcapitata","exponentially growing cells","72 h","EC10","Growth rate",25.3,"Microalga","Chlorophyta","Chlorophyceae","Freshwater","25°C","Chronic",7.48,"N.A.","Deleebeeck, N.M.E., de Schamphelaere, K.A.C and Janssen, C.R. (2009). Effects of Mg2+ and H+ on the toxicity of Ni2+ to the unicellular green alga Pseudokirchneriella subcapitata: Model development and validation with surface waters. Science of the Total Environment 407:1901-1914.","169"]
["Freshwater/metal/non- plant","171-2",78,0.78,null,"Ceriodaphnia quadrangula","<48h old neonate","17 d","LC50","Survival",25.1,"Microinvertebrate","Arthropoda","Branchiopoda","Freshwater","20°C","Chronic",7.18,"N.A.","Deleebeeck, N.M. E, Muyssen, B.T.A, De Laender, F, Janssen, C.R., De Schamphelaere, K.A.C (2007). Comparison of nickel toxicity to cladocerans in soft versus hard surface waters, Aquatic Toxicology 84: 223-235.","171"]
["Freshwater/metal/non- plant","16-1",88,0.88,"Data represents combind data using 4 clones of D. magna","Daphnia magna","Neonate (<1 d)","21 d","EC10","Reproduction",24.9,"Macroinvertebrate","Arthropoda","Branchiopoda","Freshwater",15,"Chronic","7.5–7.8","N.A.","Pereira, C.M.S., Everaert, G., Blust, R. and De Schamphelaere K.A.C. (2017) Effect of temperature on chronic toxicity of copper, zinc, and nickel to Daphnia magna Environmental Toxicology and Chemistry 36:1909–1916",16]
["Freshwater/metal/non- plant","171-25",83,0.83,"","Peracantha truncata","<48h old neonate","17 d","EC10","Reproduction",24.7,"Microinvertebrate","Arthropoda","Branchiopoda","Freshwater","20°C","Chronic",7.18,"N.A.","Deleebeeck, N.M. E, Muyssen, B.T.A, De Laender, F, Janssen, C.R., De Schamphelaere, K.A.C (2007). Comparison of nickel toxicity to cladocerans in soft versus hard surface waters, Aquatic Toxicology 84: 223-235.","171"]
["Freshwater/metal/plant","154-34",81,0.83505154639175261,"","Ankistrodesmus falcatus","exponentially growing cells","72 h","NOEC","Growth rate",24.6,"Microalga","Chlorophyta","Chlorophyceae","Freshwater","25°C","Chronic","N.R.","N.A.","Deleebeeck, N.M.E. De Laender, F., Chepurnov, V.A., Vyerman, W., Janseen, C.R. De Schamphelaere, K.A.C. (2009). A single bioavailability model can accurately predict Ni toxicity to green microalgae in soft and hard surface waters. Water Research 43:1935-1947.","154"]
["Freshwater/metal/non- plant","15-4",81,0.81,"Multigenerational study : this data is for first generation (endpoint 3rd brood)","Daphnia magna","Neonate (<1 d)","3rd brood (in control)","EC10","Reproduction",24.4,"Macroinvertebrate","Arthropoda","Branchiopoda","Freshwater",20,"Chronic",8,"N.A.","Pereira, C.M.S., Everaert, G., Blust, R. and De Schamphelaere K.A.C. (2018) Multigenerational effects of nickel on Daphnia magna depend on temperature and the magnitude of the effect in the first generation. Environmental Toxicology and Chemistry 37:1877–1888",15]
["Freshwater/metal/non- plant","167-13",81,0.81,"","Daphnia magna","<24h old neonate","21 d","EC10","Reproduction",24.1,"Microinvertebrate","Arthropoda","Branchiopoda","Freshwater","NR","Chronic",5.87,"N.A.","Deleebeeck, N.M.E., de Schamphelaere, K.A.C. and Janssen, C.R. (2008). A Novel method for predicting chronic bioavailability and toxicity to Daphnia magna in artificial and natural waters. Environemtnal Toxicology and Chemistry 27: 2097-2107.","167"]
["Freshwater/metal/non- plant","167-8",81,0.81,"","Daphnia magna","<24h old neonate","21 d","EC10","Reproduction",24.1,"Microinvertebrate","Arthropoda","Branchiopoda","Freshwater","NR","Chronic",6.81,"N.A.","Deleebeeck, N.M.E., de Schamphelaere, K.A.C. and Janssen, C.R. (2008). A Novel method for predicting chronic bioavailability and toxicity to Daphnia magna in artificial and natural waters. Environemtnal Toxicology and Chemistry 27: 2097-2107.","167","This EC10 value extrapolated, lowest conc was 28.5"]
["Freshwater/metal/plant","175-1",88,0.90721649484536082,"","Chlorella sp 12","exponentially growing cells","72 h","EC10","Growth rate",24,"Microalga","Chlorophyta","Chlorophyceae","Freshwater",27,"Chronic",7.9,"N.A.","McKnight et al 2018 (unpublished data)","175"]
["Freshwater/metal/non- plant","167-30",81,0.81,"","Daphnia magna","<24h old neonate","21 d","NOEC","Reproduction",24,"Microinvertebrate","Arthropoda","Branchiopoda","Freshwater","NR","Chronic",6.8,"N.A.","Deleebeeck, N.M.E., de Schamphelaere, K.A.C. and Janssen, C.R. (2008). A Novel method for predicting chronic bioavailability and toxicity to Daphnia magna in artificial and natural waters. Environemtnal Toxicology and Chemistry 27: 2097-2107.","167"]
["Freshwater/metal/non- plant","162-4",94,0.94,"","Lymnaea stagnalis","<24h old","30 d","NOEC","growth",24,"Macroinvertebrate","Mollusca","Gastropoda","Freshwater","25 ± 2","Chronic",7.6,"N.A.","Schlekat, C. E., Genderen, E. V., De Schamphelaerem K. A. C., Antunes, P. M. C., Rogevich, E. C., and Stubblefield, W. A. (2010) Cross-species extrpolation of chronic nickel Biotic Ligand Models. Science of the Total Environment 408, 6148-6157.","162"]
["Freshwater/metal/plant","154-10",81,0.83505154639175261,"","Pediastrum duplex","exponentially growing cells","72 h","NOEC","Growth rate",23.5,"Microalga","Chlorophyta","Chlorophyceae","Freshwater","25°C","Chronic","N.R.","N.A.","Deleebeeck, N.M.E. De Laender, F., Chepurnov, V.A., Vyerman, W., Janseen, C.R. De Schamphelaere, K.A.C. (2009). A single bioavailability model can accurately predict Ni toxicity to green microalgae in soft and hard surface waters. Water Research 43:1935-1947.","154"]
["Freshwater/metal/non- plant","167-14",81,0.81,"","Daphnia magna","<24h old neonate","21 d","EC10","Reproduction",23.3,"Microinvertebrate","Arthropoda","Branchiopoda","Freshwater","NR","Chronic",6.4,"N.A.","Deleebeeck, N.M.E., de Schamphelaere, K.A.C. and Janssen, C.R. (2008). A Novel method for predicting chronic bioavailability and toxicity to Daphnia magna in artificial and natural waters. Environemtnal Toxicology and Chemistry 27: 2097-2107.","167"]
["Freshwater/metal/non- plant","171-19",83,0.83,"","Simocephalus vetulus","<48h old neonate","21 d","EC10","Reproduction",23.3,"Microinvertebrate","Arthropoda","Branchiopoda","Freshwater","20°C","Chronic",7.18,"N.A.","Deleebeeck, N.M. E, Muyssen, B.T.A, De Laender, F, Janssen, C.R., De Schamphelaere, K.A.C (2007). Comparison of nickel toxicity to cladocerans in soft versus hard surface waters, Aquatic Toxicology 84: 223-235.","171"]
["Freshwater/metal/non- plant","176-3",56,0.56000000000000005,"","Hydra viridissima","asexually reproducing (budding) hydriods","96 h","EC10","population growth",23,"Microinvertebrate","Cnidaria","Hydrozoa","Synthetic Magela Creek Water (SMCW)","27 oC","Chronic",6.5,"N.A.","Peters A and Merrington G (2015) Nickel toxicity to Hydra viridissima in soft waters. Report by wca environment Ltd. Project PO-439 Oxfordshire, United Kingdom.","176"]
["Freshwater/metal/non- plant","167-41",81,0.81,"","Daphnia magna","<24h old neonate","21 d","NOEC","Reproduction",22.8,"Microinvertebrate","Arthropoda","Branchiopoda","Freshwater","NR","Chronic",7.62,"N.A.","Deleebeeck, N.M.E., de Schamphelaere, K.A.C. and Janssen, C.R. (2008). A Novel method for predicting chronic bioavailability and toxicity to Daphnia magna in artificial and natural waters. Environemtnal Toxicology and Chemistry 27: 2097-2107.","167"]
["Freshwater/metal/non- plant","167-38",81,0.81,"","Daphnia magna","<24h old neonate","21 d","NOEC","Reproduction",22.5,"Microinvertebrate","Arthropoda","Branchiopoda","Freshwater","NR","Chronic",6.4,"N.A.","Deleebeeck, N.M.E., de Schamphelaere, K.A.C. and Janssen, C.R. (2008). A Novel method for predicting chronic bioavailability and toxicity to Daphnia magna in artificial and natural waters. Environemtnal Toxicology and Chemistry 27: 2097-2107.","167"]
["Freshwater/metal/plant","154-48",81,0.83505154639175261,"","Desmodesmus spinosus","exponentially growing cells","72 h","NOEC","Growth rate",22.5,"Microalga","Chlorophyta","Chlorophyceae","Freshwater","25°C","Chronic","N.R.","N.A.","Deleebeeck, N.M.E. De Laender, F., Chepurnov, V.A., Vyerman, W., Janseen, C.R. De Schamphelaere, K.A.C. (2009). A single bioavailability model can accurately predict Ni toxicity to green microalgae in soft and hard surface waters. Water Research 43:1935-1947.","154"]
["Freshwater/metal/non- plant","171-18",78,0.78,"","Ceriodaphnia pulchella","<48h old neonate","17 d","LC50","Survival",22.1,"Microinvertebrate","Arthropoda","Branchiopoda","Freshwater","20°C","Chronic",7.18,"N.A.","Deleebeeck, N.M. E, Muyssen, B.T.A, De Laender, F, Janssen, C.R., De Schamphelaere, K.A.C (2007). Comparison of nickel toxicity to cladocerans in soft versus hard surface waters, Aquatic Toxicology 84: 223-235.","171"]
["Freshwater/metal/non- plant","171-7",83,0.83,null,"Ceriodaphnia quadrangula","<48h old neonate","17 d","EC10","Reproduction",21.7,"Microinvertebrate","Arthropoda","Branchiopoda","Freshwater","20°C","Chronic",7.18,"N.A.","Deleebeeck, N.M. E, Muyssen, B.T.A, De Laender, F, Janssen, C.R., De Schamphelaere, K.A.C (2007). Comparison of nickel toxicity to cladocerans in soft versus hard surface waters, Aquatic Toxicology 84: 223-235.","171"]
["Freshwater/metal/non- plant","167-50",81,0.81,"","Daphnia magna","<24h old neonate","21 d","EC20","Reproduction",21.7,"Microinvertebrate","Arthropoda","Branchiopoda","Freshwater","NR","Chronic",6.81,"N.A.","Deleebeeck, N.M.E., de Schamphelaere, K.A.C. and Janssen, C.R. (2008). A Novel method for predicting chronic bioavailability and toxicity to Daphnia magna in artificial and natural waters. Environemtnal Toxicology and Chemistry 27: 2097-2107.","167"]
["Freshwater/metal/plant","169-85",88,0.90721649484536082,"","Pseudokirchneriella subcapitata","exponentially growing cells","72 h","NOEC","Growth rate",21.5,"Microalga","Chlorophyta","Chlorophyceae","Freshwater","25°C","Chronic",7.42,"N.A.","Deleebeeck, N.M.E., de Schamphelaere, K.A.C and Janssen, C.R. (2009). Effects of Mg2+ and H+ on the toxicity of Ni2+ to the unicellular green alga Pseudokirchneriella subcapitata: Model development and validation with surface waters. Science of the Total Environment 407:1901-1914.","169"]
["Freshwater/metal/non- plant","162-13",94,0.94,"","Lymnaea stagnalis","<24h old","30 d","EC20","Growth (wet weight)",21.3,"Macroinvertebrate","Mollusca","Gastropoda","Freshwater","25 ± 2","Chronic",7,"N.A.","Schlekat, C. E., Genderen, E. V., De Schamphelaerem K. A. C., Antunes, P. M. C., Rogevich, E. C., and Stubblefield, W. A. (2010) Cross-species extrpolation of chronic nickel Biotic Ligand Models. Science of the Total Environment 408, 6148-6157.","162"]
["Freshwater/metal/plant","169-45",85,0.87628865979381443,"","Pseudokirchneriella subcapitata","exponentially growing cells","72 h","NOEC","Growth rate",21.2,"Microalga","Chlorophyta","Chlorophyceae","Freshwater","25°C","Chronic",7.38,"N.A.","Deleebeeck, N.M.E., de Schamphelaere, K.A.C and Janssen, C.R. (2009). Effects of Mg2+ and H+ on the toxicity of Ni2+ to the unicellular green alga Pseudokirchneriella subcapitata: Model development and validation with surface waters. Science of the Total Environment 407:1901-1914.","169"]
["Freshwater/metal/non- plant","171-24",78,0.78,"","Peracantha truncata","<48h old neonate","17 d","LC50","Survival",21,"Microinvertebrate","Arthropoda","Branchiopoda","Freshwater","20°C","Chronic",7.18,"N.A.","Deleebeeck, N.M. E, Muyssen, B.T.A, De Laender, F, Janssen, C.R., De Schamphelaere, K.A.C (2007). Comparison of nickel toxicity to cladocerans in soft versus hard surface waters, Aquatic Toxicology 84: 223-235.","171"]
["Freshwater/metal/non- plant","167-55",81,0.81,"","Daphnia magna","<24h old neonate","21 d","EC20","Reproduction",20.9,"Microinvertebrate","Arthropoda","Branchiopoda","Freshwater","NR","Chronic",6.79,"N.A.","Deleebeeck, N.M.E., de Schamphelaere, K.A.C. and Janssen, C.R. (2008). A Novel method for predicting chronic bioavailability and toxicity to Daphnia magna in artificial and natural waters. Environemtnal Toxicology and Chemistry 27: 2097-2107.","167"]
["Freshwater/metal/non- plant","167-3",81,0.81,"","Daphnia magna","<24h old neonate","21 d","EC10","Reproduction",20.7,"Microinvertebrate","Arthropoda","Branchiopoda","Freshwater","NR","Chronic",6.81,"N.A.","Deleebeeck, N.M.E., de Schamphelaere, K.A.C. and Janssen, C.R. (2008). A Novel method for predicting chronic bioavailability and toxicity to Daphnia magna in artificial and natural waters. Environemtnal Toxicology and Chemistry 27: 2097-2107.","167"]
["Freshwater/metal/non- plant","167-42",81,0.81,"","Daphnia magna","<24h old neonate","21 d","NOEC","Reproduction",20.399999999999999,"Microinvertebrate","Arthropoda","Branchiopoda","Freshwater","NR","Chronic",8.2200000000000006,"N.A.","Deleebeeck, N.M.E., de Schamphelaere, K.A.C. and Janssen, C.R. (2008). A Novel method for predicting chronic bioavailability and toxicity to Daphnia magna in artificial and natural waters. Environemtnal Toxicology and Chemistry 27: 2097-2107.","167"]
["Freshwater/metal/non- plant","167-52",81,0.81,"","Daphnia magna","<24h old neonate","21 d","EC20","Reproduction",20.399999999999999,"Microinvertebrate","Arthropoda","Branchiopoda","Freshwater","NR","Chronic",6.79,"N.A.","Deleebeeck, N.M.E., de Schamphelaere, K.A.C. and Janssen, C.R. (2008). A Novel method for predicting chronic bioavailability and toxicity to Daphnia magna in artificial and natural waters. Environemtnal Toxicology and Chemistry 27: 2097-2107.","167"]
["Freshwater/metal/plant","175-4",88,0.90721649484536082,"","Nannochloropsis like sp (in multispecies assay)","exponentially growing cells","72 h","EC10","Growth rate",20,"Microalga","Ochrophyta","Eustigmatophyceae","Freshwater",27,"Chronic",7.5,"N.A.","McKnight et al 2018 (unpublished data)","175"]
["Freshwater/metal/non- plant","162-3",94,0.94,"","Lymnaea stagnalis","<24h old","30 d","EC10","growth",19.5,"Macroinvertebrate","Mollusca","Gastropoda","Freshwater","25 ± 2","Chronic",7.6,"N.A.","Schlekat, C. E., Genderen, E. V., De Schamphelaerem K. A. C., Antunes, P. M. C., Rogevich, E. C., and Stubblefield, W. A. (2010) Cross-species extrpolation of chronic nickel Biotic Ligand Models. Science of the Total Environment 408, 6148-6157.","162"]
["Freshwater/metal/non- plant","6-4",86,0.86,"Good paper for modelling; also quotes EC10 as Ni2+ activity, EC20 , EC50. Media is natural water (i.e. with OC) with measured major ions, DOC and pH control","Ceriodaphnia dubia","Neonate (<1 d)","7 d","EC10","Reproduction",19,"Microinvertebrate","Arthropoda","Branchiopoda","Freshwater",25,"Chronic",7.2,"N.A.","Nys, C., Janssen, C.R. and De Schamphelaere, K.A.C. (2017) Development and validation of a metal mixture bioavailability model (MMBM) to predict chronic toxicity of Ni-Zn-Pb mixtures to Ceriodaphnia dubia. Environmental Pollution, 220:1271–1281.","6"]
["Freshwater/metal/non- plant","4-9",77,0.77,"Data does not specify standard method or test acceptability criteria (assumed good). Good paper for modelling; also quotes EC10 as Ni2+ activity, EC20 , EC50 but discrepenciies with Mg concentrations in media","Lymnaea stagnalis","2-3 days old","28 d","EC10","Growth rate",19,"Microinvertebrate","Mullusca","Gastropoda","Freshwater",20,"Chronic",8.11,"N.A.","Nys, C., Janssen, C/R., Van Sprang, P. and De Schamphelaere, K.A.C. (2016) The effect of pH on chronic aquatic nickel toxicity is dependent on the pH itself: Extending the chronic nickel bioavailability models. Environmental Toxicology and Chemistry, 35:1097–1106.","4"]
["Freshwater/metal/non- plant","15-2",81,0.81,"Multigenerational study : this data is for first generation (endpoint 5th brood)","Daphnia magna","Neonate (<1 d)","5th brood (in control)","EC10","Reproduction",18.8,"Macroinvertebrate","Arthropoda","Branchiopoda","Freshwater",20,"Chronic",8,"N.A.","Pereira, C.M.S., Everaert, G., Blust, R. and De Schamphelaere K.A.C. (2018) Multigenerational effects of nickel on Daphnia magna depend on temperature and the magnitude of the effect in the first generation. Environmental Toxicology and Chemistry 37:1877–1888",15]
["Freshwater/metal/plant","154-39",81,0.83505154639175261,"","Scenedesmus accuminatus","exponentially growing cells","72 h","EC10","Growth rate",18.5,"Microalga","Chlorophyta","Chlorophyceae","Freshwater","25°C","Chronic","N.R.","N.A.","Deleebeeck, N.M.E. De Laender, F., Chepurnov, V.A., Vyerman, W., Janseen, C.R. De Schamphelaere, K.A.C. (2009). A single bioavailability model can accurately predict Ni toxicity to green microalgae in soft and hard surface waters. Water Research 43:1935-1947.","154"]
["Freshwater/metal/plant","154-33",81,0.83505154639175261,"","Ankistrodesmus falcatus","exponentially growing cells","72 h","EC10","Growth rate",18.3,"Microalga","Chlorophyta","Chlorophyceae","Freshwater","25°C","Chronic","N.R.","N.A.","Deleebeeck, N.M.E. De Laender, F., Chepurnov, V.A., Vyerman, W., Janseen, C.R. De Schamphelaere, K.A.C. (2009). A single bioavailability model can accurately predict Ni toxicity to green microalgae in soft and hard surface waters. Water Research 43:1935-1947.","154"]
["Freshwater/metal/non- plant","171-4",78,0.78,null,"Ceriodaphnia quadrangula","<48h old neonate","17 d","LC50","Survival",18,"Microinvertebrate","Arthropoda","Branchiopoda","Freshwater","20°C","Chronic",7.18,"N.A.","Deleebeeck, N.M. E, Muyssen, B.T.A, De Laender, F, Janssen, C.R., De Schamphelaere, K.A.C (2007). Comparison of nickel toxicity to cladocerans in soft versus hard surface waters, Aquatic Toxicology 84: 223-235.","171"]
["Freshwater/metal/plant","169-44",85,0.87628865979381443,"","Pseudokirchneriella subcapitata","exponentially growing cells","72 h","NOEC","Growth rate",18,"Microalga","Chlorophyta","Chlorophyceae","Freshwater","25°C","Chronic",7.4,"N.A.","Deleebeeck, N.M.E., de Schamphelaere, K.A.C and Janssen, C.R. (2009). Effects of Mg2+ and H+ on the toxicity of Ni2+ to the unicellular green alga Pseudokirchneriella subcapitata: Model development and validation with surface waters. Science of the Total Environment 407:1901-1914.","169"]
["Freshwater/metal/non- plant","174-20",87,0.87,"","Ceriodaphnia dubia","<24h old neonate","7 d","LOEC","Survival",17.3,"Microinvertebrate","Arthropoda","Branchiopoda","Freshwater","25-26","Chronic",7.8,"N.A.","Keithly, J. Brooker, J.A., DeForest, D.K., Wu, B.K. and Brix, K.V. (2004). Acute and chronic toxic ity of nickel to a cladoceran (Ceriodaphnia dubia) and an amphipod (Hyallela azteca). Environmental Toxicology and Chemistry 23: 691-696.","174"]
["Freshwater/metal/plant","154-25",81,0.83505154639175261,"","Spermatozopsis exultans","exponentially growing cells","72 h","EC10","Growth rate",17.100000000000001,"Microalga","Chlorophyta","Chlorophyceae","Freshwater","25°C","Chronic","N.R.","N.A.","Deleebeeck, N.M.E. De Laender, F., Chepurnov, V.A., Vyerman, W., Janseen, C.R. De Schamphelaere, K.A.C. (2009). A single bioavailability model can accurately predict Ni toxicity to green microalgae in soft and hard surface waters. Water Research 43:1935-1947.","154"]
["Freshwater/metal/non- plant","172-1",64,0.64,"","Hyallela azteca","0-1 week old young","4 weeks","LC25","Survival",17,"Macroinvertebrate","Arthropoda","Malacostraca","Freshwater","23°C","Chronic","N.R.","N.A.","Borgmann, U., Neron, R. and Norwood, W.P. (2001). Quantification of bioavailable nickel in sediments and toxic thresholds to Hyallela azteca. Environmental Pollution 111: 189-198.","172","Note - experiment repeated 3 times."]
["Freshwater/metal/non- plant","167-18",81,0.81,"","Daphnia magna","<24h old neonate","21 d","EC10","Reproduction",16.899999999999999,"Microinvertebrate","Arthropoda","Branchiopoda","Freshwater","NR","Chronic",8.2200000000000006,"N.A.","Deleebeeck, N.M.E., de Schamphelaere, K.A.C. and Janssen, C.R. (2008). A Novel method for predicting chronic bioavailability and toxicity to Daphnia magna in artificial and natural waters. Environemtnal Toxicology and Chemistry 27: 2097-2107.","167"]
["Freshwater/metal/non- plant","167-2",81,0.81,"","Daphnia magna","<24h old neonate","21 d","EC10","Reproduction",16.399999999999999,"Microinvertebrate","Arthropoda","Branchiopoda","Freshwater","NR","Chronic",6.81,"N.A.","Deleebeeck, N.M.E., de Schamphelaere, K.A.C. and Janssen, C.R. (2008). A Novel method for predicting chronic bioavailability and toxicity to Daphnia magna in artificial and natural waters. Environemtnal Toxicology and Chemistry 27: 2097-2107.","167"]
["Freshwater/metal/non- plant","167-7",81,0.81,"","Daphnia magna","<24h old neonate","21 d","EC10","Reproduction",16.399999999999999,"Microinvertebrate","Arthropoda","Branchiopoda","Freshwater","NR","Chronic",6.79,"N.A.","Deleebeeck, N.M.E., de Schamphelaere, K.A.C. and Janssen, C.R. (2008). A Novel method for predicting chronic bioavailability and toxicity to Daphnia magna in artificial and natural waters. Environemtnal Toxicology and Chemistry 27: 2097-2107.","167"]
["Freshwater/metal/plant","154-11",81,0.83505154639175261,"","Pediastrum duplex","exponentially growing cells","72 h","EC10","Growth rate",16.399999999999999,"Microalga","Chlorophyta","Chlorophyceae","Freshwater","25°C","Chronic","N.R.","N.A.","Deleebeeck, N.M.E. De Laender, F., Chepurnov, V.A., Vyerman, W., Janseen, C.R. De Schamphelaere, K.A.C. (2009). A single bioavailability model can accurately predict Ni toxicity to green microalgae in soft and hard surface waters. Water Research 43:1935-1947.","154"]
["Freshwater/metal/non- plant","167-28",81,0.81,"","Daphnia magna","<24h old neonate","21 d","NOEC","Reproduction",15.6,"Microinvertebrate","Arthropoda","Branchiopoda","Freshwater","NR","Chronic",6.79,"N.A.","Deleebeeck, N.M.E., de Schamphelaere, K.A.C. and Janssen, C.R. (2008). A Novel method for predicting chronic bioavailability and toxicity to Daphnia magna in artificial and natural waters. Environemtnal Toxicology and Chemistry 27: 2097-2107.","167"]
["Freshwater/metal/non- plant","174-13",87,0.87,"","Ceriodaphnia dubia","<24h old neonate","7 d","NOEC","Survival",15.3,"Microinvertebrate","Arthropoda","Branchiopoda","Freshwater","25-26","Chronic",7.61,"N.A.","Keithly, J. Brooker, J.A., DeForest, D.K., Wu, B.K. and Brix, K.V. (2004). Acute and chronic toxic ity of nickel to a cladoceran (Ceriodaphnia dubia) and an amphipod (Hyallela azteca). Environmental Toxicology and Chemistry 23: 691-696.","174"]
["Freshwater/metal/non- plant","167-31",81,0.81,"","Daphnia magna","<24h old neonate","21 d","NOEC","Reproduction",15.3,"Microinvertebrate","Arthropoda","Branchiopoda","Freshwater","NR","Chronic",6.79,"N.A.","Deleebeeck, N.M.E., de Schamphelaere, K.A.C. and Janssen, C.R. (2008). A Novel method for predicting chronic bioavailability and toxicity to Daphnia magna in artificial and natural waters. Environemtnal Toxicology and Chemistry 27: 2097-2107.","167"]
["Freshwater/metal/non- plant","2-6",57,0.56999999999999995,"DO NOT USE - technique to extrapolate LC1 has been reported to be overly conservative. Data also available as LC50","Ambystoma opacum","fertilised eggs","8 days","LC1","Mortality",15,"Amphibian","Chordata","Amphibia","Freshwater","19–22","Chronic","7.2–7.8","N.A.","Birge W.J., Hudson J.E., Black J.A. and Westerman A.G. (1978) Embryo-larval bioassays on inorganic coal elements and in situ biomonitoring of coal-waste effluents. In: Symp. U.S. Fish Wildl. Serv., Surface Mining Fish Wildl. Needs in U.S., W.VA 97–104.","2"]
["Freshwater/metal/non- plant","171-11",83,0.83,"","Daphnia longispina","<48h old neonate","21 d","EC10","Reproduction",14.8,"Microinvertebrate","Arthropoda","Branchiopoda","Freshwater","20°C","Chronic",7.18,"N.A.","Deleebeeck, N.M. E, Muyssen, B.T.A, De Laender, F, Janssen, C.R., De Schamphelaere, K.A.C (2007). Comparison of nickel toxicity to cladocerans in soft versus hard surface waters, Aquatic Toxicology 84: 223-235.","171"]
["Freshwater/metal/plant","157-3",76,0.78350515463917525,"","Lemna minor","N.R.","7 d","IC25","growth (yield)",14.8,"Macrophyte","Tracheophyta","Liliopsida","Freshwater","25°C","Chronic","8.15-8.23","N.A.","Gopalapillai, Y. Hale, B., Vigneault, B. (2013). Effect of major cations (Ca2+, Mg2+, Na+, K+) and anoins (SO42-, Cl-, NO3-) on Ni accumulation and toxicity in aquatic plant (Lemna minor L.): implications for Ni risk assessment. Environmental toxicology and chemistry 32:810-821.","157"]
["Freshwater/metal/non- plant","171-8",78,0.78,null,"Ceriodaphnia quadrangula","<48h old neonate","17 d","LC50","Survival",13.9,"Microinvertebrate","Arthropoda","Branchiopoda","Freshwater","20°C","Chronic",7.18,"N.A.","Deleebeeck, N.M. E, Muyssen, B.T.A, De Laender, F, Janssen, C.R., De Schamphelaere, K.A.C (2007). Comparison of nickel toxicity to cladocerans in soft versus hard surface waters, Aquatic Toxicology 84: 223-235.","171"]
["Freshwater/metal/non- plant","167-26",81,0.81,"","Daphnia magna","<24h old neonate","21 d","NOEC","Reproduction",13.9,"Microinvertebrate","Arthropoda","Branchiopoda","Freshwater","NR","Chronic",6.81,"N.A.","Deleebeeck, N.M.E., de Schamphelaere, K.A.C. and Janssen, C.R. (2008). A Novel method for predicting chronic bioavailability and toxicity to Daphnia magna in artificial and natural waters. Environemtnal Toxicology and Chemistry 27: 2097-2107.","167"]
["Freshwater/metal/non- plant","162-6",94,0.94,"","Lymnaea stagnalis","<24h old","30 d","NOEC","growth",13.6,"Macroinvertebrate","Mollusca","Gastropoda","Freshwater","25 ± 2","Chronic",7,"N.A.","Schlekat, C. E., Genderen, E. V., De Schamphelaerem K. A. C., Antunes, P. M. C., Rogevich, E. C., and Stubblefield, W. A. (2010) Cross-species extrpolation of chronic nickel Biotic Ligand Models. Science of the Total Environment 408, 6148-6157.","162"]
["Freshwater/metal/non- plant","171-22",78,0.78,"","Simocephalus vetulus","<48h old neonate","21 d","LC50","Survival",13.5,"Microinvertebrate","Arthropoda","Branchiopoda","Freshwater","20°C","Chronic",7.18,"N.A.","Deleebeeck, N.M. E, Muyssen, B.T.A, De Laender, F, Janssen, C.R., De Schamphelaere, K.A.C (2007). Comparison of nickel toxicity to cladocerans in soft versus hard surface waters, Aquatic Toxicology 84: 223-235.","171"]
["Freshwater/metal/non- plant","167-27",81,0.81,"","Daphnia magna","<24h old neonate","21 d","NOEC","Reproduction",13.3,"Microinvertebrate","Arthropoda","Branchiopoda","Freshwater","NR","Chronic",6.81,"N.A.","Deleebeeck, N.M.E., de Schamphelaere, K.A.C. and Janssen, C.R. (2008). A Novel method for predicting chronic bioavailability and toxicity to Daphnia magna in artificial and natural waters. Environemtnal Toxicology and Chemistry 27: 2097-2107.","167"]
["Freshwater/metal/non- plant","167-4",81,0.81,"","Daphnia magna","<24h old neonate","21 d","EC10","Reproduction",13,"Microinvertebrate","Arthropoda","Branchiopoda","Freshwater","NR","Chronic",6.79,"N.A.","Deleebeeck, N.M.E., de Schamphelaere, K.A.C. and Janssen, C.R. (2008). A Novel method for predicting chronic bioavailability and toxicity to Daphnia magna in artificial and natural waters. Environemtnal Toxicology and Chemistry 27: 2097-2107.","167"]
["Freshwater/metal/plant","165-7",85,0.85,"","Lemna aequinoctialis","6 fronds","96 h","EC10","growth (yield)",13,"Macrophyte","Tracheophyta","Liliopsida","Freshwater","29 ± 2","Chronic",7.2,"N.A.","Peters, A. Merrington, G. Kosmala-Grzechnik, S. (2014). Parameterisation of Biotic Ligand Models for nickel to Australian Test Species. Wca environment Project Number P0313-12-13, 41 pp.","165"]
["Freshwater/metal/plant","157-1",76,0.78350515463917525,"","Lemna minor","N.R.","7 d","IC25","Root length",12.9,"Macrophyte","Tracheophyta","Liliopsida","Freshwater","25°C","Chronic","8.15-8.23","N.A.","Gopalapillai, Y. Hale, B., Vigneault, B. (2013). Effect of major cations (Ca2+, Mg2+, Na+, K+) and anoins (SO42-, Cl-, NO3-) on Ni accumulation and toxicity in aquatic plant (Lemna minor L.): implications for Ni risk assessment. Environmental toxicology and chemistry 32:810-821.","157","24 more data points to add for this paper, but not sure how to capture all the variables of changing cations and anions (Ca, Mg, Na, K, So4, Cl, NO3)"]
["Freshwater/metal/plant","154-15",81,0.83505154639175261,"","Pseudokirchneriella sp.","exponentially growing cells","72 h","EC10","Growth rate",12.9,"Microalga","Chlorophyta","Chlorophyceae","Freshwater","25°C","Chronic","N.R.","N.A.","Deleebeeck, N.M.E. De Laender, F., Chepurnov, V.A., Vyerman, W., Janseen, C.R. De Schamphelaere, K.A.C. (2009). A single bioavailability model can accurately predict Ni toxicity to green microalgae in soft and hard surface waters. Water Research 43:1935-1947.","154"]
["Freshwater/metal/non- plant","167-49",81,0.81,"","Daphnia magna","<24h old neonate","21 d","EC20","Reproduction",12.7,"Microinvertebrate","Arthropoda","Branchiopoda","Freshwater","NR","Chronic",6.85,"N.A.","Deleebeeck, N.M.E., de Schamphelaere, K.A.C. and Janssen, C.R. (2008). A Novel method for predicting chronic bioavailability and toxicity to Daphnia magna in artificial and natural waters. Environemtnal Toxicology and Chemistry 27: 2097-2107.","167"]
["Freshwater/metal/plant","154-40",81,0.83505154639175261,"","Scenedesmus accuminatus","exponentially growing cells","72 h","NOEC","Growth rate",12.3,"Microalga","Chlorophyta","Chlorophyceae","Freshwater","25°C","Chronic","N.R.","N.A.","Deleebeeck, N.M.E. De Laender, F., Chepurnov, V.A., Vyerman, W., Janseen, C.R. De Schamphelaere, K.A.C. (2009). A single bioavailability model can accurately predict Ni toxicity to green microalgae in soft and hard surface waters. Water Research 43:1935-1947.","154"]
["Freshwater/metal/non- plant","162-10",94,0.94,"","Lymnaea stagnalis","<24h old","30 d","NOEC","growth",12,"Macroinvertebrate","Mollusca","Gastropoda","Freshwater","25 ± 2","Chronic",7.5,"N.A.","Schlekat, C. E., Genderen, E. V., De Schamphelaerem K. A. C., Antunes, P. M. C., Rogevich, E. C., and Stubblefield, W. A. (2010) Cross-species extrpolation of chronic nickel Biotic Ligand Models. Science of the Total Environment 408, 6148-6157.","162"]
["Freshwater/metal/non- plant","174-15",91,0.91,"","Ceriodaphnia dubia","<24h old neonate","7 d","LC20","Survival",11.9,"Microinvertebrate","Arthropoda","Branchiopoda","Freshwater","25-26","Chronic",7.61,"N.A.","Keithly, J. Brooker, J.A., DeForest, D.K., Wu, B.K. and Brix, K.V. (2004). Acute and chronic toxic ity of nickel to a cladoceran (Ceriodaphnia dubia) and an amphipod (Hyallela azteca). Environmental Toxicology and Chemistry 23: 691-696.","174"]
["Freshwater/metal/non- plant","167-40",81,0.81,"","Daphnia magna","<24h old neonate","21 d","NOEC","Reproduction",11.8,"Microinvertebrate","Arthropoda","Branchiopoda","Freshwater","NR","Chronic",7.35,"N.A.","Deleebeeck, N.M.E., de Schamphelaere, K.A.C. and Janssen, C.R. (2008). A Novel method for predicting chronic bioavailability and toxicity to Daphnia magna in artificial and natural waters. Environemtnal Toxicology and Chemistry 27: 2097-2107.","167"]
["Freshwater/metal/non- plant","162-8",94,0.94,"","Lymnaea stagnalis","<24h old","30 d","NOEC","growth",11.8,"Macroinvertebrate","Mollusca","Gastropoda","Freshwater","25 ± 2","Chronic",7.3,"N.A.","Schlekat, C. E., Genderen, E. V., De Schamphelaerem K. A. C., Antunes, P. M. C., Rogevich, E. C., and Stubblefield, W. A. (2010) Cross-species extrpolation of chronic nickel Biotic Ligand Models. Science of the Total Environment 408, 6148-6157.","162"]
["Freshwater/metal/non- plant","6-3",86,0.86,"Good paper for modelling; also quotes EC10 as Ni2+ activity, EC20 , EC50. Media is natural water (i.e. with OC) with measured major ions, DOC and pH control","Ceriodaphnia dubia","Neonate (<1 d)","7 d","EC10","Reproduction",11,"Microinvertebrate","Arthropoda","Branchiopoda","Freshwater",25,"Chronic",7.1,"N.A.","Nys, C., Janssen, C.R. and De Schamphelaere, K.A.C. (2017) Development and validation of a metal mixture bioavailability model (MMBM) to predict chronic toxicity of Ni-Zn-Pb mixtures to Ceriodaphnia dubia. Environmental Pollution, 220:1271–1281.","6"]
["Freshwater/metal/non- plant","6-6",86,0.86,"Good paper for modelling; also quotes EC10 as Ni2+ activity, EC20 , EC50. Media is natural water (i.e. with OC) with measured major ions, DOC and pH control","Ceriodaphnia dubia","Neonate (<1 d)","7 d","EC10","Reproduction",11,"Microinvertebrate","Arthropoda","Branchiopoda","Freshwater",25,"Chronic",8,"N.A.","Nys, C., Janssen, C.R. and De Schamphelaere, K.A.C. (2017) Development and validation of a metal mixture bioavailability model (MMBM) to predict chronic toxicity of Ni-Zn-Pb mixtures to Ceriodaphnia dubia. Environmental Pollution, 220:1271–1281.","6"]
["Freshwater/metal/non- plant","176-4",56,0.56000000000000005,"","Hydra viridissima","asexually reproducing (budding) hydriods","96 h","EC10","population growth",11,"Microinvertebrate","Cnidaria","Hydrozoa","Synthetic Magela Creek Water (SMCW)","27 oC","Chronic",6.5,"N.A.","Peters A and Merrington G (2015) Nickel toxicity to Hydra viridissima in soft waters. Report by wca environment Ltd. Project PO-439 Oxfordshire, United Kingdom.","176"]
["Freshwater/metal/non- plant","174-21",91,0.91,"","Ceriodaphnia dubia","<24h old neonate","7 d","LC20","Survival",10.4,"Microinvertebrate","Arthropoda","Branchiopoda","Freshwater","25-26","Chronic",7.8,"N.A.","Keithly, J. Brooker, J.A., DeForest, D.K., Wu, B.K. and Brix, K.V. (2004). Acute and chronic toxic ity of nickel to a cladoceran (Ceriodaphnia dubia) and an amphipod (Hyallela azteca). Environmental Toxicology and Chemistry 23: 691-696.","174"]
["Freshwater/metal/non- plant","5-3",86,0.86,"Good paper for modelling; also quotes EC10 as Ni2+ activity, EC20 , EC50. Media is natural water (i.e. with OC) with measured major ions, DOC and pH control","Ceriodaphnia dubia","Neonate (<1 d)","7 d","EC10","Reproduction",10,"Microinvertebrate","Arthropoda","Branchiopoda","Freshwater",25,"Chronic",7.4,"N.A.","Nys, C., Van Regenmortel, T., Janssen, C.R., Blust, R., Smolders, E. and De Schamphelaere, K.A.C. (2017) Comparison of chronic mixture toxicity of nickel-zinc-copper and nickel-zinc-copper-cadmium mixtures between Ceriodaphnia dubia and Pseudokirchneriella subcapitata. Environmental Toxicology and Chemistry, 36:1056–1066.","5"]
["Freshwater/metal/non- plant","177-2",93,0.93,"","Melanotaenia splendida splendida","embryo","12-d","EC10","Embryo hatching success/imbalance",10,"Fish","Chordata","Actinopterygii","Magela Creek","25 ± 2","Chronic",6.3,"N.A.","Ecotox Services Australia. 2014. Toxicity of Nickel Under Varying Physico-chemical Conditions. Prepared for Nickel Producers Environmental Research Association (NiPERA). Test Report. May 2014.","177"]
["Freshwater/metal/non- plant","174-11",82,0.82,"","Ceriodaphnia dubia","<24h old neonate","7 d","NOEC","Reproduction",9.9,"Microinvertebrate","Arthropoda","Branchiopoda","Freshwater","25-26","Chronic",7.7,"N.A.","Keithly, J. Brooker, J.A., DeForest, D.K., Wu, B.K. and Brix, K.V. (2004). Acute and chronic toxic ity of nickel to a cladoceran (Ceriodaphnia dubia) and an amphipod (Hyallela azteca). Environmental Toxicology and Chemistry 23: 691-696.","174"]
["Freshwater/metal/non- plant","174-8",87,0.87,"","Ceriodaphnia dubia","<24h old neonate","7 d","LOEC","Survival",9.9,"Microinvertebrate","Arthropoda","Branchiopoda","Freshwater","25-26","Chronic",7.7,"N.A.","Keithly, J. Brooker, J.A., DeForest, D.K., Wu, B.K. and Brix, K.V. (2004). Acute and chronic toxic ity of nickel to a cladoceran (Ceriodaphnia dubia) and an amphipod (Hyallela azteca). Environmental Toxicology and Chemistry 23: 691-696.","174"]
["Freshwater/metal/non- plant","171-14",78,0.78,"","Alona affinis","<48h old neonate","16 d","LC50","Survival",9.85,"Microinvertebrate","Arthropoda","Branchiopoda","Freshwater","20°C","Chronic",7.18,"N.A.","Deleebeeck, N.M. E, Muyssen, B.T.A, De Laender, F, Janssen, C.R., De Schamphelaere, K.A.C (2007). Comparison of nickel toxicity to cladocerans in soft versus hard surface waters, Aquatic Toxicology 84: 223-235.","171","no reproduction detected"]
["Freshwater/metal/non- plant","2-4",57,0.56999999999999995,"DO NOT USE - technique to extrapolate LC1 has been reported to be overly conservative. Data also available as LC50","Micropterus salmoides","fertilised eggs","8 days","LC1","Mortality",9.6999999999999993,"Fish","Chordata","Actinopterygii","Freshwater","19–22","Chronic","7.2–7.8","N.A.","Birge W.J., Hudson J.E., Black J.A. and Westerman A.G. (1978) Embryo-larval bioassays on inorganic coal elements and in situ biomonitoring of coal-waste effluents. In: Symp. U.S. Fish Wildl. Serv., Surface Mining Fish Wildl. Needs in U.S., W.VA 97–104.","2"]
["Freshwater/metal/non- plant","174-19",87,0.87,"","Ceriodaphnia dubia","<24h old neonate","7 d","NOEC","Survival",9.6,"Microinvertebrate","Arthropoda","Branchiopoda","Freshwater","25-26","Chronic",7.8,"N.A.","Keithly, J. Brooker, J.A., DeForest, D.K., Wu, B.K. and Brix, K.V. (2004). Acute and chronic toxic ity of nickel to a cladoceran (Ceriodaphnia dubia) and an amphipod (Hyallela azteca). Environmental Toxicology and Chemistry 23: 691-696.","174"]
["Freshwater/metal/non- plant","174-23",82,0.82,"","Ceriodaphnia dubia","<24h old neonate","7 d","LOEC","Reproduction",9.6,"Microinvertebrate","Arthropoda","Branchiopoda","Freshwater","25-26","Chronic",7.8,"N.A.","Keithly, J. Brooker, J.A., DeForest, D.K., Wu, B.K. and Brix, K.V. (2004). Acute and chronic toxic ity of nickel to a cladoceran (Ceriodaphnia dubia) and an amphipod (Hyallela azteca). Environmental Toxicology and Chemistry 23: 691-696.","174"]
["Freshwater/metal/non- plant","171-28",78,0.78,"","Simocephalus serrulatus","<48h old neonate","17 d","LC50","Survival",9.3699999999999992,"Microinvertebrate","Arthropoda","Branchiopoda","Freshwater","20°C","Chronic",7.18,"N.A.","Deleebeeck, N.M. E, Muyssen, B.T.A, De Laender, F, Janssen, C.R., De Schamphelaere, K.A.C (2007). Comparison of nickel toxicity to cladocerans in soft versus hard surface waters, Aquatic Toxicology 84: 223-235.","171"]
["Freshwater/metal/non- plant","171-21",83,0.83,"","Simocephalus vetulus","<48h old neonate","21 d","EC10","Reproduction",8.9600000000000009,"Microinvertebrate","Arthropoda","Branchiopoda","Freshwater","20°C","Chronic",7.18,"N.A.","Deleebeeck, N.M. E, Muyssen, B.T.A, De Laender, F, Janssen, C.R., De Schamphelaere, K.A.C (2007). Comparison of nickel toxicity to cladocerans in soft versus hard surface waters, Aquatic Toxicology 84: 223-235.","171"]
["Freshwater/metal/non- plant","162-39",82,0.82,"","Brachionus calcyflorus","NR","48 h","NOEC","Population growth rate",8.8000000000000007,"Microinvertebrate","Rotifera","Monogononta","Freshwater","25 ± 2","Chronic",6.9,"N.A.","Schlekat, C. E., Genderen, E. V., De Schamphelaerem K. A. C., Antunes, P. M. C., Rogevich, E. C., and Stubblefield, W. A. (2010) Cross-species extrpolation of chronic nickel Biotic Ligand Models. Science of the Total Environment 408, 6148-6157.","162"]
["Freshwater/metal/non- plant","167-1",81,0.81,"","Daphnia magna","<24h old neonate","21 d","EC10","Reproduction",8.7799999999999994,"Microinvertebrate","Arthropoda","Branchiopoda","Freshwater","NR","Chronic",6.85,"N.A.","Deleebeeck, N.M.E., de Schamphelaere, K.A.C. and Janssen, C.R. (2008). A Novel method for predicting chronic bioavailability and toxicity to Daphnia magna in artificial and natural waters. Environemtnal Toxicology and Chemistry 27: 2097-2107.","167","For this whole dataset, 21d mortality data also available but less sensitive, so not reported here."]
["Freshwater/metal/plant","154-30",81,0.83505154639175261,"","Chlamydomonas sp","exponentially growing cells","72 h","NOEC","Growth rate",8.3000000000000007,"Microalga","Chlorophyta","Chlorophyceae","Freshwater","25°C","Chronic","N.R.","N.A.","Deleebeeck, N.M.E. De Laender, F., Chepurnov, V.A., Vyerman, W., Janseen, C.R. De Schamphelaere, K.A.C. (2009). A single bioavailability model can accurately predict Ni toxicity to green microalgae in soft and hard surface waters. Water Research 43:1935-1947.","154"]
["Freshwater/metal/plant","162-52",93,0.95876288659793818,"","Lemna minor","3-frond colonies","7 d","EC10","growth rate (root length)",8.1999999999999993,"Macrophyte","Tracheophyta","Liliopsida","Freshwater","25 ± 1","Chronic",7.7,"N.A.","Schlekat, C. E., Genderen, E. V., De Schamphelaerem K. A. C., Antunes, P. M. C., Rogevich, E. C., and Stubblefield, W. A. (2010) Cross-species extrpolation of chronic nickel Biotic Ligand Models. Science of the Total Environment 408, 6148-6157.","162"]
["Freshwater/metal/non- plant","13-1",70,0.67,"The highest possible grade for this datum is acceptable.","Ceriodaphnia dubia","Neonate (<1 d)","7 d","NOEC","Survival",7.5,"Microinvertebrate - microcrustacean","Arthropoda","Branchiopoda","Freshwater",25,"Chronic",8.5,"N.A.","Kszos, L.A., Stewart, A.J. and Taylor, P.A. (1992) An evaluation of nickel toxicity to Ceriodaphnia dubia and Daphnia magna in a contaminated stream and in laboratory tests. Environmental Toxicology and Chemistry 11:1001–1012","13"]
["Freshwater/metal/plant","162-46",93,0.95876288659793818,"","Lemna minor","3-frond colonies","7 d","EC10","growth rate (root length)",7.5,"Macrophyte","Tracheophyta","Liliopsida","Freshwater","25 ± 1","Chronic",8.3000000000000007,"N.A.","Schlekat, C. E., Genderen, E. V., De Schamphelaerem K. A. C., Antunes, P. M. C., Rogevich, E. C., and Stubblefield, W. A. (2010) Cross-species extrpolation of chronic nickel Biotic Ligand Models. Science of the Total Environment 408, 6148-6157.","162"]
["Freshwater/metal/non- plant","162-38",82,0.82,"","Brachionus calcyflorus","NR","48 h","EC20","Population growth rate",7.4,"Microinvertebrate","Rotifera","Monogononta","Freshwater","25 ± 2","Chronic",6.9,"N.A.","Schlekat, C. E., Genderen, E. V., De Schamphelaerem K. A. C., Antunes, P. M. C., Rogevich, E. C., and Stubblefield, W. A. (2010) Cross-species extrpolation of chronic nickel Biotic Ligand Models. Science of the Total Environment 408, 6148-6157.","162"]
["Freshwater/metal/non- plant","176-2",56,0.56000000000000005,"","Hydra viridissima","asexually reproducing (budding) hydriods","96 h","EC10","population growth",7,"Microinvertebrate","Cnidaria","Hydrozoa","Synthetic Magela Creek Water (SMCW)","27 oC","Chronic",6.5,"N.A.","Peters A and Merrington G (2015) Nickel toxicity to Hydra viridissima in soft waters. Report by wca environment Ltd. Project PO-439 Oxfordshire, United Kingdom.","176"]
["Freshwater/metal/non- plant","162-5",94,0.94,"","Lymnaea stagnalis","<24h old","30 d","EC10","growth",7,"Macroinvertebrate","Mollusca","Gastropoda","Freshwater","25 ± 2","Chronic",7,"N.A.","Schlekat, C. E., Genderen, E. V., De Schamphelaerem K. A. C., Antunes, P. M. C., Rogevich, E. C., and Stubblefield, W. A. (2010) Cross-species extrpolation of chronic nickel Biotic Ligand Models. Science of the Total Environment 408, 6148-6157.","162"]
["Freshwater/metal/plant","154-37",81,0.83505154639175261,"","Scenedesmus accuminatus","exponentially growing cells","72 h","EC10","Growth rate",7,"Microalga","Chlorophyta","Chlorophyceae","Freshwater","25°C","Chronic","N.R.","N.A.","Deleebeeck, N.M.E. De Laender, F., Chepurnov, V.A., Vyerman, W., Janseen, C.R. De Schamphelaere, K.A.C. (2009). A single bioavailability model can accurately predict Ni toxicity to green microalgae in soft and hard surface waters. Water Research 43:1935-1947.","154"]
["Freshwater/metal/non- plant","171-17",83,0.83,"","Ceriodaphnia pulchella","<48h old neonate","17 d","EC10","Reproduction",6.99,"Microinvertebrate","Arthropoda","Branchiopoda","Freshwater","20°C","Chronic",7.18,"N.A.","Deleebeeck, N.M. E, Muyssen, B.T.A, De Laender, F, Janssen, C.R., De Schamphelaere, K.A.C (2007). Comparison of nickel toxicity to cladocerans in soft versus hard surface waters, Aquatic Toxicology 84: 223-235.","171"]
["Freshwater/metal/non- plant","174-24",85,0.85,"","Ceriodaphnia dubia","<24h old neonate","7 d","LC20","Reproduction",6.9,"Microinvertebrate","Arthropoda","Branchiopoda","Freshwater","25-26","Chronic",7.8,"N.A.","Keithly, J. Brooker, J.A., DeForest, D.K., Wu, B.K. and Brix, K.V. (2004). Acute and chronic toxic ity of nickel to a cladoceran (Ceriodaphnia dubia) and an amphipod (Hyallela azteca). Environmental Toxicology and Chemistry 23: 691-696.","174"]
["Freshwater/metal/non- plant","171-27",83,0.83,"","Simocephalus serrulatus","<48h old neonate","17 d","EC10","Reproduction",6.86,"Microinvertebrate","Arthropoda","Branchiopoda","Freshwater","20°C","Chronic",7.18,"N.A.","Deleebeeck, N.M. E, Muyssen, B.T.A, De Laender, F, Janssen, C.R., De Schamphelaere, K.A.C (2007). Comparison of nickel toxicity to cladocerans in soft versus hard surface waters, Aquatic Toxicology 84: 223-235.","171"]
["Freshwater/metal/non- plant","6-2",86,0.86,"Good paper for modelling; also quotes EC10 as Ni2+ activity, EC20 , EC50. Media is natural water (i.e. with OC) with measured major ions, DOC and pH control","Ceriodaphnia dubia","Neonate (<1 d)","7 d","EC10","Reproduction",6.5,"Microinvertebrate","Arthropoda","Branchiopoda","Freshwater",25,"Chronic",8.1,"N.A.","Nys, C., Janssen, C.R. and De Schamphelaere, K.A.C. (2017) Development and validation of a metal mixture bioavailability model (MMBM) to predict chronic toxicity of Ni-Zn-Pb mixtures to Ceriodaphnia dubia. Environmental Pollution, 220:1271–1281.","6"]
["Freshwater/metal/non- plant","167-25",81,0.81,"","Daphnia magna","<24h old neonate","21 d","NOEC","Reproduction",6.4,"Microinvertebrate","Arthropoda","Branchiopoda","Freshwater","NR","Chronic",6.85,"N.A.","Deleebeeck, N.M.E., de Schamphelaere, K.A.C. and Janssen, C.R. (2008). A Novel method for predicting chronic bioavailability and toxicity to Daphnia magna in artificial and natural waters. Environemtnal Toxicology and Chemistry 27: 2097-2107.","167"]
["Freshwater/metal/plant","165-9",85,0.85,"","Lemna aequinoctialis","6 fronds","96 h","EC10","growth (yield)",6.4,"Macrophyte","Tracheophyta","Liliopsida","Freshwater","29 ± 2","Chronic",7.9,"N.A.","Peters, A. Merrington, G. Kosmala-Grzechnik, S. (2014). Parameterisation of Biotic Ligand Models for nickel to Australian Test Species. Wca environment Project Number P0313-12-13, 41 pp.","165"]
["Freshwater/metal/non- plant","162-14",94,0.94,"","Lymnaea stagnalis","<24h old","30 d","EC20","Growth (wet weight)",6.3,"Macroinvertebrate","Mollusca","Gastropoda","Freshwater","25 ± 2","Chronic",7.3,"N.A.","Schlekat, C. E., Genderen, E. V., De Schamphelaerem K. A. C., Antunes, P. M. C., Rogevich, E. C., and Stubblefield, W. A. (2010) Cross-species extrpolation of chronic nickel Biotic Ligand Models. Science of the Total Environment 408, 6148-6157.","162"]
["Freshwater/metal/non- plant","165-17",85,0.85,"","Ceriodaphnia dubia","<24h old neonate","7-8d","EC10","Reproduction",6.2,"Microinvertebrate","Arthropoda","Branchiopoda","Freshwater","25 ± 2","Chronic",7.2,"N.A.","Peters, A. Merrington, G. Kosmala-Grzechnik, S. (2014). Parameterisation of Biotic Ligand Models for nickel to Australian Test Species. Wca environment Project Number P0313-12-13, 41 pp.","165"]
["Freshwater/metal/non- plant","174-22",82,0.82,"","Ceriodaphnia dubia","<24h old neonate","7 d","NOEC","Reproduction",5.8,"Microinvertebrate","Arthropoda","Branchiopoda","Freshwater","25-26","Chronic",7.8,"N.A.","Keithly, J. Brooker, J.A., DeForest, D.K., Wu, B.K. and Brix, K.V. (2004). Acute and chronic toxic ity of nickel to a cladoceran (Ceriodaphnia dubia) and an amphipod (Hyallela azteca). Environmental Toxicology and Chemistry 23: 691-696.","174"]
["Freshwater/metal/non- plant","6-5",86,0.86,"Good paper for modelling; also quotes EC10 as Ni2+ activity, EC20 , EC50. Media is natural water (i.e. with OC) with measured major ions, DOC and pH control","Ceriodaphnia dubia","Neonate (<1 d)","7 d","EC10","Reproduction",5.5,"Microinvertebrate","Arthropoda","Branchiopoda","Freshwater",25,"Chronic",7.2,"N.A.","Nys, C., Janssen, C.R. and De Schamphelaere, K.A.C. (2017) Development and validation of a metal mixture bioavailability model (MMBM) to predict chronic toxicity of Ni-Zn-Pb mixtures to Ceriodaphnia dubia. Environmental Pollution, 220:1271–1281.","6"]
["Freshwater/metal/plant","154-45",81,0.83505154639175261,"","Desmodesmus spinosus","exponentially growing cells","72 h","EC10","Growth rate",5.5,"Microalga","Chlorophyta","Chlorophyceae","Freshwater","25°C","Chronic","N.R.","N.A.","Deleebeeck, N.M.E. De Laender, F., Chepurnov, V.A., Vyerman, W., Janseen, C.R. De Schamphelaere, K.A.C. (2009). A single bioavailability model can accurately predict Ni toxicity to green microalgae in soft and hard surface waters. Water Research 43:1935-1947.","154"]
["Freshwater/metal/non- plant","174-10",82,0.82,"","Ceriodaphnia dubia","<24h old neonate","7 d","NOEC","Reproduction",5.3,"Microinvertebrate","Arthropoda","Branchiopoda","Freshwater","25-26","Chronic",7.7,"N.A.","Keithly, J. Brooker, J.A., DeForest, D.K., Wu, B.K. and Brix, K.V. (2004). Acute and chronic toxic ity of nickel to a cladoceran (Ceriodaphnia dubia) and an amphipod (Hyallela azteca). Environmental Toxicology and Chemistry 23: 691-696.","174"]
["Freshwater/metal/non- plant","174-17",82,0.82,"","Ceriodaphnia dubia","<24h old neonate","7 d","LOEC","Reproduction",5.3,"Microinvertebrate","Arthropoda","Branchiopoda","Freshwater","25-26","Chronic",7.61,"N.A.","Keithly, J. Brooker, J.A., DeForest, D.K., Wu, B.K. and Brix, K.V. (2004). Acute and chronic toxic ity of nickel to a cladoceran (Ceriodaphnia dubia) and an amphipod (Hyallela azteca). Environmental Toxicology and Chemistry 23: 691-696.","174"]
["Freshwater/metal/non- plant","174-7",87,0.87,"","Ceriodaphnia dubia","<24h old neonate","7 d","NOEC","Survival",5.3,"Microinvertebrate","Arthropoda","Branchiopoda","Freshwater","25-26","Chronic",7.7,"N.A.","Keithly, J. Brooker, J.A., DeForest, D.K., Wu, B.K. and Brix, K.V. (2004). Acute and chronic toxic ity of nickel to a cladoceran (Ceriodaphnia dubia) and an amphipod (Hyallela azteca). Environmental Toxicology and Chemistry 23: 691-696.","174"]
["Freshwater/metal/non- plant","171-23",83,0.83,"","Peracantha truncata","<48h old neonate","17 d","EC10","Reproduction",4.92,"Microinvertebrate","Arthropoda","Branchiopoda","Freshwater","20°C","Chronic",7.18,"N.A.","Deleebeeck, N.M. E, Muyssen, B.T.A, De Laender, F, Janssen, C.R., De Schamphelaere, K.A.C (2007). Comparison of nickel toxicity to cladocerans in soft versus hard surface waters, Aquatic Toxicology 84: 223-235.","171"]
["Freshwater/metal/non- plant","165-19",85,0.85,"","Ceriodaphnia dubia","<24h old neonate","7-8d","EC10","Reproduction",4.9000000000000004,"Microinvertebrate","Arthropoda","Branchiopoda","Freshwater","25 ± 2","Chronic",7.9,"N.A.","Peters, A. Merrington, G. Kosmala-Grzechnik, S. (2014). Parameterisation of Biotic Ligand Models for nickel to Australian Test Species. Wca environment Project Number P0313-12-13, 41 pp.","165"]
["Freshwater/metal/plant","154-13",81,0.83505154639175261,"","Pseudokirchneriella sp.","exponentially growing cells","72 h","EC10","Growth rate",4.9000000000000004,"Microalga","Chlorophyta","Chlorophyceae","Freshwater","25°C","Chronic","N.R.","N.A.","Deleebeeck, N.M.E. De Laender, F., Chepurnov, V.A., Vyerman, W., Janseen, C.R. De Schamphelaere, K.A.C. (2009). A single bioavailability model can accurately predict Ni toxicity to green microalgae in soft and hard surface waters. Water Research 43:1935-1947.","154"]
["Freshwater/metal/non- plant","174-9",91,0.91,"","Ceriodaphnia dubia","<24h old neonate","7 d","LC20","Survival",4.8,"Microinvertebrate","Arthropoda","Branchiopoda","Freshwater","25-26","Chronic",7.7,"N.A.","Keithly, J. Brooker, J.A., DeForest, D.K., Wu, B.K. and Brix, K.V. (2004). Acute and chronic toxic ity of nickel to a cladoceran (Ceriodaphnia dubia) and an amphipod (Hyallela azteca). Environmental Toxicology and Chemistry 23: 691-696.","174"]
["Freshwater/metal/non- plant","162-37",82,0.82,"","Brachionus calcyflorus","NR","48 h","EC10","Population growth rate",4.7,"Microinvertebrate","Rotifera","Monogononta","Freshwater","25 ± 2","Chronic",6.9,"N.A.","Schlekat, C. E., Genderen, E. V., De Schamphelaerem K. A. C., Antunes, P. M. C., Rogevich, E. C., and Stubblefield, W. A. (2010) Cross-species extrpolation of chronic nickel Biotic Ligand Models. Science of the Total Environment 408, 6148-6157.","162"]
["Freshwater/metal/non- plant","174-12",85,0.85,"","Ceriodaphnia dubia","<24h old neonate","7 d","LC20","Reproduction",4.7,"Microinvertebrate","Arthropoda","Branchiopoda","Freshwater","25-26","Chronic",7.7,"N.A.","Keithly, J. Brooker, J.A., DeForest, D.K., Wu, B.K. and Brix, K.V. (2004). Acute and chronic toxic ity of nickel to a cladoceran (Ceriodaphnia dubia) and an amphipod (Hyallela azteca). Environmental Toxicology and Chemistry 23: 691-696.","174"]
["Freshwater/metal/non- plant","4-10",77,0.77,"Data does not specify standard method or test acceptability criteria (assumed good). Good paper for modelling; also quotes EC10 as Ni2+ activity, EC20 , EC50 but discrepenciies with Mg concentrations in media","Lymnaea stagnalis","2-3 days old","28 d","EC10","Growth rate",4.5999999999999996,"Microinvertebrate","Mullusca","Gastropoda","Freshwater",20,"Chronic",8.64,"N.A.","Nys, C., Janssen, C/R., Van Sprang, P. and De Schamphelaere, K.A.C. (2016) The effect of pH on chronic aquatic nickel toxicity is dependent on the pH itself: Extending the chronic nickel bioavailability models. Environmental Toxicology and Chemistry, 35:1097–1106.","4"]
["Freshwater/metal/non- plant","174-18",85,0.85,"","Ceriodaphnia dubia","<24h old neonate","7 d","LC20","Reproduction",4,"Microinvertebrate","Arthropoda","Branchiopoda","Freshwater","25-26","Chronic",7.61,"N.A.","Keithly, J. Brooker, J.A., DeForest, D.K., Wu, B.K. and Brix, K.V. (2004). Acute and chronic toxic ity of nickel to a cladoceran (Ceriodaphnia dubia) and an amphipod (Hyallela azteca). Environmental Toxicology and Chemistry 23: 691-696.","174"]
["Freshwater/metal/non- plant","176-1",56,0.56000000000000005,"","Hydra viridissima","asexually reproducing (budding) hydriods","96 h","EC10","population growth",4,"Microinvertebrate","Cnidaria","Hydrozoa","Synthetic Magela Creek Water (SMCW)","27 oC","Chronic",6.5,"N.A.","Peters A and Merrington G (2015) Nickel toxicity to Hydra viridissima in soft waters. Report by wca environment Ltd. Project PO-439 Oxfordshire, United Kingdom.","176"]
["Freshwater/metal/plant","162-56",81,0.83505154639175261,"","Lemna minor","3-frond colonies","7 d","EC10","growth rate (root length)",3.9,"Macrophyte","Tracheophyta","Liliopsida","Freshwater","25 ± 1","Chronic",8,"N.A.","Schlekat, C. E., Genderen, E. V., De Schamphelaerem K. A. C., Antunes, P. M. C., Rogevich, E. C., and Stubblefield, W. A. (2010) Cross-species extrpolation of chronic nickel Biotic Ligand Models. Science of the Total Environment 408, 6148-6157.","162"]
["Freshwater/metal/non- plant","171-6",78,0.78,null,"Ceriodaphnia quadrangula","<48h old neonate","17 d","LC50","Survival",3.85,"Microinvertebrate","Arthropoda","Branchiopoda","Freshwater","20°C","Chronic",7.18,"N.A.","Deleebeeck, N.M. E, Muyssen, B.T.A, De Laender, F, Janssen, C.R., De Schamphelaere, K.A.C (2007). Comparison of nickel toxicity to cladocerans in soft versus hard surface waters, Aquatic Toxicology 84: 223-235.","171"]
["Freshwater/metal/non- plant","174-2",87,0.87,"","Ceriodaphnia dubia","<24h old neonate","7 d","LOEC","Survival",3.8,"Microinvertebrate","Arthropoda","Branchiopoda","Freshwater","25-26","Chronic",7.66,"N.A.","Keithly, J. Brooker, J.A., DeForest, D.K., Wu, B.K. and Brix, K.V. (2004). Acute and chronic toxic ity of nickel to a cladoceran (Ceriodaphnia dubia) and an amphipod (Hyallela azteca). Environmental Toxicology and Chemistry 23: 691-696.","174"]
["Freshwater/metal/non- plant","174-5",82,0.82,"","Ceriodaphnia dubia","<24h old neonate","7 d","LOEC","Reproduction",3.8,"Microinvertebrate","Arthropoda","Branchiopoda","Freshwater","25-26","Chronic",7.66,"N.A.","Keithly, J. Brooker, J.A., DeForest, D.K., Wu, B.K. and Brix, K.V. (2004). Acute and chronic toxic ity of nickel to a cladoceran (Ceriodaphnia dubia) and an amphipod (Hyallela azteca). Environmental Toxicology and Chemistry 23: 691-696.","174"]
["Freshwater/metal/non- plant","165-16",85,0.85,"","Ceriodaphnia dubia","<24h old neonate","7-8d","EC10","Reproduction",3.6,"Microinvertebrate","Arthropoda","Branchiopoda","Freshwater","25 ± 2","Chronic",7.3,"N.A.","Peters, A. Merrington, G. Kosmala-Grzechnik, S. (2014). Parameterisation of Biotic Ligand Models for nickel to Australian Test Species. Wca environment Project Number P0313-12-13, 41 pp.","165"]
["Freshwater/metal/plant","165-8",85,0.85,"","Lemna aequinoctialis","6 fronds","96 h","EC10","growth (yield)",3.5,"Macrophyte","Tracheophyta","Liliopsida","Freshwater","29 ± 2","Chronic",8.1999999999999993,"N.A.","Peters, A. Merrington, G. Kosmala-Grzechnik, S. (2014). Parameterisation of Biotic Ligand Models for nickel to Australian Test Species. Wca environment Project Number P0313-12-13, 41 pp.","165"]
["Freshwater/metal/plant","154-14",81,0.83505154639175261,"","Pseudokirchneriella sp.","exponentially growing cells","72 h","NOEC","Growth rate",3.5,"Microalga","Chlorophyta","Chlorophyceae","Freshwater","25°C","Chronic","N.R.","N.A.","Deleebeeck, N.M.E. De Laender, F., Chepurnov, V.A., Vyerman, W., Janseen, C.R. De Schamphelaere, K.A.C. (2009). A single bioavailability model can accurately predict Ni toxicity to green microalgae in soft and hard surface waters. Water Research 43:1935-1947.","154"]
["Freshwater/metal/non- plant","174-16",82,0.82,"","Ceriodaphnia dubia","<24h old neonate","7 d","NOEC","Reproduction",3.4,"Microinvertebrate","Arthropoda","Branchiopoda","Freshwater","25-26","Chronic",7.61,"N.A.","Keithly, J. Brooker, J.A., DeForest, D.K., Wu, B.K. and Brix, K.V. (2004). Acute and chronic toxic ity of nickel to a cladoceran (Ceriodaphnia dubia) and an amphipod (Hyallela azteca). Environmental Toxicology and Chemistry 23: 691-696.","174"]
["Freshwater/metal/non- plant","171-5",83,0.83,null,"Ceriodaphnia quadrangula","<48h old neonate","17 d","EC10","Reproduction",2.95,"Microinvertebrate","Arthropoda","Branchiopoda","Freshwater","20°C","Chronic",7.18,"N.A.","Deleebeeck, N.M. E, Muyssen, B.T.A, De Laender, F, Janssen, C.R., De Schamphelaere, K.A.C (2007). Comparison of nickel toxicity to cladocerans in soft versus hard surface waters, Aquatic Toxicology 84: 223-235.","171"]
["Freshwater/metal/non- plant","171-3",83,0.83,null,"Ceriodaphnia quadrangula","<48h old neonate","17 d","EC10","Reproduction",2.4500000000000002,"Microinvertebrate","Arthropoda","Branchiopoda","Freshwater","20°C","Chronic",7.18,"N.A.","Deleebeeck, N.M. E, Muyssen, B.T.A, De Laender, F, Janssen, C.R., De Schamphelaere, K.A.C (2007). Comparison of nickel toxicity to cladocerans in soft versus hard surface waters, Aquatic Toxicology 84: 223-235.","171"]
["Freshwater/metal/non- plant","165-18",85,0.85,"","Ceriodaphnia dubia","<24h old neonate","7-8d","EC10","Reproduction",2,"Microinvertebrate","Arthropoda","Branchiopoda","Freshwater","25 ± 2","Chronic",8.1999999999999993,"N.A.","Peters, A. Merrington, G. Kosmala-Grzechnik, S. (2014). Parameterisation of Biotic Ligand Models for nickel to Australian Test Species. Wca environment Project Number P0313-12-13, 41 pp.","165"]
["Freshwater/metal/non- plant","162-15",94,0.94,"","Lymnaea stagnalis","<24h old","30 d","EC20","Growth (wet weight)",1.9,"Macroinvertebrate","Mollusca","Gastropoda","Freshwater","25 ± 2","Chronic",7.5,"N.A.","Schlekat, C. E., Genderen, E. V., De Schamphelaerem K. A. C., Antunes, P. M. C., Rogevich, E. C., and Stubblefield, W. A. (2010) Cross-species extrpolation of chronic nickel Biotic Ligand Models. Science of the Total Environment 408, 6148-6157.","162"]
["Freshwater/metal/plant","150-3",67,0.69072164948453607,"The highest possible grade for this datum is acceptable.","Spirodela polyrhiza","3- and 4- frond colonies","7 d","EC10","Biomass (dry weight)",1.9,"Macrophyte","Tracheophyta","Liliopsida","Freshwater","25°C","Chronic","N.R.","N.A.","Appenroth K.-J., Krech, K., Keresztes, A., Fischer, W., Koloczek, H. (2010). Effects of nickel on the chloroplasts of the duckweeds Spirodela polyrhiza and Lemna minor and their possible use in biomonitoring and phytoremediation. Chemosphere 78: 216-223.","150"]
["Freshwater/metal/plant","150-2",67,0.69072164948453607,"The highest possible grade for this datum is acceptable.","Spirodela polyrhiza","3- and 4- frond colonies","7 d","EC10","Biomass (fresh weight)",1.8,"Macrophyte","Tracheophyta","Liliopsida","Freshwater","25°C","Chronic","N.R.","N.A.","Appenroth K.-J., Krech, K., Keresztes, A., Fischer, W., Koloczek, H. (2010). Effects of nickel on the chloroplasts of the duckweeds Spirodela polyrhiza and Lemna minor and their possible use in biomonitoring and phytoremediation. Chemosphere 78: 216-223.","150"]
["Freshwater/metal/non- plant","162-11",94,0.94,"","Lymnaea stagnalis","<24h old","30 d","EC20","Growth (wet weight)",1.6,"Macroinvertebrate","Mollusca","Gastropoda","Freshwater","25 ± 2","Chronic",8,"N.A.","Schlekat, C. E., Genderen, E. V., De Schamphelaerem K. A. C., Antunes, P. M. C., Rogevich, E. C., and Stubblefield, W. A. (2010) Cross-species extrpolation of chronic nickel Biotic Ligand Models. Science of the Total Environment 408, 6148-6157.","162"]
["Freshwater/metal/plant","150-6",67,0.69072164948453607,"The highest possible grade for this datum is acceptable.","Lemna minor","3- and 4- frond colonies","7 d","EC10","Biomass (dry weight)",1.4,"Macrophyte","Tracheophyta","Liliopsida","Freshwater","25°C","Chronic","N.R.","N.A.","Appenroth K.-J., Krech, K., Keresztes, A., Fischer, W., Koloczek, H. (2010). Effects of nickel on the chloroplasts of the duckweeds Spirodela polyrhiza and Lemna minor and their possible use in biomonitoring and phytoremediation. Chemosphere 78: 216-223.","150"]
["Freshwater/metal/non- plant","162-7",94,0.94,"","Lymnaea stagnalis","<24h old","30 d","EC10","growth",1.4,"Macroinvertebrate","Mollusca","Gastropoda","Freshwater","25 ± 2","Chronic",7.3,"N.A.","Schlekat, C. E., Genderen, E. V., De Schamphelaerem K. A. C., Antunes, P. M. C., Rogevich, E. C., and Stubblefield, W. A. (2010) Cross-species extrpolation of chronic nickel Biotic Ligand Models. Science of the Total Environment 408, 6148-6157.","162"]
["Freshwater/metal/plant","150-1",67,0.69072164948453607,"The highest possible grade for this datum is acceptable.","Spirodela polyrhiza","3- and 4- frond colonies","7 d","EC10","Growth rate",1.4,"Macrophyte","Tracheophyta","Liliopsida","Freshwater","25°C","Chronic","N.R.","N.A.","Appenroth K.-J., Krech, K., Keresztes, A., Fischer, W., Koloczek, H. (2010). Effects of nickel on the chloroplasts of the duckweeds Spirodela polyrhiza and Lemna minor and their possible use in biomonitoring and phytoremediation. Chemosphere 78: 216-223.","150"]
["Freshwater/metal/non- plant","161-1",74,0.74,"no mortality in controls","Lymnaea stagnalis","7-8d juvenile",21,"NOEC","growth",1.3,"Macroinvertebrate","Mollusca","Gastropoda","Freshwater","25 ± 1","Chronic",7.8,"N.A.","Niyogi, S., Brix, K. V., Grosell, M. (2014) Effects of chronic waterborne nickel exposure on growth, ion homeostasis, acid - base balance, and nickel uptake in the fresh water pulmonate snail, Lymnaea stagnalis, Aquatic Toxicology, 150, 36-44","161"]
["Freshwater/metal/non- plant","162-9",94,0.94,"","Lymnaea stagnalis","<24h old","30 d","EC10","growth",1.3,"Macroinvertebrate","Mollusca","Gastropoda","Freshwater","25 ± 2","Chronic",7.5,"N.A.","Schlekat, C. E., Genderen, E. V., De Schamphelaerem K. A. C., Antunes, P. M. C., Rogevich, E. C., and Stubblefield, W. A. (2010) Cross-species extrpolation of chronic nickel Biotic Ligand Models. Science of the Total Environment 408, 6148-6157.","162"]
["Freshwater/metal/plant","150-5",67,0.69072164948453607,"The highest possible grade for this datum is acceptable.","Lemna minor","3- and 4- frond colonies","7 d","EC10","Biomass (fresh weight)",1.1000000000000001,"Macrophyte","Tracheophyta","Liliopsida","Freshwater","25°C","Chronic","N.R.","N.A.","Appenroth K.-J., Krech, K., Keresztes, A., Fischer, W., Koloczek, H. (2010). Effects of nickel on the chloroplasts of the duckweeds Spirodela polyrhiza and Lemna minor and their possible use in biomonitoring and phytoremediation. Chemosphere 78: 216-223.","150"]
["Freshwater/metal/non- plant","162-1",94,0.94,"","Lymnaea stagnalis","<24h old","30 d","EC10","growth",1.1000000000000001,"Macroinvertebrate","Mollusca","Gastropoda","Freshwater","25 ± 2","Chronic",8,"N.A.","Schlekat, C. E., Genderen, E. V., De Schamphelaerem K. A. C., Antunes, P. M. C., Rogevich, E. C., and Stubblefield, W. A. (2010) Cross-species extrpolation of chronic nickel Biotic Ligand Models. Science of the Total Environment 408, 6148-6157.","162","NOTE for all entries for citation No. 162: pH values originally taken from paper - general characteristics of the test waters, however, later updated using the SI material, which had pH values for each test sp and water. Also in SI is a list of BLM parameters and ion values used. So, values in _WS sheets for pH are the general characteristic values, whereas the values in this summary are updated using SI material."]
["Freshwater/metal/non- plant","2-2",57,0.56999999999999995,"DO NOT USE - technique to extrapolate LC1 has been reported to be overly conservative. Data also available as LC50","Salmo gairdneri","fertilised eggs","28 days","LC1","Mortality",0.6,"Fish","Chordata","Actinopterygii","Freshwater","12–13","Chronic","7.2–7.8","N.A.","Birge W.J., Hudson J.E., Black J.A. and Westerman A.G. (1978) Embryo-larval bioassays on inorganic coal elements and in situ biomonitoring of coal-waste effluents. In: Symp. U.S. Fish Wildl. Serv., Surface Mining Fish Wildl. Needs in U.S., W.VA 97–104.","2"]
["Freshwater/metal/plant","150-4",67,0.69072164948453607,"The highest possible grade for this datum is acceptable.","Lemna minor","3- and 4- frond colonies","7 d","EC10","Growth rate",0.57999999999999996,"Macrophyte","Tracheophyta","Liliopsida","Freshwater","25°C","Chronic","N.R.","N.A.","Appenroth K.-J., Krech, K., Keresztes, A., Fischer, W., Koloczek, H. (2010). Effects of nickel on the chloroplasts of the duckweeds Spirodela polyrhiza and Lemna minor and their possible use in biomonitoring and phytoremediation. Chemosphere 78: 216-223.","150"]

{"sheet":"FW metal nonplant","index":5,"n_rows":90,"n_cols":54,"rows_kept":90,"cut":false,"hidden":false,"merged":[[3,4,7,4],[9,2,9,4],[11,2,13,2],[11,7,13,7],[14,2,16,2],[14,7,16,7],[17,2,19,2],[17,7,19,7],[20,2,21,2],[20,7,21,7],[22,2,24,2],[22,7,24,7],[25,2,27,2],[25,7,27,7],[28,2,30,2],[28,7,30,7],[31,2,33,2],[31,7,33,7],[34,2,36,2],[34,7,36,7],[37,2,39,2],[37,7,39,7],[40,2,42,2],[40,7,42,7],[43,2,45,2],[43,7,45,7],[46,2,48,2],[46,7,48,7],[49,2,51,2],[49,7,51,7],[62,7,64,7],[74,2,77,2],[74,7,77,7],[52,2,54,2],[52,7,54,7],[56,7,58,7],[65,7,67,7],[68,7,70,7],[71,2,73,2],[71,7,73,7],[59,7,61,7]]}
[null,1,"Fill in the blank cells below, based on information provided in the paper being assessed. You can either pick an option from the dropdown list or add the appropriate detail using the 'Add to list' button. ",null,null,null,null,null,null,null,null,null,null,null,"* All the text in RED are used for drop down list ,make changes with caution."]
[null,null,"Category",{"$f":"IF(AF3=\"\",0,1)","v":1},"Freshwater/metal/non- plant",{"$f":"IF(E3=\"\",0,1)","v":1},"Citation No.",{"$f":"IF(ISERROR(FIND(\"-\",E3)),E3,LEFT(E3,FIND(\"-\",E3)-1))","v":"177"},null,"Taxonomic group",null,null,null,null,"Species",null,null,"Lifestage",null,null,"Exposure duration",null,null,"Measure of toxicity",null,null,"Toxicity endpoint",null,null,"Taxonomic group",null,null,"Phylum",null,null,"Class",null,null,"Media",null,null,"Temperature ",null,null,"Acute Or Chronic",null,null,"PH",null,null,"Salinity/Comdictivity"]
[null,null,"Paper and data unique identifier(eg. 1-1,10-150)",{"$f":"IF(AI3=\"\",0,1)","v":1},"177-15",{"$f":"IF(E4=\"\",0,1)","v":1},"Species (Scientific name)",null,null,"Phylum",null,null,null,null,"Aedes albopictus",34,{"$f":"IF(P3=0,\"\",INDEX(O3:O111,P3))","v":"Melanotaenia splendida splendida"},"<12h nauplii",18,{"$f":"IF(S3=0,\"\",INDEX(R3:R111,S3))","v":"embryo"},"10 d",25,{"$f":"IF(V3=0,\"\",INDEX(U3:U111,V3))","v":"12-d"},"EC10",12,{"$f":"IF(Y3=0,\"\",INDEX(X3:X111,Y3))","v":"NOEC"},"edema",18,{"$f":"IF(AB3=0,\"\",INDEX(AA3:AA111,AB3))","v":"Embryo hatching success/imbalance"},"Bacteria",2,{"$f":"IF(AE3=0,\"\",INDEX(AD3:AD111,AE3))","v":"Fish"},"Arthropoda",3,{"$f":"IF(AH3=0,\"\",INDEX(AG3:AG111,AH3))","v":"Chordata"},"Actinopterygii",1,{"$f":"IF(AK3=0,\"\",INDEX(AJ3:AJ111,AK3))","v":"Actinopterygii"},"Freshwater",9,{"$f":"IF(AN3=0,\"\",INDEX(AM3:AM111,AN3))","v":"Tea Tree River"},26,7,{"$f":"IF(AQ3=0,\"\",INDEX(AP3:AP111,AQ3))","v":"25 ± 2"},"Acute ",2,{"$f":"IF(AT3=0,\"\",INDEX(AS3:AS111,AT3))","v":"Chronic"},6.9,29,{"$f":"IF(AW3=0,\"\",INDEX(AV3:AV111,AW3))","v":"6.9-7.2"},null,null,"N.A.",1]
[null,null,"Citation",{"$f":"IF(AL3=\"\",0,1)","v":1},"Ecotox Services Australia. 2014. Toxicity of Nickel Under Varying Physico-chemical Conditions. Prepared for Nickel Producers Environmental Research Association (NiPERA). Test Report. May 2014.",{"$f":"IF(H8=\"\",0,1)","v":1},"Lifestage",null,null,"Class",null,null,null,null,"Aeromonas hydrophila",null,null,"<24h old",null,null,"11 d",null,null,"EC20",null,null,"growth",null,null,"Fish",null,null,"Chlorophyta",null,null,"Branchiopoda",null,null,"Marinewater",null,null,"15°C",null,null,"Chronic",null,null,7]
[null,null,null,{"$f":"IF(AO3=\"\",0,1)","v":1},null,{"$f":"IF(AX3=\"\",0,1)","v":1},"Exposure duration",null,null,"Media",null,null,null,null,"Alona affinis",null,null,"<24h old neonate",null,null,"11 hour",null,null,"EC25",null,null,"growth",null,null,"Gastropod",null,null,"Chordata",null,null,"Chlorophyceae",null,null,"N.A.",null,null,"20°C",null,null,"N.A.",null,null,7.1]
[null,null,null,{"$f":"IF(AR3=\"\",0,1)","v":1},null,{"$f":"IF(Q3=\"\",0,1)","v":1},"Measure of toxicity",null,null,"Temperature ",null,null,null,null,"Australian Bass",null,null,"<2d old embryos",null,null,"12 weeks",null,null,"EC50",null,null,"Growth (AFDW)",null,null,"Insect",null,null,"Cnidaria",null,null,"Gammaproteobacteria",null,null,"Synthetic Magela Creek Water (SMCW)",null,null,"23°C",null,null,null,null,null,7.18]
[null,null,null,{"$f":"IF(AU3=\"\",0,1)","v":1},null,{"$f":"IF(T3=\"\",0,1)","v":1},"Toxicity endpoint",null,null,"Acute Or Chronic ",null,null,null,null,"Brachionus calcyflorus",null,null,"<48h old neonate",null,null,"13 days",null,null,"larval development",null,null,"Growth (dry weight)",null,null,"Macroinvertebrate",null,null,"Mollusca",null,null,"Gastropoda",null,null,"Woronora River water",null,null,"23-25",null,null,null,null,null,7.3]
[null,null,null,null,null,{"$f":"IF(W3=\"\",0,1)","v":1},"Toxicity value",52,null,"PH",null,null,null,null,"Brachydanio rerio",null,null,"0-1 week old young",null,null,"14 d",null,null,"larval development ratio",null,null,"Growth (wet weight)",null,null,"Macrophyte",null,null,"N.A.",null,null,"Hexanauplia",null,null,"Magela Creek",null,null,"25 ± 1",null,null,null,null,null,7.4]
[null,2,"Select the appropriate answer option to each question. Comments can be added to the cells in column H.",null,null,{"$f":"IF(Z3=\"\",0,1)","v":1},null,null,null,"Salinity/Conductivity","N.A.",null,null,null,"Camptocerus lilljeborgi",null,null,"1 d old larvae",null,null,"15 d",null,null,"LC20",null,null,"Hatching",null,null,"Microalga",null,null,"Proteobacteria",null,null,"Hydrozoa",null,null,"Peechalba River",null,null,"25 ± 2",null,null,null,null,null,7.61]
[null,"*","If the selected answer option does not work try clicking on any other cell first and then click back on the answer option again.",null,null,{"$f":"IF(AC3=\"\",0,1)","v":1},null,null,null,null,null,null,null,null,"Catla catla",null,null,"1 month",null,null,"15-17d",null,null,"LC25",null,null,"larval development",null,null,"Microinvertebrate",null,null,"Tracheophyta",null,null,"Insecta",null,null,"Wellington River",null,null,"25.3 ± 0.8",null,null,null,null,null,7.66]
[null,"No.","Question","Marks Awarded","Answer Options","Option References","Scores","Answers",null,null,null,null,null,null,"Ceriodaphnia dubia",null,null,"1 year old",null,null,"16 d",null,null,"LC50",null,null,"length",null,null,"N.A.",null,null,"Tracheophyta",null,null,"Liliopsida",null,null,"Tea Tree River",null,null,"25°C",null,null,null,null,null,7.7]
[null,null,"Was the duration of the exposure stated (e.g. 48 or 96 h)?",10,null,1,{"$f":"IF(F15=0,0,INDEX($D12:$D13,F12,1))","v":10},"12-d",null,null,null,null,null,null,"Ceriodaphnia pulchella",null,null,"10-13 cm, 8-12g",null,null,"17 d",null,null,"LOEC",null,null,"Mortality",null,null,null,null,null,null,null,null,"Malacostraca",null,null,null,null,null,"25-26",null,null,null,null,null,7.8]
[null,1,null,0,null,null,null,null,null,null,null,null,null,null,"Ceriodaphnia quadrangula",null,null,"120-d old",null,null,"17 d",null,null,"N.A.",null,null,"mortality",null,null,null,null,null,null,null,null,"N.A.",null,null,null,null,null,"25-26",null,null,null,null,null,7.8]
[null,null,null,null,null,null,null,null,null,null,null,null,null,null,"Chironomus tentans",null,null,"1-d old cells",null,null,"20 h",null,null,"NOEC",null,null,"N.A.",null,null,null,null,null,null,null,null,null,null,null,null,null,null,"27 ± 2",null,null,null,null,null,7.8]
[null,null,"Was the biological endpoint (e.g. immobilization or population growth) stated and defined (10 marks)? Award 5 marks if the biological endpoint is only stated.",10,null,2,{"$f":"IF(F15=0,0,INDEX($D15:$D17,F15,1))","v":5},"imbalance of hatched embryos",null,null,null,null,null,null,"Cirrhina mrigala",null,null,"3- and 4- frond colonies",null,null,"21 d",null,null,"population growth",null,null,"population growth",null,null,null,null,null,null,null,null,null,null,null,null,null,null,"28°C",null,null,null,null,null,8]
[null,2,null,5,null,null,null,null,null,null,null,null,null,null,"Cyprinus carpio",null,null,"3-frond colonies",null,null,"21 d",null,null,null,null,null,"Population growth rate",null,null,null,null,null,null,null,null,null,null,null,null,null,null,"N.A.",null,null,null,null,null,8.1]
[null,null,null,0,null,null,null,null,null,null,null,null,null,null,"Danio rerio",null,null,"7-8d juvenile",null,null,"21-24d",null,null,null,null,null,"Reproduction",null,null,null,null,null,null,null,null,null,null,null,null,null,null,"NR",null,null,null,null,null,"6.5-7.0"]
[null,null,"Was the biological effect stated (e.g. LC or NOEC)?",5,null,1,{"$f":"IF(F18=0,0,INDEX($D18:$D19,F18,1))","v":5},"NOEC",null,null,null,null,null,null,"Daphnia longispina",null,null,"asexually reproducing (budding) hydriods",null,null,"30 d",null,null,null,null,null,"shell thinning",null,null,null,null,null,null,null,null,null,null,null,null,null,null,"27 oC",null,null,null,null,null,"7.5 (7.2-7.8)"]
[null,3,null,0,null,null,null,null,null,null,null,null,null,null,"Daphnia magna",null,null,"blastula stage (2-4h after spawning)",null,null,"4 weeks",null,null,null,null,null,"Survival",null,null,null,null,null,null,null,null,null,null,null,null,null,null,null,null,null,null,null,null,"7.5-7.7"]
[null,null,null,null,null,null,null,null,null,null,null,null,null,null,"Hyallela azteca",null,null,"embryo",null,null,"48 h",null,null,null,null,null,"Embryo hatching success/imbalance",null,null,null,null,null,null,null,null,null,null,null,null,null,null,null,null,null,null,null,null,"7.99 ± 0.14"]
[null,4,"Was the biological effect quantified (e.g. 50% effect, 25% effect)? \nNote: The effect for NOEC and LOEC data must be quantified.",5,null,1,{"$f":"IF(F21=0,0,INDEX($D21:$D22,F21,1))","v":5},"72% effect",null,null,null,null,null,null,"Hydra viridissima",null,null,"exponentially growing populatiuon of daphnids",null,null,"7 d",null,null,null,null,null,null,null,null,null,null,null,null,null,null,null,null,null,null,null,null,null,null,null,null,null,null,"8.0-8.3"]
[null,null,null,0,null,null,null,null,null,null,null,null,null,null,"Lemna minor",null,null,"juvenile",null,null,"7 d",null,null,null,null,null,null,null,null,null,null,null,null,null,null,null,null,null,null,null,null,null,null,null,null,null,null,"N.A."]
[null,5,"Were appropriate controls (e.g. a no-toxicant control and/or solvent control) used?",5,null,1,{"$f":"IF(F23=0,0,INDEX($D23:$D24,F23,1))","v":5},"Yes, DMW lab water control and River water control",null,null,null,null,null,null,"Lymnaea stagnalis",null,null,"N.A.",null,null,"7-8d",null,null,null,null,null,null,null,null,null,null,null,null,null,null,null,null,null,null,null,null,null,null,null,null,null,null,"N.R."]
[null,null,null,0,null,null,null,null,null,null,null,null,null,null,"Melanotenia splendida splendida",null,null,"N.R.",null,null,"9 d",null,null,null,null,null,null,null,null,null,null,null,null,null,null,null,null,null,null,null,null,null,null,null,null,null,null,"PH11"]
[null,null,null,null,null,null,null,null,null,null,null,null,null,null,"Mesocyclops pehpeinsis",null,null,"nauplius",null,null,"96 h",null,null,null,null,null,null,null,null,null,null,null,null,null,null,null,null,null,null,null,null,null,null,null,null,null,null,"PH7.0"]
[null,6,"Was each control and contaminant concentration at least duplicated?",5,null,1,{"$f":"IF(F26=0,0,INDEX($D26:$D27,F26,1))","v":5},"4 replicates",null,null,null,null,null,null,"Moina macrocopa",null,null,"second instar larvae",null,null,"N.A.",null,null,null,null,null,null,null,null,null,null,null,null,null,null,null,null,null,null,null,null,null,null,null,null,null,null,6.5]
[null,null,null,0,null,null,null,null,null,null,null,null,null,null,"N.A.",null,null,null,null,null,"12-d",null,null,null,null,null,null,null,null,null,null,null,null,null,null,null,null,null,null,null,null,null,null,null,null,null,null,"7.1-7.4"]
[null,null,null,null,null,null,null,null,null,null,null,null,null,null,"Oreochromis niloticus",null,null,null,null,null,null,null,null,null,null,null,null,null,null,null,null,null,null,null,null,null,null,null,null,null,null,null,null,null,null,null,null,6.3]
[null,7,"Were test acceptability criteria stated (e.g. mortality in controls must not exceed a certain percentage) (5 marks)?\nOR Were test acceptability criteria inferred (e.g. test method used [USEPA, OECD, ASTM etc.]) (award 2 marks). \nNote: Data that fail the acceptability criteria are automatically deemed to be of unacceptable quality and must not be used. ",5,null,1,{"$f":"IF(F29=0,0,INDEX($D29:$D31,F29,1))","v":5},"Cited ESA SOP 126 (ESA, 2013) and USEPA (2002) and required >=80% survival in the controls",null,null,null,null,null,null,"Peracantha truncata",null,null,null,null,null,null,null,null,null,null,null,null,null,null,null,null,null,null,null,null,null,null,null,null,null,null,null,null,null,null,null,null,"7.9-8.10"]
[null,null,null,2,null,null,null,null,null,null,null,null,null,null,"Pimephales promelas",null,null,null,null,null,null,null,null,null,null,null,null,null,null,null,null,null,null,null,null,null,null,null,null,null,null,null,null,null,null,null,null,"7.7-7.9"]
[null,null,null,0,null,null,null,null,null,null,null,null,null,null,"Radix quadrisi",null,null,null,null,null,null,null,null,null,null,null,null,null,null,null,null,null,null,null,null,null,null,null,null,null,null,null,null,null,null,null,null,"6.9-7.2"]
[null,8,"Were the characteristics of the test organism (e.g. length, mass, age) stated?",5,null,1,{"$f":"IF(F32=0,0,INDEX($D32:$D34,F32,1))","v":5},"<24h fertilised eggs",null,null,null,null,null,null,"Rhodospirillum photometricum"]
[null,null,null,0,null,null,null,null,null,null,null,null,null,null,"Simocephalus serrulatus"]
[null,null,null,null,null,null,null,null,null,null,null,null,null,null,"Simocephalus vetulus"]
[null,9,"Was the type of test media used stated?",5,null,1,{"$f":"IF(F35=0,0,INDEX($D35:$D37,F35,1))","v":5},"Tea Tree water",null,null,null,null,null,null,"Spirodela polyrhiza"]
[null,null,null,0,null,null,null,null,null,null,null,null,null,null,"Melanotaenia splendida splendida"]
[]
[null,null,"Was the type of exposure (e.g. static, flow through) stated? ",4,null,1,{"$f":"IF(F38=0,0,INDEX($D38:$D40,F38,1))","v":4},"Static renewal. Solutions renewed every 48 h"]
[null,10,null,0]
[]
[null,null,"Were the contaminant concentrations measured at the beginning and end of the exposure (4 marks)? Award 2 marks if they were measured only once during the test.\nNote: If the concentrations were not measured then automatically the data cannot be high quality. ",4,null,1,{"$f":"IF(F41=0,0,INDEX($D41:$D43,F41,1))","v":4},"Dissolved Ni measured at beginning, during and end of test on new and old test solutions"]
[null,11,null,2]
[null,null,null,0]
[null,null,"Were parallel reference toxicant toxicity tests conducted?",4,null,1,{"$f":"IF(F44=0,0,INDEX($D44:$D46,F44,1))","v":4},"Copper reference test"]
[null,12,null,0]
[]
[null,null,"Was there a concentration–response relationship either observable or stated?",4,null,1,{"$f":"IF(F47=0,0,INDEX($D47:$D49,F47,1))","v":4}]
[null,13,null,0]
[]
[null,null,"Was an appropriate statistical method or model used to determine the toxicity?\nNote: They should be accepted by a recognised national or international regulatory body (e.g. USEPA, OECD, ASTM). ",4,null,1,{"$f":"IF(F50=0,0,INDEX($D50:$D52,F50,1))","v":4},"Toxcalc v5.0.23"]
[null,14,null,0]
[]
[null,15,"For LC/EC/BEC data was an estimate of variability provided? \nOR \nFor NO EC/LOEC data was the significance level 0.05 or less?  \n\n",4,null,1,{"$f":"IF(F53=0,0,INDEX($D53:$D55,F53,1))","v":4},"P<0.05"]
[null,null,null,0]
[]
[null,16,"Were the following parameters measured and stated? (3 marks if measured and stated, 1 mark if just measured)."]
[null,null,null,3,null,1,{"$f":"IF(F57=0,0,INDEX($D57:$D59,F57,1))","v":3},"6.9-7.2"]
[null,16.100000000000001,"pH",1]
[null,null,null,0]
[null,null,null,3,null,1,{"$f":"IF(F60=0,0,INDEX($D60:$D62,F60,1))","v":3},"Ca = 2.1 mg/L\nMg = 4.7 mg/L\nBased on Ca and Mg, hardness = 25 mg/L as CaCO3"]
[null,16.2,"Hardness",1]
[null,null,null,0]
[null,null,null,3,null,1,{"$f":"IF(F63=0,0,INDEX($D63:$D65,F63,1))","v":3},"Total Alkalinity as CaCO3 = 14 mg/L"]
[null,16.3,"Alkalinity",1]
[null,null,null,0]
[null,null,null,3,null,1,{"$f":"IF(F66=0,0,INDEX($D66:$D68,F66,1))","v":3},"DOC = 10 mg/L"]
[null,16.399999999999999,"Organic carbon concentration",1]
[null,null,null,0]
[null,null,null,3,null,1,{"$f":"IF(F69=0,0,INDEX($D69:$D71,F69,1))","v":3},"111-113% saturation"]
[null,16.5,"Dissolved Oxygen",1]
[null,null,null,0]
[null,null,"Was the temperature measured and stated (3 marks)? Award 1 mark if the temperature was measured but not stated or if only the temperature settings of the room or chamber are stated.",3,null,2,{"$f":"IF(F72=0,0,INDEX($D72:$D74,F72,1))","v":1},"25 +/- oC"]
[null,17,null,1]
[null,null,null,0]
[null,null,"Were test solutions, blanks and/or controls tested for contamination OR were analytical reagent grade chemicals used or the highest possible purity chemicals used for the experiment? (3 marks).",3,null,1,{"$f":"IF(F75=0,0,INDEX($D75:$D76,F75,1))","v":3},"Dilution water was analysed for multiple metals"]
[null,18,null,0]
[]
[null,null,null,null,null,null,null,null,{"$f":"(COUNTIF(F12:F76,\"=0\"))+COUNTIF(F2:F10,\"=0\")+COUNTIF(D2:D7,\"=0\")","v":0}]
[]
[]
[null,null,"Total score",null,null,null,{"$f":"IF(SUM(G12:G75)=0,\"\",SUM(G12:G75))","v":93}]
[null,null,"Total Max. possible score for the various types of data and contaminants ",null,{"$f":"D12+D15+D18+D21+D23+D26+D29+D32+D35+D38+D41+D44+D47+D50+D53+D57+D66+D69+D72+D75+D63+D60","v":100}]
[null,null,"Quality Score",null,{"$f":"\"= [Total score / Total possible score] * 100 = \"","v":"= [Total score / Total possible score] * 100 = "},null,{"$f":"IF(ISERROR(G81/E82),#N/A,G81/E82)","v":0.93},{"$f":"IF(F41=3,\"The highest possible grade for this datum is acceptable.\",\"\")","v":""}]
[]
[null,null,"H = high quality                           Quality score ≥ 80%     "]
[null,null,"A = acceptable quality         > 50% Quality score < 80%  "]
[null,null,"U = unacceptable quality              Quality score ≤ 50% "]
[]
[3,null,"Click the 'Save & Update' button to save and export the answers to the 'All results' worksheet. "]
[null,null,"Select the 'Reset Answers' button if you wish to clear all answers."]

{"sheet":"FW metal nonplant_WS","index":6,"n_rows":911,"n_cols":26,"rows_kept":911,"cut":false,"hidden":false,"merged":[]}
[]
["Question No.",1,2,3,4,5,6,7,8,9,10,11,12,13,14,15,16.100000000000001,16.2,16.3,16.399999999999999,16.600000000000001,17,18,"Total Score","Quality Score"]
["Short Questions","Duration of the exposure ","Biological endpoint","Biological effect stated or not","Biological effect quantified or not","Appropriate controls","Control & contaminant concentration","Test acceptability criteria","Characteristics of the test organism"," Type of test media","Type of exposure","Contaminant concentrations","Parallel reference toxicant toxicity tests","Concentration–response relationship","Determine the toxicity","NOEC/LOEC or LC/EC/BEC","pH","Hardness","Alkalinity","Organic carbon concentration","Dissolved Oxygen","Temperature","Grade or purity"]
["Marks Awarded ","10 or 0","10,5 or 0","5 or 0 ","5 or 0 ","5 or 0 ","5 or 0 ","5 or 0 ","5 or 0 ","5 or 0 ","4 or 0","4 or 2 or 0","4 or 2","4 or 2","4 or 2","4 or 2","3 or 1 or 0","3 or 1 or 0","3 or 1 or 0","3 or 1 or 0","3 or 1 or 0","3 or 0","3 or 0 "]
["Max. Possible Score",10,10,5,5,5,5,5,5,5,4,4,4,4,4,4,3,3,3,3,3,3,3,{"$f":"SUM(B5:W5)","v":100}]
["Category","Freshwater/metal/non- plant","Paper and data unique identifier(eg. 1-1,10-150)","151-1"]
["Scores",10,10,0,5,5,0,0,0,5,0,0,0,4,0,0,1,0,0,0,0,1,0,41,0.41,"The highest possible grade for this datum is acceptable."]
["Answers","20 h","Growth - measured as increase in turbidity","Not stated, but '50% growth' value reported","EC50 of 0.22 µM nickel, converted = 13 mg/L","","NR","","","Broth (1% glucose, 0.5% neopeptone)","","","","","","","pH 7","","","","",28,""]
["Category","Freshwater/metal/non- plant","Paper and data unique identifier(eg. 1-1,10-150)","153-1"]
["Scores",10,10,5,5,5,0,0,5,5,4,0,0,4,0,0,3,1,0,0,3,3,3,66,0.66,"The highest possible grade for this datum is acceptable."]
["Answers","15 d","No. of living embryos (transparent) and larvae (motile).","NOEC, ZEP","NOEC based on comparison of 95% confidence limits around responses. Also Zero Equivalent Point (ZEP) calcualted graphically.","","Unclear. It states that 11 concentrations of each metal and two controls? So only Controls duplicated.","Control values and variability assessed, but acceptablity criteria not defined.","","Synthetic water, with given recipe details.","static renewal","","","","Only comparison of overlapping 95%CLs for NOECs, and by-eye comaprisons for ZEP.","","7.5-7.7","100 mg/L","","","88-100%","25.4-26.4","analytcal grade"]
["Category","Freshwater/metal/non- plant","Paper and data unique identifier(eg. 1-1,10-150)","153-1"]
["Scores",10,10,5,0,5,0,0,5,5,4,0,0,4,0,0,3,1,0,0,3,3,3,61,0.61,"The highest possible grade for this datum is acceptable."]
["Answers","15 d","No. of living embryos (transparent) and larvae (motile).","NOEC, ZEP","NOEC based on comparison of 95% confidence limits around responses. Also Zero Equivalent Point (ZEP) calcualted graphically.","","Unclear. It states that 11 concentrations of each metal and two controls? So only Controls duplicated.","Control values and variability assessed, but acceptablity criteria not defined.","","Synthetic water, with given recipe details.","static renewal","","","","Only comparison of overlapping 95%CLs for NOECs, and by-eye comaprisons for ZEP.","","7.5-7.7","100 mg/L","","","88-100%","25.4-26.4","analytcal grade"]
["Category","Freshwater/metal/non- plant","Paper and data unique identifier(eg. 1-1,10-150)","153-1"]
["Scores",10,10,5,0,5,0,0,5,5,4,0,0,4,0,0,3,1,0,0,3,3,3,61,0.61,"The highest possible grade for this datum is acceptable."]
["Answers","15 d","No. of living embryos (transparent) and larvae (motile).","NOEC, ZEP","NOEC based on comparison of 95% confidence limits around responses. Also Zero Equivalent Point (ZEP) calcualted graphically.","","Unclear. It states that 11 concentrations of each metal and two controls? So only Controls duplicated.","Control values and variability assessed, but acceptablity criteria not defined.","","Synthetic water, with given recipe details.","static renewal","","","","Only comparison of overlapping 95%CLs for NOECs, and by-eye comaprisons for ZEP.","","7.5-7.7","100 mg/L","","","88-100%","25.4-26.4","analytcal grade"]
["Category","Freshwater/metal/non- plant","Paper and data unique identifier(eg. 1-1,10-150)","155-1"]
["Scores",10,10,5,0,5,5,2,5,5,4,0,0,0,4,0,1,1,1,0,0,1,3,62,0.62,"The highest possible grade for this datum is acceptable."]
["Answers","14 d"," Hatchability is the number of embryos that\nsuccessfully emerged from egg capsule divided by the total number of eggs in a single egg mass ","NOEC","","","5 replicates","States that all Control animals showed normal development, but no mention of Control response in acute test","Egg masses with embryos that had reached trocophore stage (2d post oviposition)","Aged tap water","semi-static renewal","","","innapropriate concentration range tested","ANOVA and Tukey for NOEC","not stated what significance level was used.","7.81 ± 0.01 in test medium, aged tap water. No data for treatments.","Measured but not reported","146.78± 1.46 mg/L CaCO3 in test medium","","",25,"states that 'no other heavy metals were detected among the water samples tested'"]
["Category","Freshwater/metal/non- plant","Paper and data unique identifier(eg. 1-1,10-150)","155-2"]
["Scores",10,10,5,0,5,5,2,5,5,4,0,0,0,4,0,1,1,1,0,0,1,3,62,0.62,"The highest possible grade for this datum is acceptable."]
["Answers","14 d","shell thinning - shown in figures","NOEC","","","5 replicates","States that all Control animals showed normal development, but no mention of Control response in acute test","Egg masses with embryos that had reached trocophore stage (2d post oviposition)","Aged tap water","semi-static renewal","","","innapropriate concentration range tested","ANOVA and Tukey for NOEC","not stated what significance level was used.","7.81 ± 0.01 in test medium, aged tap water. No data for treatments.","Measured but not reported","146.78± 1.46 mg/L CaCO3 in test medium","","",25,"states that 'no other heavy metals were detected among the water samples tested'"]
["Category","Freshwater/metal/non- plant","Paper and data unique identifier(eg. 1-1,10-150)","155-3"]
["Scores",10,10,5,0,5,5,2,5,5,4,0,0,0,4,0,1,1,1,0,0,1,3,62,0.62,"The highest possible grade for this datum is acceptable."]
["Answers","14 d","growth inhibition - using Table from a refernce for normal larval development.","NOEC","","","5 replicates","States that all Control animals showed normal development, but no mention of Control response in acute test","Egg masses with embryos that had reached trocophore stage (2d post oviposition)","Aged tap water","semi-static renewal","","","innapropriate concentration range tested","ANOVA and Tukey for NOEC","not stated what significance level was used.","7.81 ± 0.01 in test medium, aged tap water. No data for treatments.","Measured but not reported","146.78± 1.46 mg/L CaCO3 in test medium","","",25,"states that 'no other heavy metals were detected among the water samples tested'"]
["Category","Freshwater/metal/non- plant","Paper and data unique identifier(eg. 1-1,10-150)","155-4"]
["Scores",10,10,5,0,5,5,2,5,5,4,0,0,0,4,0,1,1,1,0,0,1,3,62,0.62,"The highest possible grade for this datum is acceptable."]
["Answers","14 d","growth inhibition - using Table from a refernce for normal larval development.","NOEC","","","5 replicates","States that all Control animals showed normal development, but no mention of Control response in acute test","Egg masses with embryos that had reached trocophore stage (2d post oviposition)","Aged tap water","semi-static renewal","","","innapropriate concentration range tested","ANOVA and Tukey for NOEC","not stated what significance level was used.","7.81 ± 0.01 in test medium, aged tap water. No data for treatments.","Measured but not reported","146.78± 1.46 mg/L CaCO3 in test medium","","",25,"states that 'no other heavy metals were detected among the water samples tested'"]
["Category","Freshwater/metal/non- plant","Paper and data unique identifier(eg. 1-1,10-150)","158-1"]
["Scores",10,5,5,5,5,5,2,5,5,4,4,0,4,4,0,3,0,0,0,3,3,3,75,0.75,""]
["Answers","11 d","Mortality","LC",20,"","triplicate","","<1h embryos","reconstituted water (OECDGuideline 203; ISO-Standard 6341-1982)","seim-static. Partial renewals every 2d","","","","","","7.99 ±0.14","","","","7.94 ± 0.24 mg/L","25.3 ± 0.8","Control measured"]
["Category","Freshwater/metal/non- plant","Paper and data unique identifier(eg. 1-1,10-150)","159-1"]
["Scores",10,5,5,5,5,5,2,5,5,4,0,0,4,4,0,3,3,0,0,3,3,0,71,0.71,"The highest possible grade for this datum is acceptable."]
["Answers","11 d","mortality","LC",20,"","triplicate","Control results given (low mortality/effects), but acceptablity criteria not stated.","Eggs, 2-4h post fertilisation","reconstituted water (OECDGuideline 203; ISO-Standard 6341-1982)","semi-static, 1/3 renewal every day","","","","","","7.99 ± 0.14",231.4,"","","7.94 ± 0.24","25.3 ± 0.8",""]
["Category","Freshwater/metal/non- plant","Paper and data unique identifier(eg. 1-1,10-150)","161-1"]
["Scores",10,10,0,5,5,5,2,5,5,4,4,0,4,4,4,1,1,0,1,0,1,3,74,0.74,""]
["Answers","21d","growth (body mass)","Taken from data in figure and text","","","10 replicates, 1 animal per rep","no mortality in controls","7-8d juveniles","Dechlorinated City of Miami tap water","semi-static (daily renewal)","measured throughout ","","","","p<0.05",7.8,"1.64 mg CaCO3/L","","200 µmol/L DOC","","25 ± 1","controls confirmed no Ni"]
["Category","Freshwater/metal/non- plant","Paper and data unique identifier(eg. 1-1,10-150)","161-2"]
["Scores",10,10,5,5,5,5,2,5,5,4,4,0,4,4,4,1,1,0,1,0,1,3,79,0.79,""]
["Answers","21d","growth (body mass)","LC",20,"","10 replicates, 1 animal per rep","no mortality in controls","7-8d juveniles","Dechlorinated City of Miami tap water","semi-static (daily renewal)","measured throughout ","","","","p<0.05",7.8,"1.64 mg CaCO3/L","","200 µmol/L DOC","","25 ± 1","controls confirmed no Ni"]
["Category","Freshwater/metal/non- plant","Paper and data unique identifier(eg. 1-1,10-150)","162-1"]
["Scores",10,10,5,5,5,5,5,5,5,4,4,0,4,4,4,3,3,3,3,1,3,3,94,0.94,""]
["Answers","30 d","defined as wet weight","EC",10,"","10 replicates","70% survival of controls (in supplementary material)","<24h old","Calapooia river water","static-renewal, renewed 3 times per week","Measured several times","","","","95% CLs",8,212,200,"0.69 DOC","measured but not reported","25 ± 2",""]
["Category","Freshwater/metal/non- plant","Paper and data unique identifier(eg. 1-1,10-150)","162-2"]
["Scores",10,10,5,5,5,5,5,5,5,4,4,0,4,4,4,3,3,3,3,1,3,3,94,0.94,""]
["Answers","30 d","defined as wet weight","NOEC","NOEC","","10 replicates","70% survival of controls (in supplementary material)","<24h old","Calapooia river water","static-renewal, renewed 3 times per week","Measured several times","","","","5% significnace",8,212,200,"0.69 DOC","measured but not reported","25 ± 2",""]
["Category","Freshwater/metal/non- plant","Paper and data unique identifier(eg. 1-1,10-150)","162-3"]
["Scores",10,10,5,5,5,5,5,5,5,4,4,0,4,4,4,3,3,3,3,1,3,3,94,0.94,""]
["Answers","30 d","defined as wet weight","EC",10,"","10 replicates","70% survival of controls (in supplementary material)","<24h old","S. Platte River water","static-renewal, renewed 3 times per week","Measured several times","","","","95% CLs",7.8,256,160,"7.1 doc","measured but not reported","25 ± 2",""]
["Category","Freshwater/metal/non- plant","Paper and data unique identifier(eg. 1-1,10-150)","162-4"]
["Scores",10,10,5,5,5,5,5,5,5,4,4,0,4,4,4,3,3,3,3,1,3,3,94,0.94,""]
["Answers","30 d","defined as wet weight","NOEC","NOEC","","10 replicates","70% survival of controls (in supplementary material)","<24h old","S. Platte River water","static-renewal, renewed 3 times per week","Measured several times","","","","",7.8,256,160,"7.1 doc","measured but not reported","25 ± 2",""]
["Category","Freshwater/metal/non- plant","Paper and data unique identifier(eg. 1-1,10-150)","162-5"]
["Scores",10,10,5,5,5,5,5,5,5,4,4,0,4,4,4,3,3,3,3,1,3,3,94,0.94,""]
["Answers","30 d","defined as wet weight","EC",10,"","10 replicates","70% survival of controls (in supplementary material)","<24h old","S. Platte River water (pH amended)","static-renewal, renewed 3 times per week","Measured several times","","","","",6.9,256,16,"7 doc","measured but not reported","25 ± 2",""]
["Category","Freshwater/metal/non- plant","Paper and data unique identifier(eg. 1-1,10-150)","162-6"]
["Scores",10,10,5,5,5,5,5,5,5,4,4,0,4,4,4,3,3,3,3,1,3,3,94,0.94,""]
["Answers","30 d","defined as wet weight","NOEC","NOEC","","10 replicates","70% survival of controls (in supplementary material)","<24h old","S. Platte River water (pH amended)","static-renewal, renewed 3 times per week","Measured several times","","","","",6.9,256,16,"7 doc","measured but not reported","25 ± 2",""]
["Category","Freshwater/metal/non- plant","Paper and data unique identifier(eg. 1-1,10-150)","162-7"]
["Scores",10,10,5,5,5,5,5,5,5,4,4,0,4,4,4,3,3,3,3,1,3,3,94,0.94,""]
["Answers","30 d","defined as wet weight","EC",10,"","10 replicates","70% survival of controls (in supplementary material)","<24h old","S. Santiam River water","static-renewal, renewed 3 times per week","Measured several times","","","","",7.1,16,24,"0.94 doc","measured but not reported","25 ± 2",""]
["Category","Freshwater/metal/non- plant","Paper and data unique identifier(eg. 1-1,10-150)","162-8"]
["Scores",10,10,5,5,5,5,5,5,5,4,4,0,4,4,4,3,3,3,3,1,3,3,94,0.94,""]
["Answers","30 d","defined as wet weight","NOEC","NOEC","","10 replicates","70% survival of controls (in supplementary material)","<24h old","S. Santiam River water","static-renewal, renewed 3 times per week","Measured several times","","","","",7.1,16,24,"0.94 doc","measured but not reported","25 ± 2",""]
["Category","Freshwater/metal/non- plant","Paper and data unique identifier(eg. 1-1,10-150)","162-9"]
["Scores",10,10,5,5,5,5,5,5,5,4,4,0,4,4,4,3,3,3,3,1,3,3,94,0.94,""]
["Answers","30 d","defined as wet weight","EC",10,"","10 replicates","70% survival of controls (in supplementary material)","<24h old","Zollner Creek water","static-renewal, renewed 3 times per week","Measured several times","","","","",7.3,136,28,"7.1 doc","measured but not reported","25 ± 2",""]
["Category","Freshwater/metal/non- plant","Paper and data unique identifier(eg. 1-1,10-150)","162-10"]
["Scores",10,10,5,5,5,5,5,5,5,4,4,0,4,4,4,3,3,3,3,1,3,3,94,0.94,""]
["Answers","30 d","defined as wet weight","NOEC","NOEC","","10 replicates","70% survival of controls (in supplementary material)","<24h old","Zollner Creek water","static-renewal, renewed 3 times per week","Measured several times","","","","",7.3,136,28,"7.1 doc","measured but not reported","25 ± 2",""]
["Category","Freshwater/metal/non- plant","Paper and data unique identifier(eg. 1-1,10-150)","162-11"]
["Scores",10,10,5,5,5,5,5,5,5,4,4,0,4,4,4,3,3,3,3,1,3,3,94,0.94,""]
["Answers","30 d","defined as wet weight","EC",20,"","10 replciates","70% survival of controls (in supplementary material)","<24h old","Calapooia river water","static-renewal, ","Measured several times","","","","",8,212,200,0.69,"measured but not reported","25 ± 2",""]
["Category","Freshwater/metal/non- plant","Paper and data unique identifier(eg. 1-1,10-150)","162-12"]
["Scores",10,10,5,5,5,5,5,5,5,4,4,0,4,4,4,3,3,3,3,1,3,3,94,0.94,""]
["Answers","30 d","defined as wet weight","EC",20,"","10 replciates","70% survival of controls (in supplementary material)","<24h old","S. Platte River water","static-renewal, ","Measured several times","","","","",7.8,256,160,7.1,"measured but not reported","25 ± 2",""]
["Category","Freshwater/metal/non- plant","Paper and data unique identifier(eg. 1-1,10-150)","162-13"]
["Scores",10,10,5,5,5,5,5,5,5,4,4,0,4,4,4,3,3,3,3,1,3,3,94,0.94,""]
["Answers","30 d","defined as wet weight","EC",20,"","10 replciates","70% survival of controls (in supplementary material)","<24h old","S. Platte River water (pH amended)","static-renewal, ","Measured several times","","","","",6.9,256,16,7,"measured but not reported","25 ± 2",""]
["Category","Freshwater/metal/non- plant","Paper and data unique identifier(eg. 1-1,10-150)","162-14"]
["Scores",10,10,5,5,5,5,5,5,5,4,4,0,4,4,4,3,3,3,3,1,3,3,94,0.94,""]
["Answers","30 d","defined as wet weight","EC",20,"","10 replciates","70% survival of controls (in supplementary material)","<24h old","S. Santiam River water","static-renewal, ","Measured several times","","","","",7.1,16,24,0.94,"measured but not reported","25 ± 2",""]
["Category","Freshwater/metal/non- plant","Paper and data unique identifier(eg. 1-1,10-150)","162-15"]
["Scores",10,10,5,5,5,5,5,5,5,4,4,0,4,4,4,3,3,3,3,1,3,3,94,0.94,""]
["Answers","30 d","defined as wet weight","EC",20,"","10 replciates","70% survival of controls (in supplementary material)","<24h old","Zollner Creek water","static-renewal, ","Measured several times","","","","",7.3,136,28,7.1,"measured but not reported","25 ± 2",""]
["Category","Freshwater/metal/non- plant","Paper and data unique identifier(eg. 1-1,10-150)","162-16"]
["Scores",10,10,5,5,5,5,5,5,5,4,4,0,4,4,4,3,3,3,3,1,3,3,94,0.94,""]
["Answers","10 d","defined as AFDW","EC",10,"","4 replciates","70% survival of controls (in supplementary material)","second instar, but observed 48h prior to use, so maybe beyond second instar?","Calapooia river water","static-renewal, ","Measured several times","","","","",8,212,200,0.69,"measured but not reported","25 ± 2",""]
["Category","Freshwater/metal/non- plant","Paper and data unique identifier(eg. 1-1,10-150)","162-17"]
["Scores",10,10,5,5,5,5,5,5,5,4,4,0,4,4,4,3,3,3,3,1,3,3,94,0.94,""]
["Answers","10 d","defined as AFDW","","","","4 replciates","70% survival of controls (in supplementary material)","second instar, but observed 48h prior to use, so maybe beyond second instar?","Calapooia river water","static-renewal, ","Measured several times","","","","",8,212,200,0.69,"measured but not reported","25 ± 2",""]
["Category","Freshwater/metal/non- plant","Paper and data unique identifier(eg. 1-1,10-150)","162-18"]
["Scores",10,10,5,5,5,5,5,5,5,4,4,0,4,4,4,3,3,3,3,1,3,3,94,0.94,""]
["Answers","10 d","defined as AFDW","","","","4 replciates","70% survival of controls (in supplementary material)","second instar, but observed 48h prior to use, so maybe beyond second instar?","Calapooia river water","static-renewal, ","Measured several times","","","","",8,212,200,0.69,"measured but not reported","25 ± 2",""]
["Category","Freshwater/metal/non- plant","Paper and data unique identifier(eg. 1-1,10-150)","162-19"]
["Scores",10,10,5,5,5,5,5,5,5,4,4,0,4,4,4,3,3,3,3,1,3,3,94,0.94,""]
["Answers","10 d","defined as AFDW","","","","4 replciates","70% survival of controls (in supplementary material)","second instar, but observed 48h prior to use, so maybe beyond second instar?","S. Platte River water","static-renewal, ","Measured several times","","","","",7.8,256,160,7.1,"measured but not reported","25 ± 2",""]
["Category","Freshwater/metal/non- plant","Paper and data unique identifier(eg. 1-1,10-150)","162-20"]
["Scores",10,10,5,5,5,5,5,5,5,4,4,0,4,4,4,3,3,3,3,1,3,3,94,0.94,""]
["Answers","10 d","defined as AFDW","","","","4 replciates","70% survival of controls (in supplementary material)","second instar, but observed 48h prior to use, so maybe beyond second instar?","S. Platte River water","static-renewal, ","Measured several times","","","","",7.8,256,160,7.1,"measured but not reported","25 ± 2",""]
["Category","Freshwater/metal/non- plant","Paper and data unique identifier(eg. 1-1,10-150)","162-21"]
["Scores",10,10,5,5,5,5,5,5,5,4,4,0,4,4,4,3,3,3,3,1,3,3,94,0.94,""]
["Answers","10 d","defined as AFDW","","","","4 replciates","70% survival of controls (in supplementary material)","second instar, but observed 48h prior to use, so maybe beyond second instar?","S. Platte River water","static-renewal, ","Measured several times","","","","",7.8,256,160,7.1,"measured but not reported","25 ± 2",""]
["Category","Freshwater/metal/non- plant","Paper and data unique identifier(eg. 1-1,10-150)","162-22"]
["Scores",10,10,5,5,5,5,5,5,5,4,4,0,4,4,4,3,3,3,3,1,3,3,94,0.94,""]
["Answers","10 d","defined as AFDW","","","","4 replciates","70% survival of controls (in supplementary material)","second instar, but observed 48h prior to use, so maybe beyond second instar?","S. Platte River water, pH amended","static-renewal, ","Measured several times","","","","",6.9,256,16,7,"measured but not reported","25 ± 2",""]
["Category","Freshwater/metal/non- plant","Paper and data unique identifier(eg. 1-1,10-150)","162-23"]
["Scores",10,10,5,5,5,5,5,5,5,4,4,0,4,4,4,3,3,3,3,1,3,3,94,0.94,""]
["Answers","10 d","defined as AFDW","","","","4 replciates","70% survival of controls (in supplementary material)","second instar, but observed 48h prior to use, so maybe beyond second instar?","S. Platte River water, pH amended","static-renewal, ","Measured several times","","","","",6.9,256,16,7,"measured but not reported","25 ± 2",""]
["Category","Freshwater/metal/non- plant","Paper and data unique identifier(eg. 1-1,10-150)","162-24"]
["Scores",10,10,5,5,5,5,5,5,5,4,4,0,4,4,4,3,3,3,3,1,3,3,94,0.94,""]
["Answers","10 d","defined as AFDW","","","","4 replciates","70% survival of controls (in supplementary material)","second instar, but observed 48h prior to use, so maybe beyond second instar?","S. Platte River water, pH amended","static-renewal, ","Measured several times","","","","",6.9,256,16,7,"measured but not reported","25 ± 2",""]
["Category","Freshwater/metal/non- plant","Paper and data unique identifier(eg. 1-1,10-150)","162-25"]
["Scores",10,10,5,5,5,5,5,5,5,4,4,0,4,4,4,3,3,3,3,1,3,3,94,0.94,""]
["Answers","10 d","defined as AFDW","","","","4 replciates","70% survival of controls (in supplementary material)","second instar, but observed 48h prior to use, so maybe beyond second instar?","S. Santiam River water","static-renewal, ","Measured several times","","","","",7.1,16,24,0.94,"measured but not reported","25 ± 2",""]
["Category","Freshwater/metal/non- plant","Paper and data unique identifier(eg. 1-1,10-150)","162-26"]
["Scores",10,10,5,5,5,5,5,5,5,4,4,0,4,4,4,3,3,3,3,1,3,3,94,0.94,""]
["Answers","10 d","defined as AFDW","","","","4 replciates","70% survival of controls (in supplementary material)","second instar, but observed 48h prior to use, so maybe beyond second instar?","S. Santiam River water","static-renewal, ","Measured several times","","","","",7.1,16,24,0.94,"measured but not reported","25 ± 2",""]
["Category","Freshwater/metal/non- plant","Paper and data unique identifier(eg. 1-1,10-150)","162-27"]
["Scores",10,10,5,5,5,5,5,5,5,4,4,0,4,4,4,3,3,3,3,1,3,3,94,0.94,""]
["Answers","10 d","defined as AFDW","","","","4 replciates","70% survival of controls (in supplementary material)","second instar, but observed 48h prior to use, so maybe beyond second instar?","S. Santiam River water","static-renewal, ","Measured several times","","","","",7.1,16,24,0.94,"measured but not reported","25 ± 2",""]
["Category","Freshwater/metal/non- plant","Paper and data unique identifier(eg. 1-1,10-150)","162-28"]
["Scores",10,10,5,5,5,5,5,5,5,4,4,0,4,4,4,3,3,3,3,1,3,3,94,0.94,""]
["Answers","10 d","defined as AFDW","","","","4 replciates","70% survival of controls (in supplementary material)","second instar, but observed 48h prior to use, so maybe beyond second instar?","Zollner Creek water","static-renewal, ","Measured several times","","","","",7.3,136,28,7.1,"measured but not reported","25 ± 2",""]
["Category","Freshwater/metal/non- plant","Paper and data unique identifier(eg. 1-1,10-150)","162-29"]
["Scores",10,10,5,5,5,5,5,5,5,4,4,0,4,4,4,3,3,3,3,1,3,3,94,0.94,""]
["Answers","10 d","defined as AFDW","","","","4 replciates","70% survival of controls (in supplementary material)","second instar, but observed 48h prior to use, so maybe beyond second instar?","Zollner Creek water","static-renewal, ","Measured several times","","","","",7.3,136,28,7.1,"measured but not reported","25 ± 2",""]
["Category","Freshwater/metal/non- plant","Paper and data unique identifier(eg. 1-1,10-150)","162-30"]
["Scores",10,10,5,5,5,5,5,5,5,4,4,0,4,4,4,3,3,3,3,1,3,3,94,0.94,""]
["Answers","10 d","defined as AFDW","","","","4 replciates","70% survival of controls (in supplementary material)","second instar, but observed 48h prior to use, so maybe beyond second instar?","Zollner Creek water","static-renewal, ","Measured several times","","","","",7.3,136,28,7.1,"measured but not reported","25 ± 2",""]
["Category","Freshwater/metal/non- plant","Paper and data unique identifier(eg. 1-1,10-150)","162-31"]
["Scores",10,5,5,5,5,5,5,0,5,4,2,0,4,4,4,3,3,3,3,1,3,3,82,0.82,""]
["Answers","48 h","population growth rate","","","","5 replciates","18 organisms at completion in controls","","Calapooia River water","static","Measured several times","","","","",8,212,200,0.69,"measured but not reported","25 ± 2",""]
["Category","Freshwater/metal/non- plant","Paper and data unique identifier(eg. 1-1,10-150)","162-32"]
["Scores",10,5,5,5,5,5,5,0,5,4,2,0,4,4,4,3,3,3,3,1,3,3,82,0.82,""]
["Answers","48 h","population growth rate","","","","5 replciates","18 organisms at completion in controls","","Calapooia River water","static","Measured several times","","","","",8,212,200,0.69,"measured but not reported","25 ± 2",""]
["Category","Freshwater/metal/non- plant","Paper and data unique identifier(eg. 1-1,10-150)","162-33"]
["Scores",10,5,5,5,5,5,5,0,5,4,2,0,4,4,4,3,3,3,3,1,3,3,82,0.82,""]
["Answers","48 h","population growth rate","","","","5 replciates","18 organisms at completion in controls","","Calapooia River water","static","Measured several times","","","","",8,212,200,0.69,"measured but not reported","25 ± 2",""]
["Category","Freshwater/metal/non- plant","Paper and data unique identifier(eg. 1-1,10-150)","162-34"]
["Scores",10,5,5,5,5,5,5,0,5,4,2,0,4,4,4,3,3,3,3,1,3,3,82,0.82,""]
["Answers","48 h","population growth rate","","","","5 replciates","18 organisms at completion in controls","","S. Platte River water","static","Measured several times","","","","",7.8,256,160,7.1,"measured but not reported","25 ± 2",""]
["Category","Freshwater/metal/non- plant","Paper and data unique identifier(eg. 1-1,10-150)","162-35"]
["Scores",10,5,5,5,5,5,5,0,5,4,2,0,4,4,4,3,3,3,3,1,3,3,82,0.82,""]
["Answers","48 h","population growth rate","","","","5 replciates","18 organisms at completion in controls","","S. Platte River water","static","Measured several times","","","","",7.8,256,160,7.1,"measured but not reported","25 ± 2",""]
["Category","Freshwater/metal/non- plant","Paper and data unique identifier(eg. 1-1,10-150)","162-36"]
["Scores",10,5,5,5,5,5,5,0,5,4,2,0,4,4,4,3,3,3,3,1,3,3,82,0.82,""]
["Answers","48 h","population growth rate","","","","5 replciates","18 organisms at completion in controls","","S. Platte River water","static","Measured several times","","","","",7.8,256,160,7.1,"measured but not reported","25 ± 2",""]
["Category","Freshwater/metal/non- plant","Paper and data unique identifier(eg. 1-1,10-150)","162-37"]
["Scores",10,5,5,5,5,5,5,0,5,4,2,0,4,4,4,3,3,3,3,1,3,3,82,0.82,""]
["Answers","48 h","population growth rate","","","","5 replciates","18 organisms at completion in controls","","S. Platte River water pH amended","static","Measured several times","","","","",6.9,256,16,7,"measured but not reported","25 ± 2",""]
["Category","Freshwater/metal/non- plant","Paper and data unique identifier(eg. 1-1,10-150)","162-38"]
["Scores",10,5,5,5,5,5,5,0,5,4,2,0,4,4,4,3,3,3,3,1,3,3,82,0.82,""]
["Answers","48 h","population growth rate","","","","5 replciates","18 organisms at completion in controls","","S. Platte River water pH amended","static","Measured several times","","","","",6.9,256,16,7,"measured but not reported","25 ± 2",""]
["Category","Freshwater/metal/non- plant","Paper and data unique identifier(eg. 1-1,10-150)","162-39"]
["Scores",10,5,5,5,5,5,5,0,5,4,2,0,4,4,4,3,3,3,3,1,3,3,82,0.82,""]
["Answers","48 h","population growth rate","","","","5 replciates","18 organisms at completion in controls","","S. Platte River water pH amended","static","Measured several times","","","","",6.9,256,16,7,"measured but not reported","25 ± 2",""]
["Category","Freshwater/metal/non- plant","Paper and data unique identifier(eg. 1-1,10-150)","162-40"]
["Scores",10,5,5,5,5,5,5,0,5,4,2,0,4,4,4,3,3,3,3,1,3,3,82,0.82,""]
["Answers","48 h","population growth rate","","","","5 replciates","18 organisms at completion in controls","","S. Santiam R water","static","Measured several times","","","","",7.1,16,24,0.94,"measured but not reported","25 ± 2",""]
["Category","Freshwater/metal/non- plant","Paper and data unique identifier(eg. 1-1,10-150)","162-41"]
["Scores",10,5,5,5,5,5,5,0,5,4,2,0,4,4,4,3,3,3,3,1,3,3,82,0.82,""]
["Answers","48 h","population growth rate","","","","5 replciates","18 organisms at completion in controls","","S. Santiam R water","static","Measured several times","","","","",7.1,16,24,0.94,"measured but not reported","25 ± 2",""]
["Category","Freshwater/metal/non- plant","Paper and data unique identifier(eg. 1-1,10-150)","162-42"]
["Scores",10,5,5,5,5,5,5,0,5,4,2,0,4,4,4,3,3,3,3,1,3,3,82,0.82,""]
["Answers","48 h","population growth rate","","","","5 replciates","18 organisms at completion in controls","","S. Santiam R water","static","Measured several times","","","","",7.1,16,24,0.94,"measured but not reported","25 ± 2",""]
["Category","Freshwater/metal/non- plant","Paper and data unique identifier(eg. 1-1,10-150)","162-43"]
["Scores",10,5,5,5,5,5,5,0,5,4,2,0,4,4,4,3,3,3,3,1,3,3,82,0.82,""]
["Answers","48 h","population growth rate","","","","5 replciates","18 organisms at completion in controls","","Zollner R water","static","Measured several times","","","","",7.3,136,28,7.1,"measured but not reported","25 ± 2",""]
["Category","Freshwater/metal/non- plant","Paper and data unique identifier(eg. 1-1,10-150)","162-44"]
["Scores",10,5,5,5,5,5,5,0,5,4,2,0,4,4,4,3,3,3,3,1,3,3,82,0.82,""]
["Answers","48 h","population growth rate","","","","5 replciates","18 organisms at completion in controls","","Zollner R water","static","Measured several times","","","","",7.3,136,28,7.1,"measured but not reported","25 ± 2",""]
["Category","Freshwater/metal/non- plant","Paper and data unique identifier(eg. 1-1,10-150)","162-45"]
["Scores",10,5,5,5,5,5,5,0,5,4,2,0,4,4,4,3,3,3,3,1,3,3,82,0.82,""]
["Answers","48 h","population growth rate","","","","5 replciates","18 organisms at completion in controls","","Zollner R water","static","Measured several times","","","","",7.3,136,28,7.1,"measured but not reported","25 ± 2",""]
["Category","Freshwater/metal/non- plant","Paper and data unique identifier(eg. 1-1,10-150)","163-1"]
["Scores",10,10,0,5,5,5,0,5,5,4,2,0,4,4,4,1,0,0,0,0,1,3,68,0.68,""]
["Answers","15-17d through to full life-span","no heartbeat = death","not stated, but can determine from Dunnet's test results","0.05% sig level for NOEC","","duplicate","","<24h old neonates","1-week aged tap water","semi-static daily water changes","","","","","","6.5-7.0","","","","","25 ± 2","reagent grade"]
["Category","Freshwater/metal/non- plant","Paper and data unique identifier(eg. 1-1,10-150)","164-1"]
["Scores",10,10,5,5,5,0,2,5,5,4,0,0,4,4,4,0,0,0,0,0,1,0,64,0.64,"The highest possible grade for this datum is acceptable."]
["Answers","9 d","larval development to copepodite stage","EC",50,"","says 30 nauplii per control and treatment, but not how it was spread among replicates.","Control survival and larval development reported.","<12h old","moderately hard APHA synthetic water","semi-static - daily renewal.","","","stated","","","","","","","",25,""]
["Category","Freshwater/metal/non- plant","Paper and data unique identifier(eg. 1-1,10-150)","165-11"]
["Scores",10,10,5,5,5,5,2,5,5,4,2,0,4,4,4,3,3,0,3,0,3,3,85,0.85,""]
["Answers","96 h","population growth","EC",10,"","","ESA SOP 125 (ESA 2013). The procedure is based on the methodology described by Riethmuller et al. (2003).","asexually reproducing (budding) hydroids","Collected water sample (Tea tree)","semi-static - daily renewal","Not mentioned in report if measured more than once","Probably yes - but not stated in report","","","",7.3,25,"",10,"","27 ± 2",""]
["Category","Freshwater/metal/non- plant","Paper and data unique identifier(eg. 1-1,10-150)","165-12"]
["Scores",10,10,5,5,5,5,2,5,5,4,2,0,4,4,4,3,3,0,3,0,3,3,85,0.85,""]
["Answers","96 h","population growth","EC",10,"","","ESA SOP 125 (ESA 2013). The procedure is based on the methodology described by Riethmuller et al. (2003).","asexually reproducing (budding) hydroids","Collected water sample (Woronora)","semi-static - daily renewal","Not mentioned in report if measured more than once","Probably yes - but not stated in report","","","",7.2,21,"",4,"","27 ± 2",""]
["Category","Freshwater/metal/non- plant","Paper and data unique identifier(eg. 1-1,10-150)","165-13"]
["Scores",10,10,5,5,5,5,2,5,5,4,2,0,4,4,4,3,3,0,3,0,3,3,85,0.85,""]
["Answers","96 h","population growth","EC",10,"","","ESA SOP 125 (ESA 2013). The procedure is based on the methodology described by Riethmuller et al. (2003).","asexually reproducing (budding) hydroids","Collected water sample (Peechelba)","semi-static - daily renewal","Not mentioned in report if measured more than once","Probably yes - but not stated in report","","","",8.1999999999999993,20,"",0.5,"","27 ± 2",""]
["Category","Freshwater/metal/non- plant","Paper and data unique identifier(eg. 1-1,10-150)","165-14"]
["Scores",10,10,5,5,5,5,2,5,5,4,2,0,4,4,4,3,3,0,3,0,3,3,85,0.85,""]
["Answers","96 h","population growth","EC",10,"","","ESA SOP 125 (ESA 2013). The procedure is based on the methodology described by Riethmuller et al. (2003).","asexually reproducing (budding) hydroids","Collected water sample (Wellington)","semi-static - daily renewal","Not mentioned in report if measured more than once","Probably yes - but not stated in report","","","",7.9,58,"",5,"","27 ± 2",""]
["Category","Freshwater/metal/non- plant","Paper and data unique identifier(eg. 1-1,10-150)","165-15"]
["Scores",10,10,5,5,5,5,2,5,5,4,2,0,4,4,4,3,3,0,3,0,3,3,85,0.85,""]
["Answers","96 h","population growth","EC",10,"","","ESA SOP 125 (ESA 2013). The procedure is based on the methodology described by Riethmuller et al. (2003).","asexually reproducing (budding) hydroids","Collected water sample (Magela Ck)","semi-static - daily renewal","Not mentioned in report if measured more than once","Probably yes - but not stated in report","","","",6.4,1.7,"",3,"","27 ± 2",""]
["Category","Freshwater/metal/non- plant","Paper and data unique identifier(eg. 1-1,10-150)","165-16"]
["Scores",10,10,5,5,5,5,2,5,5,4,2,0,4,4,4,3,3,0,3,0,3,3,85,0.85,""]
["Answers","7-8 d","reproduction (number of young)","EC",10,"","","ESA Standard Operating Procedure 102. This procedure is based on methods described by the USEPA (2002) and adapted for use with the locally collected C. dubia (referred to as the Sydney Clone) by Bailey et al. (2000).","<24h old neonates","","semi-static - daily renewal","Not mentioned in report if measured more than once","Probably yes - but not stated in report","","","",7.3,25,"",10,"","25 ± 2",""]
["Category","Freshwater/metal/non- plant","Paper and data unique identifier(eg. 1-1,10-150)","165-17"]
["Scores",10,10,5,5,5,5,2,5,5,4,2,0,4,4,4,3,3,0,3,0,3,3,85,0.85,""]
["Answers","7-8 d","reproduction (number of young)","EC",10,"","","ESA Standard Operating Procedure 102. This procedure is based on methods described by the USEPA (2002) and adapted for use with the locally collected C. dubia (referred to as the Sydney Clone) by Bailey et al. (2000).","<24h old neonates","","semi-static - daily renewal","","Probably yes - but not stated in report","","","",7.2,21,"",4,"","25 ± 2",""]
["Category","Freshwater/metal/non- plant","Paper and data unique identifier(eg. 1-1,10-150)","165-18"]
["Scores",10,10,5,5,5,5,2,5,5,4,2,0,4,4,4,3,3,0,3,0,3,3,85,0.85,""]
["Answers","7-8 d","reproduction (number of young)","EC",10,"","","ESA Standard Operating Procedure 102. This procedure is based on methods described by the USEPA (2002) and adapted for use with the locally collected C. dubia (referred to as the Sydney Clone) by Bailey et al. (2000).","<24h old neonates","","semi-static - daily renewal","","Probably yes - but not stated in report","","","",8.1999999999999993,20,"",0.5,"","25 ± 2",""]
["Category","Freshwater/metal/non- plant","Paper and data unique identifier(eg. 1-1,10-150)","165-19"]
["Scores",10,10,5,5,5,5,2,5,5,4,2,0,4,4,4,3,3,0,3,0,3,3,85,0.85,""]
["Answers","7-8 d","reproduction (number of young)","EC",10,"","","ESA Standard Operating Procedure 102. This procedure is based on methods described by the USEPA (2002) and adapted for use with the locally collected C. dubia (referred to as the Sydney Clone) by Bailey et al. (2000).","<24h old neonates","","semi-static - daily renewal","","Probably yes - but not stated in report","","","",7.9,58,"",5,"","25 ± 2",""]
["Category","Freshwater/metal/non- plant","Paper and data unique identifier(eg. 1-1,10-150)","166-1"]
["Scores",10,5,5,5,5,5,2,5,5,0,4,0,4,4,4,1,1,0,0,0,1,3,69,0.69,""]
["Answers","10 d","survival","LC",50,"","duplicate","Control survival recorded as >80%","1d old larvae","spring water","assume static","measured several times","","","","",7.4,128,"","","","23-25","reagent grade"]
["Category","Freshwater/metal/non- plant","Paper and data unique identifier(eg. 1-1,10-150)","167-1"]
["Scores",10,10,5,5,5,5,2,5,5,4,4,0,0,4,4,3,3,3,0,0,1,3,81,0.81,""]
["Answers","21 d","reproduction, total number of young","EC",10,"","","OECD","<24h old","synthetic water Ca 0.25mM","renewed every other day","","","not stated. Toxicity values just reported","","",6.85,41.7,2.96,"","measured but not stated","measured but not stated.",""]
["Category","Freshwater/metal/non- plant","Paper and data unique identifier(eg. 1-1,10-150)","167-2"]
["Scores",10,10,5,5,5,5,2,5,5,4,4,0,0,4,4,3,3,3,0,0,1,3,81,0.81,""]
["Answers","21 d","reproduction, total number of young","EC",10,"","","OECD","<24h old","synthetic water Ca 0.5mM","renewed every other day","","","not stated. Toxicity values just reported","","",6.81,59.7,2.89,"","measured but not stated","measured but not stated.",""]
["Category","Freshwater/metal/non- plant","Paper and data unique identifier(eg. 1-1,10-150)","167-3"]
["Scores",10,10,5,5,5,5,2,5,5,4,4,0,0,4,4,3,3,3,0,0,1,3,81,0.81,""]
["Answers","21 d","reproduction, total number of young","EC",10,"","","OECD","<24h old","synthetic water Ca 1.0mM","renewed every other day","","","not stated. Toxicity values just reported","","",6.81,97.1,2.89,"","measured but not stated","measured but not stated.",""]
["Category","Freshwater/metal/non- plant","Paper and data unique identifier(eg. 1-1,10-150)","167-4"]
["Scores",10,10,5,5,5,5,2,5,5,4,4,0,0,4,4,3,3,3,0,0,1,3,81,0.81,""]
["Answers","21 d","reproduction, total number of young","EC",10,"","","OECD","<24h old","synthetic water Ca 1.5mM","renewed every other day","","","not stated. Toxicity values just reported","","",6.79,132,2.86,"","measured but not stated","measured but not stated.",""]
["Category","Freshwater/metal/non- plant","Paper and data unique identifier(eg. 1-1,10-150)","167-5"]
["Scores",10,10,5,5,5,5,2,5,5,4,4,0,0,4,4,3,3,3,0,0,1,3,81,0.81,""]
["Answers","21 d","reproduction, total number of young","EC",10,"","","OECD","<24h old","synthetic water Ca 2.0mM","renewed every other day","","","not stated. Toxicity values just reported","","",6.79,169,2.86,"","measured but not stated","measured but not stated.",""]
["Category","Freshwater/metal/non- plant","Paper and data unique identifier(eg. 1-1,10-150)","167-6"]
["Scores",10,10,5,5,5,5,2,5,5,4,4,0,0,4,4,3,3,3,0,0,1,3,81,0.81,""]
["Answers","21 d","reproduction, total number of young","EC",10,"","","OECD","<24h old","synthetic water Ca 3.0mM","renewed every other day","","","not stated. Toxicity values just reported","","",6.8,243,2.88,"","measured but not stated","measured but not stated.",""]
["Category","Freshwater/metal/non- plant","Paper and data unique identifier(eg. 1-1,10-150)","167-7"]
["Scores",10,10,5,5,5,5,2,5,5,4,4,0,0,4,4,3,3,3,0,0,1,3,81,0.81,""]
["Answers","21 d","reproduction, total number of young","EC",10,"","","OECD","<24h old","synthetic water Mg 0.25mM","renewed every other day","","","not stated. Toxicity values just reported","","",6.79,42.8,2.86,"","measured but not stated","measured but not stated.",""]
["Category","Freshwater/metal/non- plant","Paper and data unique identifier(eg. 1-1,10-150)","167-8"]
["Scores",10,10,5,5,5,5,2,5,5,4,4,0,0,4,4,3,3,3,0,0,1,3,81,0.81,""]
["Answers","21 d","reproduction, total number of young","EC",10,"","","OECD","<24h old","synthetic water Mg 0.5mM","renewed every other day","","","not stated. Toxicity values just reported","","",6.81,68.2,2.89,"","measured but not stated","measured but not stated.",""]
["Category","Freshwater/metal/non- plant","Paper and data unique identifier(eg. 1-1,10-150)","167-9"]
["Scores",10,10,5,5,5,5,2,5,5,4,4,0,0,4,4,3,3,3,0,0,1,3,81,0.81,""]
["Answers","21 d","reproduction, total number of young","EC",10,"","","OECD","<24h old","synthetic water Mg 1.0mM","renewed every other day","","","not stated. Toxicity values just reported","","",6.82,117,2.91,"","measured but not stated","measured but not stated.",""]
["Category","Freshwater/metal/non- plant","Paper and data unique identifier(eg. 1-1,10-150)","167-10"]
["Scores",10,10,5,5,5,5,2,5,5,4,4,0,0,4,4,3,3,3,0,0,1,3,81,0.81,""]
["Answers","21 d","reproduction, total number of young","EC",10,"","","OECD","<24h old","synthetic water Mg 1.5mM","renewed every other day","","","not stated. Toxicity values just reported","","",6.8,165,2.88,"","measured but not stated","measured but not stated.",""]
["Category","Freshwater/metal/non- plant","Paper and data unique identifier(eg. 1-1,10-150)","167-11"]
["Scores",10,10,5,5,5,5,2,5,5,4,4,0,0,4,4,3,3,3,0,0,1,3,81,0.81,""]
["Answers","21 d","reproduction, total number of young","EC",10,"","","OECD","<24h old","synthetic water Mg 2.0mM","renewed every other day","","","not stated. Toxicity values just reported","","",6.8,213,2.88,"","measured but not stated","measured but not stated.",""]
["Category","Freshwater/metal/non- plant","Paper and data unique identifier(eg. 1-1,10-150)","167-12"]
["Scores",10,10,5,5,5,5,2,5,5,4,4,0,0,4,4,3,3,3,0,0,1,3,81,0.81,""]
["Answers","21 d","reproduction, total number of young","EC",10,"","","OECD","<24h old","synthetic water Mg 3.0mM","renewed every other day","","","not stated. Toxicity values just reported","","",6.81,315,2.89,"","measured but not stated","measured but not stated.",""]
["Category","Freshwater/metal/non- plant","Paper and data unique identifier(eg. 1-1,10-150)","167-13"]
["Scores",10,10,5,5,5,5,2,5,5,4,4,0,0,4,4,3,3,3,0,0,1,3,81,0.81,""]
["Answers","21 d","reproduction, total number of young","EC",10,"","","OECD","<24h old","synthetic water pH 5.8","renewed every other day","","","not stated. Toxicity values just reported","","",5.87,53.4,0.65200000000000002,"","measured but not stated","measured but not stated.",""]
["Category","Freshwater/metal/non- plant","Paper and data unique identifier(eg. 1-1,10-150)","167-14"]
["Scores",10,10,5,5,5,5,2,5,5,4,4,0,0,4,4,3,3,3,0,0,1,3,81,0.81,""]
["Answers","21 d","reproduction, total number of young","EC",10,"","","OECD","<24h old","synthetic water pH 6.4","renewed every other day","","","not stated. Toxicity values just reported","","",6.4,53.4,3.25,"","measured but not stated","measured but not stated.",""]
["Category","Freshwater/metal/non- plant","Paper and data unique identifier(eg. 1-1,10-150)","167-15"]
["Scores",10,10,5,5,5,5,2,5,5,4,4,0,0,4,4,3,3,3,0,0,1,3,81,0.81,""]
["Answers","21 d","reproduction, total number of young","EC",10,"","","OECD","<24h old","synthetic water pH 7.0","renewed every other day","","","not stated. Toxicity values just reported","","",6.97,53.5,11,"","measured but not stated","measured but not stated.",""]
["Category","Freshwater/metal/non- plant","Paper and data unique identifier(eg. 1-1,10-150)","167-16"]
["Scores",10,10,5,5,5,5,2,5,5,4,4,0,0,4,4,3,3,3,0,0,1,3,81,0.81,""]
["Answers","21 d","reproduction, total number of young","EC",10,"","","OECD","<24h old","synthetic water pH 7.6","renewed every other day","","","not stated. Toxicity values just reported","","",7.35,53.9,21.9,"","measured but not stated","measured but not stated.",""]
["Category","Freshwater/metal/non- plant","Paper and data unique identifier(eg. 1-1,10-150)","167-17"]
["Scores",10,10,5,5,5,5,2,5,5,4,4,0,0,4,4,3,3,3,0,0,1,3,81,0.81,""]
["Answers","21 d","reproduction, total number of young","EC",10,"","","OECD","<24h old","synthetic water pH 7.6*","renewed every other day","","","not stated. Toxicity values just reported","","",7.62,54,36.5,"","measured but not stated","measured but not stated.",""]
["Category","Freshwater/metal/non- plant","Paper and data unique identifier(eg. 1-1,10-150)","167-18"]
["Scores",10,10,5,5,5,5,2,5,5,4,4,0,0,4,4,3,3,3,0,0,1,3,81,0.81,""]
["Answers","21 d","reproduction, total number of young","EC",10,"","","OECD","<24h old","synthetic water pH 8.2*","renewed every other day","","","not stated. Toxicity values just reported","","",8.2200000000000006,52.4,174,"","measured but not stated","measured but not stated.",""]
["Category","Freshwater/metal/non- plant","Paper and data unique identifier(eg. 1-1,10-150)","167-19"]
["Scores",10,10,5,5,5,5,2,5,5,4,4,0,0,4,4,3,3,3,3,0,1,3,84,0.84,""]
["Answers","21 d","reproduction, total number of young","EC",10,"","","OECD","<24h old","Filtered (0.45um) Ankeveen water","renewed every other day","","","not stated. Toxicity values just reported","","",6.79,123,12.3,17.3,"measured but not stated","measured but not stated.","4.0µg/L in river water"]
["Category","Freshwater/metal/non- plant","Paper and data unique identifier(eg. 1-1,10-150)","167-20"]
["Scores",10,10,5,5,5,5,2,5,5,4,4,0,0,4,4,3,3,3,3,0,1,3,84,0.84,""]
["Answers","21 d","reproduction, total number of young","EC",10,"","","OECD","<24h old","Filtered (0.45um) Bihain water","renewed every other day","","","not stated. Toxicity values just reported","","",6.15,13.6,8.36,5.37,"measured but not stated","measured but not stated.","2.5µg/L in river water"]
["Category","Freshwater/metal/non- plant","Paper and data unique identifier(eg. 1-1,10-150)","167-21"]
["Scores",10,10,5,5,5,5,2,5,5,4,4,0,0,4,4,3,3,3,3,0,1,3,84,0.84,""]
["Answers","21 d","reproduction, total number of young","EC",10,"","","OECD","<24h old","Filtered (0.45um) Brisy water","renewed every other day","","","not stated. Toxicity values just reported","","",7.09,26.4,12.8,2.5299999999999998,"measured but not stated","measured but not stated.","2.0 µg/L in river water"]
["Category","Freshwater/metal/non- plant","Paper and data unique identifier(eg. 1-1,10-150)","167-22"]
["Scores",10,10,5,5,5,5,2,5,5,4,4,0,0,4,4,3,3,3,3,0,1,3,84,0.84,""]
["Answers","21 d","reproduction, total number of young","EC",10,"","","OECD","<24h old","Filtered (0.45um) Markermeer water","renewed every other day","","","not stated. Toxicity values just reported","","",8.09,189,127,7.49,"measured but not stated","measured but not stated.","1.0 µg/L Ni in river water"]
["Category","Freshwater/metal/non- plant","Paper and data unique identifier(eg. 1-1,10-150)","167-23"]
["Scores",10,10,5,5,5,5,2,5,5,4,4,0,0,4,4,3,3,3,3,0,1,3,84,0.84,""]
["Answers","21 d","reproduction, total number of young","EC",10,"","","OECD","<24h old","Filtered (0.45um) Regge water","renewed every other day","","","not stated. Toxicity values just reported","","",7.71,183,161,9.8699999999999992,"measured but not stated","measured but not stated.","4 µg Ni/L in river water"]
["Category","Freshwater/metal/non- plant","Paper and data unique identifier(eg. 1-1,10-150)","167-24"]
["Scores",10,10,5,5,5,5,2,5,5,4,4,0,0,4,4,3,3,3,3,0,1,3,84,0.84,""]
["Answers","21 d","reproduction, total number of young","EC",10,"","","OECD","<24h old","Filtered (0.45um) Voyon water","renewed every other day","","","not stated. Toxicity values just reported","","",8.02,122,122,4.17,"measured but not stated","measured but not stated.","6 µg Ni/L in river water"]
["Category","Freshwater/metal/non- plant","Paper and data unique identifier(eg. 1-1,10-150)","167-25"]
["Scores",10,10,5,5,5,5,2,5,5,4,4,0,0,4,4,3,3,3,0,0,1,3,81,0.81,""]
["Answers","21 d","reproduction, total number of young","NOEC","","","","OECD","<24h old","synthetic water","renewed every other day","","","not stated. Toxicity values just reported","","",6.85,41.7,2.96,"","measured but not stated","measured but not stated.",""]
["Category","Freshwater/metal/non- plant","Paper and data unique identifier(eg. 1-1,10-150)","167-26"]
["Scores",10,10,5,5,5,5,2,5,5,4,4,0,0,4,4,3,3,3,0,0,1,3,81,0.81,""]
["Answers","21 d","reproduction, total number of young","NOEC","","","","OECD","<24h old","synthetic water","renewed every other day","","","not stated. Toxicity values just reported","","",6.81,59.7,2.89,"","measured but not stated","measured but not stated.",""]
["Category","Freshwater/metal/non- plant","Paper and data unique identifier(eg. 1-1,10-150)","167-27"]
["Scores",10,10,5,5,5,5,2,5,5,4,4,0,0,4,4,3,3,3,0,0,1,3,81,0.81,""]
["Answers","21 d","reproduction, total number of young","NOEC","","","","OECD","<24h old","synthetic water","renewed every other day","","","not stated. Toxicity values just reported","","",6.81,97.1,2.89,"","measured but not stated","measured but not stated.",""]
["Category","Freshwater/metal/non- plant","Paper and data unique identifier(eg. 1-1,10-150)","167-28"]
["Scores",10,10,5,5,5,5,2,5,5,4,4,0,0,4,4,3,3,3,0,0,1,3,81,0.81,""]
["Answers","21 d","reproduction, total number of young","NOEC","","","","OECD","<24h old","synthetic water","renewed every other day","","","not stated. Toxicity values just reported","","",6.79,132,2.86,"","measured but not stated","measured but not stated.",""]
["Category","Freshwater/metal/non- plant","Paper and data unique identifier(eg. 1-1,10-150)","167-29"]
["Scores",10,10,5,5,5,5,2,5,5,4,4,0,0,4,4,3,3,3,0,0,1,3,81,0.81,""]
["Answers","21 d","reproduction, total number of young","NOEC","","","","OECD","<24h old","synthetic water","renewed every other day","","","not stated. Toxicity values just reported","","",6.79,169,2.86,"","measured but not stated","measured but not stated.",""]
["Category","Freshwater/metal/non- plant","Paper and data unique identifier(eg. 1-1,10-150)","167-30"]
["Scores",10,10,5,5,5,5,2,5,5,4,4,0,0,4,4,3,3,3,0,0,1,3,81,0.81,""]
["Answers","21 d","reproduction, total number of young","NOEC","","","","OECD","<24h old","synthetic water","renewed every other day","","","not stated. Toxicity values just reported","","",6.8,243,2.88,"","measured but not stated","measured but not stated.",""]
["Category","Freshwater/metal/non- plant","Paper and data unique identifier(eg. 1-1,10-150)","167-31"]
["Scores",10,10,5,5,5,5,2,5,5,4,4,0,0,4,4,3,3,3,0,0,1,3,81,0.81,""]
["Answers","21 d","reproduction, total number of young","NOEC","","","","OECD","<24h old","synthetic water","renewed every other day","","","not stated. Toxicity values just reported","","",6.79,42.8,2.86,"","measured but not stated","measured but not stated.",""]
["Category","Freshwater/metal/non- plant","Paper and data unique identifier(eg. 1-1,10-150)","167-32"]
["Scores",10,10,5,5,5,5,2,5,5,4,4,0,0,4,4,3,3,3,0,0,1,3,81,0.81,""]
["Answers","21 d","reproduction, total number of young","NOEC","","","","OECD","<24h old","synthetic water","renewed every other day","","","not stated. Toxicity values just reported","","",6.81,68.2,2.89,"","measured but not stated","measured but not stated.",""]
["Category","Freshwater/metal/non- plant","Paper and data unique identifier(eg. 1-1,10-150)","167-33"]
["Scores",10,10,5,5,5,5,2,5,5,4,4,0,0,4,4,3,3,3,0,0,1,3,81,0.81,""]
["Answers","21 d","reproduction, total number of young","NOEC","","","","OECD","<24h old","synthetic water","renewed every other day","","","not stated. Toxicity values just reported","","",6.82,117,2.91,"","measured but not stated","measured but not stated.",""]
["Category","Freshwater/metal/non- plant","Paper and data unique identifier(eg. 1-1,10-150)","167-34"]
["Scores",10,10,5,5,5,5,2,5,5,4,4,0,0,4,4,3,3,3,0,0,1,3,81,0.81,""]
["Answers","21 d","reproduction, total number of young","NOEC","","","","OECD","<24h old","synthetic water","renewed every other day","","","not stated. Toxicity values just reported","","",6.8,165,2.88,"","measured but not stated","measured but not stated.",""]
["Category","Freshwater/metal/non- plant","Paper and data unique identifier(eg. 1-1,10-150)","167-35"]
["Scores",10,10,5,5,5,5,2,5,5,4,4,0,0,4,4,3,3,3,0,0,1,3,81,0.81,""]
["Answers","21 d","reproduction, total number of young","NOEC","","","","OECD","<24h old","synthetic water","renewed every other day","","","not stated. Toxicity values just reported","","",6.8,213,2.88,"","measured but not stated","measured but not stated.",""]
["Category","Freshwater/metal/non- plant","Paper and data unique identifier(eg. 1-1,10-150)","167-36"]
["Scores",10,10,5,5,5,5,2,5,5,4,4,0,0,4,4,3,3,3,0,0,1,3,81,0.81,""]
["Answers","21 d","reproduction, total number of young","NOEC","","","","OECD","<24h old","synthetic water","renewed every other day","","","not stated. Toxicity values just reported","","",6.81,315,2.89,"","measured but not stated","measured but not stated.",""]
["Category","Freshwater/metal/non- plant","Paper and data unique identifier(eg. 1-1,10-150)","167-37"]
["Scores",10,10,5,5,5,5,2,5,5,4,4,0,0,4,4,3,3,3,0,0,1,3,81,0.81,""]
["Answers","21 d","reproduction, total number of young","NOEC","","","","OECD","<24h old","synthetic water","renewed every other day","","","not stated. Toxicity values just reported","","",5.87,53.4,0.65200000000000002,"","measured but not stated","measured but not stated.",""]
["Category","Freshwater/metal/non- plant","Paper and data unique identifier(eg. 1-1,10-150)","167-38"]
["Scores",10,10,5,5,5,5,2,5,5,4,4,0,0,4,4,3,3,3,0,0,1,3,81,0.81,""]
["Answers","21 d","reproduction, total number of young","NOEC","","","","OECD","<24h old","synthetic water","renewed every other day","","","not stated. Toxicity values just reported","","",6.4,53.4,3.25,"","measured but not stated","measured but not stated.",""]
["Category","Freshwater/metal/non- plant","Paper and data unique identifier(eg. 1-1,10-150)","167-39"]
["Scores",10,10,5,5,5,5,2,5,5,4,4,0,0,4,4,3,3,3,0,0,1,3,81,0.81,""]
["Answers","21 d","reproduction, total number of young","NOEC","","","","OECD","<24h old","synthetic water","renewed every other day","","","not stated. Toxicity values just reported","","",6.97,53.5,11,"","measured but not stated","measured but not stated.",""]
["Category","Freshwater/metal/non- plant","Paper and data unique identifier(eg. 1-1,10-150)","167-40"]
["Scores",10,10,5,5,5,5,2,5,5,4,4,0,0,4,4,3,3,3,0,0,1,3,81,0.81,""]
["Answers","21 d","reproduction, total number of young","NOEC","","","","OECD","<24h old","synthetic water","renewed every other day","","","not stated. Toxicity values just reported","","",7.35,53.9,21.9,"","measured but not stated","measured but not stated.",""]
["Category","Freshwater/metal/non- plant","Paper and data unique identifier(eg. 1-1,10-150)","167-41"]
["Scores",10,10,5,5,5,5,2,5,5,4,4,0,0,4,4,3,3,3,0,0,1,3,81,0.81,""]
["Answers","21 d","reproduction, total number of young","NOEC","","","","OECD","<24h old","synthetic water","renewed every other day","","","not stated. Toxicity values just reported","","",7.62,54,36.5,"","measured but not stated","measured but not stated.",""]
["Category","Freshwater/metal/non- plant","Paper and data unique identifier(eg. 1-1,10-150)","167-42"]
["Scores",10,10,5,5,5,5,2,5,5,4,4,0,0,4,4,3,3,3,0,0,1,3,81,0.81,""]
["Answers","21 d","reproduction, total number of young","NOEC","","","","OECD","<24h old","synthetic water","renewed every other day","","","not stated. Toxicity values just reported","","",8.2200000000000006,52.4,174,"","measured but not stated","measured but not stated.",""]
["Category","Freshwater/metal/non- plant","Paper and data unique identifier(eg. 1-1,10-150)","167-43"]
["Scores",10,10,5,5,5,5,2,5,5,4,4,0,0,4,4,3,3,3,3,0,1,3,84,0.84,""]
["Answers","21 d","reproduction, total number of young","NOEC","","","","OECD","<24h old","synthetic water","renewed every other day","","","not stated. Toxicity values just reported","","",6.79,123,12.3,17.3,"measured but not stated","measured but not stated.","4.0µg/L in river water"]
["Category","Freshwater/metal/non- plant","Paper and data unique identifier(eg. 1-1,10-150)","167-44"]
["Scores",10,10,5,5,5,5,2,5,5,4,4,0,0,4,4,3,3,3,3,0,1,3,84,0.84,""]
["Answers","21 d","reproduction, total number of young","NOEC","","","","OECD","<24h old","synthetic water","renewed every other day","","","not stated. Toxicity values just reported","","",6.15,13.6,8.36,5.37,"measured but not stated","measured but not stated.","2.5µg/L in river water"]
["Category","Freshwater/metal/non- plant","Paper and data unique identifier(eg. 1-1,10-150)","167-45"]
["Scores",10,10,5,5,5,5,2,5,5,4,4,0,0,4,4,3,3,3,3,0,1,3,84,0.84,""]
["Answers","21 d","reproduction, total number of young","NOEC","","","","OECD","<24h old","synthetic water","renewed every other day","","","not stated. Toxicity values just reported","","",7.09,26.4,12.8,2.5299999999999998,"measured but not stated","measured but not stated.","2.0 µg/L in river water"]
["Category","Freshwater/metal/non- plant","Paper and data unique identifier(eg. 1-1,10-150)","167-46"]
["Scores",10,10,5,5,5,5,2,5,5,4,4,0,0,4,4,3,3,3,3,0,1,3,84,0.84,""]
["Answers","21 d","reproduction, total number of young","NOEC","","","","OECD","<24h old","synthetic water","renewed every other day","","","not stated. Toxicity values just reported","","",8.09,189,127,7.49,"measured but not stated","measured but not stated.","1.0 µg/L Ni in river water"]
["Category","Freshwater/metal/non- plant","Paper and data unique identifier(eg. 1-1,10-150)","167-47"]
["Scores",10,10,5,5,5,5,2,5,5,4,4,0,0,4,4,3,3,3,3,0,1,3,84,0.84,""]
["Answers","21 d","reproduction, total number of young","NOEC","","","","OECD","<24h old","synthetic water","renewed every other day","","","not stated. Toxicity values just reported","","",7.71,183,161,9.8699999999999992,"measured but not stated","measured but not stated.","4 µg Ni/L in river water"]
["Category","Freshwater/metal/non- plant","Paper and data unique identifier(eg. 1-1,10-150)","167-48"]
["Scores",10,10,5,5,5,5,2,5,5,4,4,0,0,4,4,3,3,3,3,0,1,3,84,0.84,""]
["Answers","21 d","reproduction, total number of young","NOEC","","","","OECD","<24h old","synthetic water","renewed every other day","","","not stated. Toxicity values just reported","","",8.02,122,122,4.17,"measured but not stated","measured but not stated.","6 µg Ni/L in river water"]
["Category","Freshwater/metal/non- plant","Paper and data unique identifier(eg. 1-1,10-150)","167-49"]
["Scores",10,10,5,5,5,5,2,5,5,4,4,0,0,4,4,3,3,3,0,0,1,3,81,0.81,""]
["Answers","21 d","reproduction, total number of young","EC",20,"","","OECD","<24h old","synthetic water","renewed every other day","","","not stated. Toxicity values just reported","","",6.85,41.7,2.96,"","measured but not stated","measured but not stated.",""]
["Category","Freshwater/metal/non- plant","Paper and data unique identifier(eg. 1-1,10-150)","167-50"]
["Scores",10,10,5,5,5,5,2,5,5,4,4,0,0,4,4,3,3,3,0,0,1,3,81,0.81,""]
["Answers","21 d","reproduction, total number of young","EC",20,"","","OECD","<24h old","synthetic water","renewed every other day","","","not stated. Toxicity values just reported","","",6.81,59.7,2.89,"","measured but not stated","measured but not stated.",""]
["Category","Freshwater/metal/non- plant","Paper and data unique identifier(eg. 1-1,10-150)","167-51"]
["Scores",10,10,5,5,5,5,2,5,5,4,4,0,0,4,4,3,3,3,0,0,1,3,81,0.81,""]
["Answers","21 d","reproduction, total number of young","EC",20,"","","OECD","<24h old","synthetic water","renewed every other day","","","not stated. Toxicity values just reported","","",6.81,97.1,2.89,"","measured but not stated","measured but not stated.",""]
["Category","Freshwater/metal/non- plant","Paper and data unique identifier(eg. 1-1,10-150)","167-52"]
["Scores",10,10,5,5,5,5,2,5,5,4,4,0,0,4,4,3,3,3,0,0,1,3,81,0.81,""]
["Answers","21 d","reproduction, total number of young","EC",20,"","","OECD","<24h old","synthetic water","renewed every other day","","","not stated. Toxicity values just reported","","",6.79,132,2.86,"","measured but not stated","measured but not stated.",""]
["Category","Freshwater/metal/non- plant","Paper and data unique identifier(eg. 1-1,10-150)","167-53"]
["Scores",10,10,5,5,5,5,2,5,5,4,4,0,0,4,4,3,3,3,0,0,1,3,81,0.81,""]
["Answers","21 d","reproduction, total number of young","EC",20,"","","OECD","<24h old","synthetic water","renewed every other day","","","not stated. Toxicity values just reported","","",6.79,169,2.86,"","measured but not stated","measured but not stated.",""]
["Category","Freshwater/metal/non- plant","Paper and data unique identifier(eg. 1-1,10-150)","167-54"]
["Scores",10,10,5,5,5,5,2,5,5,4,4,0,0,4,4,3,3,3,0,0,1,3,81,0.81,""]
["Answers","21 d","reproduction, total number of young","EC",20,"","","OECD","<24h old","synthetic water","renewed every other day","","","not stated. Toxicity values just reported","","",6.8,243,2.88,"","measured but not stated","measured but not stated.",""]
["Category","Freshwater/metal/non- plant","Paper and data unique identifier(eg. 1-1,10-150)","167-55"]
["Scores",10,10,5,5,5,5,2,5,5,4,4,0,0,4,4,3,3,3,0,0,1,3,81,0.81,""]
["Answers","21 d","reproduction, total number of young","EC",20,"","","OECD","<24h old","synthetic water","renewed every other day","","","not stated. Toxicity values just reported","","",6.79,42.8,2.86,"","measured but not stated","measured but not stated.",""]
["Category","Freshwater/metal/non- plant","Paper and data unique identifier(eg. 1-1,10-150)","167-56"]
["Scores",10,10,5,5,5,5,2,5,5,4,4,0,0,4,4,3,3,3,0,0,1,3,81,0.81,""]
["Answers","21 d","reproduction, total number of young","EC",20,"","","OECD","<24h old","synthetic water","renewed every other day","","","not stated. Toxicity values just reported","","",6.81,68.2,2.89,"","measured but not stated","measured but not stated.",""]
["Category","Freshwater/metal/non- plant","Paper and data unique identifier(eg. 1-1,10-150)","167-57"]
["Scores",10,10,5,5,5,5,2,5,5,4,4,0,0,4,4,3,3,3,0,0,1,3,81,0.81,""]
["Answers","21 d","reproduction, total number of young","EC",20,"","","OECD","<24h old","synthetic water","renewed every other day","","","not stated. Toxicity values just reported","","",6.82,117,2.91,"","measured but not stated","measured but not stated.",""]
["Category","Freshwater/metal/non- plant","Paper and data unique identifier(eg. 1-1,10-150)","167-58"]
["Scores",10,10,5,5,5,5,2,5,5,4,4,0,0,4,4,3,3,3,0,0,1,3,81,0.81,""]
["Answers","21 d","reproduction, total number of young","EC",20,"","","OECD","<24h old","synthetic water","renewed every other day","","","not stated. Toxicity values just reported","","",6.8,165,2.88,"","measured but not stated","measured but not stated.",""]
["Category","Freshwater/metal/non- plant","Paper and data unique identifier(eg. 1-1,10-150)","167-59"]
["Scores",10,10,5,5,5,5,2,5,5,4,4,0,0,4,4,3,3,3,0,0,1,3,81,0.81,""]
["Answers","21 d","reproduction, total number of young","EC",20,"","","OECD","<24h old","synthetic water","renewed every other day","","","not stated. Toxicity values just reported","","",6.8,213,2.88,"","measured but not stated","measured but not stated.",""]
["Category","Freshwater/metal/non- plant","Paper and data unique identifier(eg. 1-1,10-150)","167-60"]
["Scores",10,10,5,5,5,5,2,5,5,4,4,0,0,4,4,3,3,3,0,0,1,3,81,0.81,""]
["Answers","21 d","reproduction, total number of young","EC",20,"","","OECD","<24h old","synthetic water","renewed every other day","","","not stated. Toxicity values just reported","","",6.81,315,2.89,"","measured but not stated","measured but not stated.",""]
["Category","Freshwater/metal/non- plant","Paper and data unique identifier(eg. 1-1,10-150)","167-61"]
["Scores",10,10,5,5,5,5,2,5,5,4,4,0,0,4,4,3,3,3,0,0,1,3,81,0.81,""]
["Answers","21 d","reproduction, total number of young","EC",20,"","","OECD","<24h old","synthetic water","renewed every other day","","","not stated. Toxicity values just reported","","",5.87,53.4,0.65200000000000002,"","measured but not stated","measured but not stated.",""]
["Category","Freshwater/metal/non- plant","Paper and data unique identifier(eg. 1-1,10-150)","167-62"]
["Scores",10,10,5,5,5,5,2,5,5,4,4,0,0,4,4,3,3,3,0,0,1,3,81,0.81,""]
["Answers","21 d","reproduction, total number of young","EC",20,"","","OECD","<24h old","synthetic water","renewed every other day","","","not stated. Toxicity values just reported","","",6.4,53.4,3.25,"","measured but not stated","measured but not stated.",""]
["Category","Freshwater/metal/non- plant","Paper and data unique identifier(eg. 1-1,10-150)","167-63"]
["Scores",10,10,5,5,5,5,2,5,5,4,4,0,0,4,4,3,3,3,0,0,1,3,81,0.81,""]
["Answers","21 d","reproduction, total number of young","EC",20,"","","OECD","<24h old","synthetic water","renewed every other day","","","not stated. Toxicity values just reported","","",6.97,53.5,11,"","measured but not stated","measured but not stated.",""]
["Category","Freshwater/metal/non- plant","Paper and data unique identifier(eg. 1-1,10-150)","167-64"]
["Scores",10,10,5,5,5,5,2,5,5,4,4,0,0,4,4,3,3,3,0,0,1,3,81,0.81,""]
["Answers","21 d","reproduction, total number of young","EC",20,"","","OECD","<24h old","synthetic water","renewed every other day","","","not stated. Toxicity values just reported","","",7.35,53.9,21.9,"","measured but not stated","measured but not stated.",""]
["Category","Freshwater/metal/non- plant","Paper and data unique identifier(eg. 1-1,10-150)","167-65"]
["Scores",10,10,5,5,5,5,2,5,5,4,4,0,0,4,4,3,3,3,0,0,1,3,81,0.81,""]
["Answers","21 d","reproduction, total number of young","EC",20,"","","OECD","<24h old","synthetic water","renewed every other day","","","not stated. Toxicity values just reported","","",7.62,54,36.5,"","measured but not stated","measured but not stated.",""]
["Category","Freshwater/metal/non- plant","Paper and data unique identifier(eg. 1-1,10-150)","167-66"]
["Scores",10,10,5,5,5,5,2,5,5,4,4,0,0,4,4,3,3,3,0,0,1,3,81,0.81,""]
["Answers","21 d","reproduction, total number of young","EC",20,"","","OECD","<24h old","synthetic water","renewed every other day","","","not stated. Toxicity values just reported","","",8.2200000000000006,52.4,174,"","measured but not stated","measured but not stated.",""]
["Category","Freshwater/metal/non- plant","Paper and data unique identifier(eg. 1-1,10-150)","167-67"]
["Scores",10,10,5,5,5,5,2,5,5,4,4,0,0,4,4,3,3,3,3,0,1,3,84,0.84,""]
["Answers","21 d","reproduction, total number of young","EC",20,"","","OECD","<24h old","synthetic water","renewed every other day","","","not stated. Toxicity values just reported","","",6.79,123,12.3,17.3,"measured but not stated","measured but not stated.","4.0µg/L in river water"]
["Category","Freshwater/metal/non- plant","Paper and data unique identifier(eg. 1-1,10-150)","167-68"]
["Scores",10,10,5,5,5,5,2,5,5,4,4,0,0,4,4,3,3,3,3,0,1,3,84,0.84,""]
["Answers","21 d","reproduction, total number of young","EC",20,"","","OECD","<24h old","synthetic water","renewed every other day","","","not stated. Toxicity values just reported","","",6.15,13.6,8.36,5.37,"measured but not stated","measured but not stated.","2.5µg/L in river water"]
["Category","Freshwater/metal/non- plant","Paper and data unique identifier(eg. 1-1,10-150)","167-69"]
["Scores",10,10,5,5,5,5,2,5,5,4,4,0,0,4,4,3,3,3,3,0,1,3,84,0.84,""]
["Answers","21 d","reproduction, total number of young","EC",20,"","","OECD","<24h old","synthetic water","renewed every other day","","","not stated. Toxicity values just reported","","",7.09,26.4,12.8,2.5299999999999998,"measured but not stated","measured but not stated.","2.0 µg/L in river water"]
["Category","Freshwater/metal/non- plant","Paper and data unique identifier(eg. 1-1,10-150)","167-70"]
["Scores",10,10,5,5,5,5,2,5,5,4,4,0,0,4,4,3,3,3,3,0,1,3,84,0.84,""]
["Answers","21 d","reproduction, total number of young","EC",20,"","","OECD","<24h old","synthetic water","renewed every other day","","","not stated. Toxicity values just reported","","",8.09,189,127,7.49,"measured but not stated","measured but not stated.","1.0 µg/L Ni in river water"]
["Category","Freshwater/metal/non- plant","Paper and data unique identifier(eg. 1-1,10-150)","167-71"]
["Scores",10,10,5,5,5,5,2,5,5,4,4,0,0,4,4,3,3,3,3,0,1,3,84,0.84,""]
["Answers","21 d","reproduction, total number of young","EC",20,"","","OECD","<24h old","synthetic water","renewed every other day","","","not stated. Toxicity values just reported","","",7.71,183,161,9.8699999999999992,"measured but not stated","measured but not stated.","4 µg Ni/L in river water"]
["Category","Freshwater/metal/non- plant","Paper and data unique identifier(eg. 1-1,10-150)","167-72"]
["Scores",10,10,5,5,5,5,2,5,5,4,4,0,0,4,4,3,3,3,3,0,1,3,84,0.84,""]
["Answers","21 d","reproduction, total number of young","EC",20,"","","OECD","<24h old","synthetic water","renewed every other day","","","not stated. Toxicity values just reported","","",8.02,122,122,4.17,"measured but not stated","measured but not stated.","6 µg Ni/L in river water"]
["Category","Freshwater/metal/non- plant","Paper and data unique identifier(eg. 1-1,10-150)","168-1"]
["Scores",10,5,5,5,5,0,2,5,5,4,4,0,4,4,4,3,3,3,1,1,3,3,79,0.79,""]
["Answers","17-26d, but only 17d data reported","mortality","NOEC","NOEC","","not possible due to flow through set up, therefore pseudoreplication was used","OECD","juveniles, wet weight at start = 207-354 mg","synthetic water pH 5.8","flow through","","","","","",5.48,23.7,4.6199999999999998E-2,"<1 mg/L",">90%","13.9 ± 0.2",""]
["Category","Freshwater/metal/non- plant","Paper and data unique identifier(eg. 1-1,10-150)","168-2"]
["Scores",10,5,5,5,5,0,2,5,5,4,4,0,4,4,4,3,3,3,1,1,3,3,79,0.79,""]
["Answers","17-26d, but only 17d data reported","mortality","NOEC","NOEC","","not possible due to flow through set up, therefore pseudoreplication was used","OECD","juveniles, wet weight at start = 207-354 mg","synthetic water  pH 6.4","flow through","","","","","",6.76,23.2,1.01,"<1 mg/L",">90%","13.9±0.2",""]
["Category","Freshwater/metal/non- plant","Paper and data unique identifier(eg. 1-1,10-150)","168-3"]
["Scores",10,5,5,5,5,0,2,5,5,4,4,0,4,4,4,3,3,3,1,1,3,3,79,0.79,""]
["Answers","17-26d, but only 17d data reported","mortality","NOEC","NOEC","","not possible due to flow through set up, therefore pseudoreplication was used","OECD","juveniles, wet weight at start = 207-354 mg","synthetic water pH 7.0","flow through","","","","","",7.19,23.6,5.68,"<1 mg/L",">90%","14.4 ± 0.2",""]
["Category","Freshwater/metal/non- plant","Paper and data unique identifier(eg. 1-1,10-150)","168-4"]
["Scores",10,5,5,5,5,0,2,5,5,4,4,0,4,4,4,3,3,3,1,1,3,3,79,0.79,""]
["Answers","17-26d, but only 17d data reported","mortality","NOEC","NOEC","","not possible due to flow through set up, therefore pseudoreplication was used","OECD","juveniles, wet weight at start = 207-354 mg","synthetic water pH 7.6","flow through","","","","","",7.67,23.4,26.9,"<1 mg/L",">90%","14.7±0.15",""]
["Category","Freshwater/metal/non- plant","Paper and data unique identifier(eg. 1-1,10-150)","168-5"]
["Scores",10,5,5,5,5,0,2,5,5,4,4,0,4,4,4,3,3,3,1,1,3,3,79,0.79,""]
["Answers","17-26d, but only 17d data reported","mortality","NOEC","NOEC","","not possible due to flow through set up, therefore pseudoreplication was used","OECD","juveniles, wet weight at start = 207-354 mg","synthetic water pH 8.2","flow through","","","","","",8.4700000000000006,23.5,180,"<1 mg/L",">90%","14.7 ± 0.2",""]
["Category","Freshwater/metal/non- plant","Paper and data unique identifier(eg. 1-1,10-150)","168-6"]
["Scores",10,5,5,5,5,0,2,5,5,4,4,0,4,4,4,3,3,3,1,1,3,3,79,0.79,""]
["Answers","17-26d, but only 17d data reported","mortality","NOEC","NOEC","","not possible due to flow through set up, therefore pseudoreplication was used","OECD","juveniles, wet weight at start = 207-354 mg","synthetic water Mg 0.12 mM","flow through","","","","","",7.53,22.2,28,"<1 mg/L",">90%","13.5 ± 0.08",""]
["Category","Freshwater/metal/non- plant","Paper and data unique identifier(eg. 1-1,10-150)","168-7"]
["Scores",10,5,5,5,5,0,2,5,5,4,4,0,4,4,4,3,3,3,1,1,3,3,79,0.79,""]
["Answers","17-26d, but only 17d data reported","mortality","NOEC","NOEC","","not possible due to flow through set up, therefore pseudoreplication was used","OECD","juveniles, wet weight at start = 207-354 mg","synthetic water Mg 0.5 mM","flow through","","","","","",7.53,56.4,28,"<1 mg/L",">90%","13.5 ± 0.14",""]
["Category","Freshwater/metal/non- plant","Paper and data unique identifier(eg. 1-1,10-150)","168-8"]
["Scores",10,5,5,5,5,0,2,5,5,4,4,0,4,4,4,3,3,3,1,1,3,3,79,0.79,""]
["Answers","17-26d, but only 17d data reported","mortality","NOEC","NOEC","","not possible due to flow through set up, therefore pseudoreplication was used","OECD","juveniles, wet weight at start = 207-354 mg","synthetic water Mg 2.0 mM","flow through","","","","","",7.55,206,28,"<1 mg/L",">90%","14.4 ± 0.06",""]
["Category","Freshwater/metal/non- plant","Paper and data unique identifier(eg. 1-1,10-150)","168-9"]
["Scores",10,5,5,5,5,0,2,5,5,4,4,0,4,4,4,3,3,3,1,1,3,3,79,0.79,""]
["Answers","17-26d, but only 17d data reported","mortality","NOEC","NOEC","","not possible due to flow through set up, therefore pseudoreplication was used","OECD","juveniles, wet weight at start = 207-354 mg","synthetic water Ca 0.12 mM (1)","flow through","","","","","",7.59,22.2,28.2,"<1 mg/L",">90%","13.7 ± 0.12",""]
["Category","Freshwater/metal/non- plant","Paper and data unique identifier(eg. 1-1,10-150)","168-10"]
["Scores",10,5,5,5,5,0,2,5,5,4,4,0,4,4,4,3,3,3,1,1,3,3,79,0.79,""]
["Answers","17-26d, but only 17d data reported","mortality","NOEC","NOEC","","not possible due to flow through set up, therefore pseudoreplication was used","OECD","juveniles, wet weight at start = 207-354 mg","synthetic water Ca 0.12 mM (2)","flow through","","","","","",7.52,22.8,27.9,"<1 mg/L",">90%","14.1 ± 0.17",""]
["Category","Freshwater/metal/non- plant","Paper and data unique identifier(eg. 1-1,10-150)","168-11"]
["Scores",10,5,5,5,5,0,2,5,5,4,4,0,4,4,4,3,3,3,1,1,3,3,79,0.79,""]
["Answers","17-26d, but only 17d data reported","mortality","NOEC","NOEC","","not possible due to flow through set up, therefore pseudoreplication was used","OECD","juveniles, wet weight at start = 207-354 mg","synthetic water Ca 0.5 mM","flow through","","","","","",7.63,54.4,28.3,"<1 mg/L",">90%","13.5 ± 0.18",""]
["Category","Freshwater/metal/non- plant","Paper and data unique identifier(eg. 1-1,10-150)","168-12"]
["Scores",10,5,5,5,5,0,2,5,5,4,4,0,4,4,4,3,3,3,1,1,3,3,79,0.79,""]
["Answers","17-26d, but only 17d data reported","mortality","NOEC","NOEC","","not possible due to flow through set up, therefore pseudoreplication was used","OECD","juveniles, wet weight at start = 207-354 mg","synthetic water Ca 1.0 mM","flow through","","","","","",7.62,112,28.3,"<1 mg/L",">90%","14.6 ± 0.12",""]
["Category","Freshwater/metal/non- plant","Paper and data unique identifier(eg. 1-1,10-150)","168-13"]
["Scores",10,5,5,5,5,0,2,5,5,4,4,0,4,4,4,3,3,3,1,1,3,3,79,0.79,""]
["Answers","17-26d, but only 17d data reported","mortality","NOEC","NOEC","","not possible due to flow through set up, therefore pseudoreplication was used","OECD","juveniles, wet weight at start = 207-354 mg","synthetic water Ca 3.0 mM","flow through","","","","","",7.52,286,27.9,"<1 mg/L",">90%","14.1 ± 0.19",""]
["Category","Freshwater/metal/non- plant","Paper and data unique identifier(eg. 1-1,10-150)","168-14"]
["Scores",10,5,5,5,5,0,2,5,5,4,4,0,4,4,4,3,3,3,3,1,3,3,81,0.81,""]
["Answers","17-26d, but only 17d data reported","mortality","NOEC","NOEC","","not possible due to flow through set up, therefore pseudoreplication was used","OECD","juveniles, wet weight at start = 207-354 mg","Collected River water (Ankeveen)","flow through","","","","","",7.55,263,36.6,18.399999999999999,">90%","14.5 ± 1",""]
["Category","Freshwater/metal/non- plant","Paper and data unique identifier(eg. 1-1,10-150)","168-15"]
["Scores",10,5,5,5,5,0,2,5,5,4,4,0,4,4,4,3,3,3,3,1,3,3,81,0.81,""]
["Answers","17-26d, but only 17d data reported","mortality","NOEC","NOEC","","not possible due to flow through set up, therefore pseudoreplication was used","OECD","juveniles, wet weight at start = 207-354 mg","Collected River water (Bihain)","flow through","","","","","",5.63,14,1.1599999999999999,6.32,">90%","14.5 ± 1",""]
["Category","Freshwater/metal/non- plant","Paper and data unique identifier(eg. 1-1,10-150)","168-16"]
["Scores",10,5,5,5,5,0,2,5,5,4,4,0,4,4,4,3,3,3,3,1,3,3,81,0.81,""]
["Answers","17-26d, but only 17d data reported","mortality","NOEC","NOEC","","not possible due to flow through set up, therefore pseudoreplication was used","OECD","juveniles, wet weight at start = 207-354 mg","Collected River water (Brisy)","flow through","","","","","",7.39,37.5,23.4,3.83,">90%","14.5 ± 1",""]
["Category","Freshwater/metal/non- plant","Paper and data unique identifier(eg. 1-1,10-150)","168-17"]
["Scores",10,5,5,5,5,0,2,5,5,4,4,0,4,4,4,3,3,3,3,1,3,3,81,0.81,""]
["Answers","17-26d, but only 17d data reported","mortality","NOEC","NOEC","","not possible due to flow through set up, therefore pseudoreplication was used","OECD","juveniles, wet weight at start = 207-354 mg","Collected River water (Eppe)","flow through","","","","","",8.0500000000000007,98.6,91,4.87,">90%","14.5 ± 1",""]
["Category","Freshwater/metal/non- plant","Paper and data unique identifier(eg. 1-1,10-150)","168-18"]
["Scores",10,5,5,5,5,0,2,5,5,4,4,0,4,4,4,3,3,3,3,1,3,3,81,0.81,""]
["Answers","17-26d, but only 17d data reported","mortality","NOEC","NOEC","","not possible due to flow through set up, therefore pseudoreplication was used","OECD","juveniles, wet weight at start = 207-354 mg","Collected River water (Markermeer)","flow through","","","","","",8.19,205,121,4.5,">90%","14.5 ± 1",""]
["Category","Freshwater/metal/non- plant","Paper and data unique identifier(eg. 1-1,10-150)","171-1"]
["Scores",10,10,5,5,5,5,5,5,5,4,4,0,4,4,4,1,1,1,0,1,1,3,83,0.83,""]
["Answers","17 d","number of neonates over 3 broods","EC",10,"","10 replicates","acceptable if control mortality<20%","<48h old neonate","synthetic waters","renewed ervey other day.","measured beginning, end and each renewal.","","","","",7.18,43.4,12.4,"","measured but not stated","measured but not stated","All test solutions were analysed for Ni."]
["Category","Freshwater/metal/non- plant","Paper and data unique identifier(eg. 1-1,10-150)","171-2"]
["Scores",10,5,5,5,5,5,5,5,5,4,4,0,4,4,4,1,1,1,0,1,1,3,78,0.78,""]
["Answers","17 d","mortality","LC",50,"","10 replicates","acceptable if control mortality<20%","<48h old neonate","synthetic waters","renewed ervey other day.","measured beginning, end and each renewal.","","","","",7.18,43.4,12.4,"","measured but not stated","measured but not stated","All test solutions were analysed for Ni."]
["Category","Freshwater/metal/non- plant","Paper and data unique identifier(eg. 1-1,10-150)","171-3"]
["Scores",10,10,5,5,5,5,5,5,5,4,4,0,4,4,4,1,1,1,0,1,1,3,83,0.83,""]
["Answers","17 d","number of neonates over 3 broods","","","","10 replicates","acceptable if control mortality<20%","<48h old neonate","synthetic waters","renewed ervey other day.","measured beginning, end and each renewal.","","","","",7.18,16.3,12.4,"","measured but not stated","measured but not stated","All test solutions were analysed for Ni."]
["Category","Freshwater/metal/non- plant","Paper and data unique identifier(eg. 1-1,10-150)","171-4"]
["Scores",10,5,5,5,5,5,5,5,5,4,4,0,4,4,4,1,1,1,0,1,1,3,78,0.78,""]
["Answers","17 d","mortality","LC",50,"","10 replicates","acceptable if control mortality<20%","<48h old neonate","synthetic waters","renewed ervey other day.","measured beginning, end and each renewal.","","","","",7.18,16.3,12.4,"","measured but not stated","measured but not stated","All test solutions were analysed for Ni."]
["Category","Freshwater/metal/non- plant","Paper and data unique identifier(eg. 1-1,10-150)","171-5"]
["Scores",10,10,5,5,5,5,5,5,5,4,4,0,4,4,4,1,1,1,0,1,1,3,83,0.83,""]
["Answers","17 d","number of neonates over 3 broods","","","","10 replicates","acceptable if control mortality<20%","<48h old neonate","synthetic waters","renewed ervey other day.","measured beginning, end and each renewal.","","","","",7.18,6.25,12.4,"","measured but not stated","measured but not stated","All test solutions were analysed for Ni."]
["Category","Freshwater/metal/non- plant","Paper and data unique identifier(eg. 1-1,10-150)","171-6"]
["Scores",10,5,5,5,5,5,5,5,5,4,4,0,4,4,4,1,1,1,0,1,1,3,78,0.78,""]
["Answers","17 d","mortality","LC",50,"","10 replicates","acceptable if control mortality<20%","<48h old neonate","synthetic waters","renewed ervey other day.","measured beginning, end and each renewal.","","","","",7.18,6.25,12.4,"","measured but not stated","measured but not stated","All test solutions were analysed for Ni."]
["Category","Freshwater/metal/non- plant","Paper and data unique identifier(eg. 1-1,10-150)","171-7"]
["Scores",10,10,5,5,5,5,5,5,5,4,4,0,4,4,4,1,1,1,0,1,1,3,83,0.83,""]
["Answers","17 d","number of neonates over 3 broods","","","","10 replicates","acceptable if control mortality<20%","<48h old neonate","synthetic waters","renewed ervey other day.","measured beginning, end and each renewal.","","","","",7.18,16.3,12.4,"","measured but not stated","measured but not stated","All test solutions were analysed for Ni."]
["Category","Freshwater/metal/non- plant","Paper and data unique identifier(eg. 1-1,10-150)","171-8"]
["Scores",10,5,5,5,5,5,5,5,5,4,4,0,4,4,4,1,1,1,0,1,1,3,78,0.78,""]
["Answers","17 d","mortality","LC",50,"","10 replicates","acceptable if control mortality<20%","<48h old neonate","synthetic waters","renewed ervey other day.","measured beginning, end and each renewal.","","","","",7.18,16.3,12.4,"","measured but not stated","measured but not stated","All test solutions were analysed for Ni."]
["Category","Freshwater/metal/non- plant","Paper and data unique identifier(eg. 1-1,10-150)","171-9"]
["Scores",10,10,5,5,5,5,5,5,5,4,4,0,4,4,4,1,1,1,0,1,1,3,83,0.83,""]
["Answers","21 d","number of neonates over 3 broods","","","","10 replicates","acceptable if control mortality<20%","<48h old neonate","synthetic waters","renewed ervey other day.","measured beginning, end and each renewal.","","","","",7.18,43.4,12.4,"","measured but not stated","measured but not stated","All test solutions were analysed for Ni."]
["Category","Freshwater/metal/non- plant","Paper and data unique identifier(eg. 1-1,10-150)","171-10"]
["Scores",10,5,5,5,5,5,5,5,5,4,4,0,4,4,4,1,1,1,0,1,1,3,78,0.78,""]
["Answers","21 d","mortality","LC",50,"","10 replicates","acceptable if control mortality<20%","<48h old neonate","synthetic waters","renewed ervey other day.","measured beginning, end and each renewal.","","","","",7.18,43.4,12.4,"","measured but not stated","measured but not stated","All test solutions were analysed for Ni."]
["Category","Freshwater/metal/non- plant","Paper and data unique identifier(eg. 1-1,10-150)","171-11"]
["Scores",10,10,5,5,5,5,5,5,5,4,4,0,4,4,4,1,1,1,0,1,1,3,83,0.83,""]
["Answers","21 d","","","","","10 replicates","acceptable if control mortality<20%","<48h old neonate","synthetic waters","renewed ervey other day.","measured beginning, end and each renewal.","","","","",7.18,16.3,12.4,"","measured but not stated","measured but not stated","All test solutions were analysed for Ni."]
["Category","Freshwater/metal/non- plant","Paper and data unique identifier(eg. 1-1,10-150)","171-12"]
["Scores",10,5,5,5,5,5,5,5,5,4,4,0,4,4,4,1,1,1,0,1,1,3,78,0.78,""]
["Answers","21 d","","","","","10 replicates","acceptable if control mortality<20%","<48h old neonate","synthetic waters","renewed ervey other day.","measured beginning, end and each renewal.","","","","",7.18,16.3,12.4,"","measured but not stated","measured but not stated","All test solutions were analysed for Ni."]
["Category","Freshwater/metal/non- plant","Paper and data unique identifier(eg. 1-1,10-150)","171-13"]
["Scores",10,5,5,5,5,5,5,5,5,4,4,0,4,4,4,1,1,1,0,1,1,3,78,0.78,""]
["Answers","16 d","","","","","10 replicates","acceptable if control mortality<20%","<48h old neonate","synthetic waters","renewed ervey other day.","measured beginning, end and each renewal.","","","","",7.18,43.4,12.4,"","measured but not stated","measured but not stated","All test solutions were analysed for Ni."]
["Category","Freshwater/metal/non- plant","Paper and data unique identifier(eg. 1-1,10-150)","171-14"]
["Scores",10,5,5,5,5,5,5,5,5,4,4,0,4,4,4,1,1,1,0,1,1,3,78,0.78,""]
["Answers","16 d","","","","","10 replicates","acceptable if control mortality<20%","<48h old neonate","synthetic waters","renewed ervey other day.","measured beginning, end and each renewal.","","","","",7.18,16.3,12.4,"","measured but not stated","measured but not stated","All test solutions were analysed for Ni."]
["Category","Freshwater/metal/non- plant","Paper and data unique identifier(eg. 1-1,10-150)","171-15"]
["Scores",10,10,5,5,5,5,5,5,5,4,4,0,4,4,4,1,1,1,0,1,1,3,83,0.83,""]
["Answers","17 d","","","","","10 replicates","acceptable if control mortality<20%","<48h old neonate","synthetic waters","renewed ervey other day.","measured beginning, end and each renewal.","","","","",7.18,43.4,12.4,"","measured but not stated","measured but not stated","All test solutions were analysed for Ni."]
["Category","Freshwater/metal/non- plant","Paper and data unique identifier(eg. 1-1,10-150)","171-16"]
["Scores",10,5,5,5,5,5,5,5,5,4,4,0,4,4,4,1,1,1,0,1,1,3,78,0.78,""]
["Answers","17 d","","","","","10 replicates","acceptable if control mortality<20%","<48h old neonate","synthetic waters","renewed ervey other day.","measured beginning, end and each renewal.","","","","",7.18,43.4,12.4,"","measured but not stated","measured but not stated","All test solutions were analysed for Ni."]
["Category","Freshwater/metal/non- plant","Paper and data unique identifier(eg. 1-1,10-150)","171-17"]
["Scores",10,10,5,5,5,5,5,5,5,4,4,0,4,4,4,1,1,1,0,1,1,3,83,0.83,""]
["Answers","17 d","","","","","10 replicates","acceptable if control mortality<20%","<48h old neonate","synthetic waters","renewed ervey other day.","measured beginning, end and each renewal.","","","","",7.18,16.3,12.4,"","measured but not stated","measured but not stated","All test solutions were analysed for Ni."]
["Category","Freshwater/metal/non- plant","Paper and data unique identifier(eg. 1-1,10-150)","171-18"]
["Scores",10,5,5,5,5,5,5,5,5,4,4,0,4,4,4,1,1,1,0,1,1,3,78,0.78,""]
["Answers","17 d","","","","","10 replicates","acceptable if control mortality<20%","<48h old neonate","synthetic waters","renewed ervey other day.","measured beginning, end and each renewal.","","","","",7.18,16.3,12.4,"","measured but not stated","measured but not stated","All test solutions were analysed for Ni."]
["Category","Freshwater/metal/non- plant","Paper and data unique identifier(eg. 1-1,10-150)","171-19"]
["Scores",10,10,5,5,5,5,5,5,5,4,4,0,4,4,4,1,1,1,0,1,1,3,83,0.83,""]
["Answers","21 d","","","","","10 replicates","acceptable if control mortality<20%","<48h old neonate","synthetic waters","renewed ervey other day.","measured beginning, end and each renewal.","","","","",7.18,43.4,12.4,"","measured but not stated","measured but not stated","All test solutions were analysed for Ni."]
["Category","Freshwater/metal/non- plant","Paper and data unique identifier(eg. 1-1,10-150)","171-20"]
["Scores",10,5,5,5,5,5,5,5,5,4,4,0,4,4,4,1,1,1,0,1,1,3,78,0.78,""]
["Answers","21 d","","","","","10 replicates","acceptable if control mortality<20%","<48h old neonate","synthetic waters","renewed ervey other day.","measured beginning, end and each renewal.","","","","",7.18,16.3,12.4,"","measured but not stated","measured but not stated","All test solutions were analysed for Ni."]
["Category","Freshwater/metal/non- plant","Paper and data unique identifier(eg. 1-1,10-150)","171-21"]
["Scores",10,10,5,5,5,5,5,5,5,4,4,0,4,4,4,1,1,1,0,1,1,3,83,0.83,""]
["Answers","21 d","","","","","10 replicates","acceptable if control mortality<20%","<48h old neonate","synthetic waters","renewed ervey other day.","measured beginning, end and each renewal.","","","","",7.18,16.3,12.4,"","measured but not stated","measured but not stated","All test solutions were analysed for Ni."]
["Category","Freshwater/metal/non- plant","Paper and data unique identifier(eg. 1-1,10-150)","171-22"]
["Scores",10,5,5,5,5,5,5,5,5,4,4,0,4,4,4,1,1,1,0,1,1,3,78,0.78,""]
["Answers","21 d","","","","","10 replicates","acceptable if control mortality<20%","<48h old neonate","synthetic waters","renewed ervey other day.","measured beginning, end and each renewal.","","","","",7.18,16.3,12.4,"","measured but not stated","measured but not stated","All test solutions were analysed for Ni."]
["Category","Freshwater/metal/non- plant","Paper and data unique identifier(eg. 1-1,10-150)","171-23"]
["Scores",10,10,5,5,5,5,5,5,5,4,4,0,4,4,4,1,1,1,0,1,1,3,83,0.83,""]
["Answers","17 d","","","","","10 replicates","acceptable if control mortality<20%","<48h old neonate","synthetic waters","renewed ervey other day.","measured beginning, end and each renewal.","","","","",7.18,6.25,12.4,"","measured but not stated","measured but not stated","All test solutions were analysed for Ni."]
["Category","Freshwater/metal/non- plant","Paper and data unique identifier(eg. 1-1,10-150)","171-24"]
["Scores",10,5,5,5,5,5,5,5,5,4,4,0,4,4,4,1,1,1,0,1,1,3,78,0.78,""]
["Answers","17 d","","","","","10 replicates","acceptable if control mortality<20%","<48h old neonate","synthetic waters","renewed ervey other day.","measured beginning, end and each renewal.","","","","",7.18,6.25,12.4,"","measured but not stated","measured but not stated","All test solutions were analysed for Ni."]
["Category","Freshwater/metal/non- plant","Paper and data unique identifier(eg. 1-1,10-150)","171-25"]
["Scores",10,10,5,5,5,5,5,5,5,4,4,0,4,4,4,1,1,1,0,1,1,3,83,0.83,""]
["Answers","17 d","","","","","10 replicates","acceptable if control mortality<20%","<48h old neonate","synthetic waters","renewed ervey other day.","measured beginning, end and each renewal.","","","","",7.18,16.3,12.4,"","measured but not stated","measured but not stated","All test solutions were analysed for Ni."]
["Category","Freshwater/metal/non- plant","Paper and data unique identifier(eg. 1-1,10-150)","171-26"]
["Scores",10,5,5,5,5,5,5,5,5,4,4,0,4,4,4,1,1,1,0,1,1,3,78,0.78,""]
["Answers","17 d","","","","","10 replicates","acceptable if control mortality<20%","<48h old neonate","synthetic waters","renewed ervey other day.","measured beginning, end and each renewal.","","","","",7.18,16.3,12.4,"","measured but not stated","measured but not stated","All test solutions were analysed for Ni."]
["Category","Freshwater/metal/non- plant","Paper and data unique identifier(eg. 1-1,10-150)","171-27"]
["Scores",10,10,5,5,5,5,5,5,5,4,4,0,4,4,4,1,1,1,0,1,1,3,83,0.83,""]
["Answers","17 d","","","","","10 replicates","acceptable if control mortality<20%","<48h old neonate","synthetic waters","renewed ervey other day.","measured beginning, end and each renewal.","","","","",7.18,6.25,12.4,"","measured but not stated","measured but not stated","All test solutions were analysed for Ni."]
["Category","Freshwater/metal/non- plant","Paper and data unique identifier(eg. 1-1,10-150)","171-28"]
["Scores",10,5,5,5,5,5,5,5,5,4,4,0,4,4,4,1,1,1,0,1,1,3,78,0.78,""]
["Answers","17 d","","","","","10 replicates","acceptable if control mortality<20%","<48h old neonate","synthetic waters","renewed ervey other day.","measured beginning, end and each renewal.","","","","",7.18,6.25,12.4,"","measured but not stated","measured but not stated","All test solutions were analysed for Ni."]
["Category","Freshwater/metal/non- plant","Paper and data unique identifier(eg. 1-1,10-150)","171-29"]
["Scores",10,10,5,5,5,5,5,5,5,4,4,0,4,4,4,1,1,1,0,1,1,3,83,0.83,""]
["Answers","17 d","","","","","10 replicates","acceptable if control mortality<20%","<48h old neonate","synthetic waters","renewed ervey other day.","measured beginning, end and each renewal.","","","","",7.18,16.3,12.4,"","measured but not stated","measured but not stated","All test solutions were analysed for Ni."]
["Category","Freshwater/metal/non- plant","Paper and data unique identifier(eg. 1-1,10-150)","171-30"]
["Scores",10,5,5,5,5,5,5,5,5,4,4,0,4,4,4,1,1,1,0,1,1,3,78,0.78,""]
["Answers","17 d","","","","","10 replicates","acceptable if control mortality<20%","<48h old neonate","synthetic waters","renewed ervey other day.","measured beginning, end and each renewal.","","","","",7.18,16.3,12.4,"","measured but not stated","measured but not stated","All test solutions were analysed for Ni."]
["Category","Freshwater/metal/non- plant","Paper and data unique identifier(eg. 1-1,10-150)","172-1"]
["Scores",10,5,5,5,5,5,2,5,5,0,4,0,0,4,0,0,1,1,0,3,1,3,64,0.64,""]
["Answers","28 days","","LC",25,"","duplicate","Method - Borgmann and Norwood 1998","0-1 week old","Dechlorinated Burlington city tap water, hardness 130 mg/L, alkalinity 90 mg/L, pH 7.9-8.6, described in Borgmann et al 1998","","","","LC values reported but nature of response curve not reported","","","measured and reported for sediment expsoures but not for water only",130,90,"",">6.6 mg/L","23°C","assumed that in water-only exposures controls analysed just as they were in sediment spiked experiments"]
["Category","Freshwater/metal/non- plant","Paper and data unique identifier(eg. 1-1,10-150)","172-2"]
["Scores",10,5,5,5,5,5,2,5,5,0,4,0,0,4,0,0,1,1,0,3,1,3,64,0.64,""]
["Answers","28 days","","LC",25,"","duplicate","Method - Borgmann and Norwood 1998","0-1 week old","Dechlorinated Burlington city tap water, hardness 130 mg/L, alkalinity 90 mg/L, pH 7.9-8.6, described in Borgmann et al 1998","","","","LC values reported but nature of response curve not reported","","","measured and reported for sediment expsoures but not for water only",130,90,"",">6.6 mg/L","23°C","assumed that in water-only exposures controls analysed just as they were in sediment spiked experiments"]
["Category","Freshwater/metal/non- plant","Paper and data unique identifier(eg. 1-1,10-150)","173-1"]
["Scores",10,5,5,5,5,5,0,5,5,4,2,0,0,4,4,1,1,0,0,0,1,0,62,0.62,""]
["Answers","21 d","survival","LC",50,"","5 replicates","","<48h old neonates","Lake Ijssel water filtered (25 µm) and uv treated","semi-static, renewed 3x per week","AEM metal analysis, using AAS","","","","95% CLs",8.1,225,"","","",20,"Not stated"]
["Category","Freshwater/metal/non- plant","Paper and data unique identifier(eg. 1-1,10-150)","173-2"]
["Scores",10,5,5,5,5,5,0,5,5,4,2,0,0,4,4,1,1,0,0,0,1,0,62,0.62,""]
["Answers","21 d","survival","LOEC","p<0.01","","5 replicates","","<48h old neonates","Lake Ijssel water filtered (25 µm) and uv treated","semi-static, renewed 3x per week","AEM metal analysis, using AAS","","","","p<0.01",8.1,225,"","","",20,"Not stated"]
["Category","Freshwater/metal/non- plant","Paper and data unique identifier(eg. 1-1,10-150)","173-3"]
["Scores",10,5,5,5,5,5,0,5,5,4,2,0,0,4,4,1,1,0,0,0,1,0,62,0.62,""]
["Answers","21 d","survival","LOEC","p<0.01","","5 replicates","","<48h old neonates","Lake Ijssel water filtered (25 µm) and uv treated","semi-static, renewed 3x per week","AEM metal analysis, using AAS","","","","p<0.01",8.1,225,"","","",20,"Not stated"]
["Category","Freshwater/metal/non- plant","Paper and data unique identifier(eg. 1-1,10-150)","173-4"]
["Scores",10,5,5,5,5,5,0,5,5,4,2,0,0,4,4,1,1,0,0,0,1,0,62,0.62,""]
["Answers","21 d","population growth (no. of animals counted 3x per week from initial 20 individuals of various ages)","EC",50,"","4 replicates","","range of ages, exponentially growing population","Lake Ijssel water filtered (25 µm) and uv treated","flow through system","AEM metal analysis, using AAS","","","","95% CLs",8.1,225,"","","",20,"Not stated"]
["Category","Freshwater/metal/non- plant","Paper and data unique identifier(eg. 1-1,10-150)","173-5"]
["Scores",10,5,5,5,5,5,0,5,5,4,2,0,0,4,4,1,1,0,0,0,1,0,62,0.62,""]
["Answers","21 d","population growth (no. of animals counted 3x per week from initial 20 individuals of various ages)","EC",10,"","4 replicates","","range of ages, exponentially growing population","Lake Ijssel water filtered (25 µm) and uv treated","flow through system","AEM metal analysis, using AAS","","","","95% CLs",8.1,225,"","","",20,"Not stated"]
["Category","Freshwater/metal/non- plant","Paper and data unique identifier(eg. 1-1,10-150)","174-1"]
["Scores",10,10,5,5,5,5,5,5,5,4,4,0,4,4,0,3,3,0,3,3,1,3,87,0.87,""]
["Answers","7 d","Survival, defined as immobility after gentle prodding with a disposable pipet (i.e., the organism remained immobile after stimulation that would cause an avoidance response in a live organism). \n","NOEC","","","10 replicates","acceptability for water quality met and also inferred acceptability criteria for USEPA methods","<24h old neonates","USEPA moderatly hard water with Ca and Mg adjusted for hardness","semi-static (daily renewal)","measured three times","","","","significance level not stated",7.66,50,"","1.3 mg/L","8.37 mg/L","25-26°C","Controls analysed. >97% purity reagent used."]
["Category","Freshwater/metal/non- plant","Paper and data unique identifier(eg. 1-1,10-150)","174-2"]
["Scores",10,10,5,5,5,5,5,5,5,4,4,0,4,4,0,3,3,0,3,3,1,3,87,0.87,""]
["Answers","7 d","Survival, defined as immobility after gentle prodding with a disposable pipet (i.e., the organism remained immobile after stimulation that would cause an avoidance response in a live organism). \n","LOEC","","","10 replicates","acceptability for water quality met and also inferred acceptability criteria for USEPA methods","<24h old neonates","USEPA moderatly hard water with Ca and Mg adjusted for hardness","semi-static (daily renewal)","measured three times","","","","significance level not stated",7.66,50,"","1.3 mg/L","8.37 mg/L","25-26°C","Controls analysed. >97% purity reagent used."]
["Category","Freshwater/metal/non- plant","Paper and data unique identifier(eg. 1-1,10-150)","174-3"]
["Scores",10,10,5,5,5,5,5,5,5,4,4,0,4,4,0,3,3,0,3,3,1,3,87,0.87,""]
["Answers","7 d","Survival, defined as immobility after gentle prodding with a disposable pipet (i.e., the organism remained immobile after stimulation that would cause an avoidance response in a live organism). \n","LC20","","","10 replicates","acceptability for water quality met and also inferred acceptability criteria for USEPA methods","<24h old neonates","USEPA moderatly hard water with Ca and Mg adjusted for hardness","semi-static (daily renewal)","measured three times","","","",null,7.66,50,"","1.3 mg/L","8.37 mg/L","25-26°C","Controls analysed. >97% purity reagent used."]
["Category","Freshwater/metal/non- plant","Paper and data unique identifier(eg. 1-1,10-150)","174-4"]
["Scores",10,5,5,5,5,5,5,5,5,4,4,0,4,4,0,3,3,0,3,3,1,3,82,0.82,""]
["Answers","7 d","","","","","10 replicates","acceptability for water quality met and also inferred acceptability criteria for USEPA methods","<24h old neonates","USEPA moderatly hard water with Ca and Mg adjusted for hardness","semi-static (daily renewal)","measured three times","","","","significance level not stated",7.66,50,"","1.3 mg/L","8.37 mg/L","25-26°C","Controls analysed. >97% purity reagent used."]
["Category","Freshwater/metal/non- plant","Paper and data unique identifier(eg. 1-1,10-150)","174-5"]
["Scores",10,5,5,5,5,5,5,5,5,4,4,0,4,4,0,3,3,0,3,3,1,3,82,0.82,""]
["Answers","7 d","","","","","10 replicates","acceptability for water quality met and also inferred acceptability criteria for USEPA methods","<24h old neonates","USEPA moderatly hard water with Ca and Mg adjusted for hardness","semi-static (daily renewal)","measured three times","","","","significance level not stated",7.66,50,"","1.3 mg/L","8.37 mg/L","25-26°C","Controls analysed. >97% purity reagent used."]
["Category","Freshwater/metal/non- plant","Paper and data unique identifier(eg. 1-1,10-150)","174-6"]
["Scores",10,5,5,5,5,5,5,5,5,4,4,0,4,4,0,3,3,0,3,3,1,3,87,0.87,""]
["Answers","7 d","","","","","10 replicates","acceptability for water quality met and also inferred acceptability criteria for USEPA methods","<24h old neonates","USEPA moderatly hard water with Ca and Mg adjusted for hardness","semi-static (daily renewal)","measured three times","","","",null,7.66,50,"","1.3 mg/L","8.37 mg/L","25-26°C","Controls analysed. >97% purity reagent used."]
["Category","Freshwater/metal/non- plant","Paper and data unique identifier(eg. 1-1,10-150)","174-7"]
["Scores",10,10,5,5,5,5,5,5,5,4,4,0,4,4,0,3,3,0,3,3,1,3,87,0.87,""]
["Answers","7 d","Survival, defined as immobility after gentle prodding with a disposable pipet (i.e., the organism remained immobile after stimulation that would cause an avoidance response in a live organism). ","","","","10 replicates","acceptability for water quality met and also inferred acceptability criteria for USEPA methods","<24h old neonates","USEPA moderatly hard water with Ca and Mg adjusted for hardness","semi-static (daily renewal)","measured three times","","","","significance level not stated",7.7,113,"","1.3 mg/L","8.34 mg/L","25-26°C","Controls analysed. >97% purity reagent used."]
["Category","Freshwater/metal/non- plant","Paper and data unique identifier(eg. 1-1,10-150)","174-8"]
["Scores",10,10,5,5,5,5,5,5,5,4,4,0,4,4,0,3,3,0,3,3,1,3,87,0.87,""]
["Answers","7 d","Survival, defined as immobility after gentle prodding with a disposable pipet (i.e., the organism remained immobile after stimulation that would cause an avoidance response in a live organism). ","","","","10 replicates","acceptability for water quality met and also inferred acceptability criteria for USEPA methods","<24h old neonates","USEPA moderatly hard water with Ca and Mg adjusted for hardness","semi-static (daily renewal)","measured three times","","","","significance level not stated",7.7,113,"","1.3 mg/L","8.34 mg/L","25-26°C","Controls analysed. >97% purity reagent used."]
["Category","Freshwater/metal/non- plant","Paper and data unique identifier(eg. 1-1,10-150)","174-9"]
["Scores",10,10,5,5,5,5,5,5,5,4,4,0,4,4,4,3,3,0,3,3,1,3,91,0.91,""]
["Answers","7 d","Survival, defined as immobility after gentle prodding with a disposable pipet (i.e., the organism remained immobile after stimulation that would cause an avoidance response in a live organism). ","","","","10 replicates","acceptability for water quality met and also inferred acceptability criteria for USEPA methods","<24h old neonates","USEPA moderatly hard water with Ca and Mg adjusted for hardness","semi-static (daily renewal)","measured three times","","","","95% Cls ",7.7,113,"","1.3 mg/L","8.34 mg/L","25-26°C","Controls analysed. >97% purity reagent used."]
["Category","Freshwater/metal/non- plant","Paper and data unique identifier(eg. 1-1,10-150)","174-10"]
["Scores",10,5,5,5,5,5,5,5,5,4,4,0,4,4,0,3,3,0,3,3,1,3,82,0.82,""]
["Answers","7 d","","","","","10 replicates","acceptability for water quality met and also inferred acceptability criteria for USEPA methods","<24h old neonates","USEPA moderatly hard water with Ca and Mg adjusted for hardness","semi-static (daily renewal)","measured three times","","","","significance level not stated",7.7,113,"","1.3 mg/L","8.34 mg/L","25-26°C","Controls analysed. >97% purity reagent used."]
["Category","Freshwater/metal/non- plant","Paper and data unique identifier(eg. 1-1,10-150)","174-11"]
["Scores",10,5,5,5,5,5,5,5,5,4,4,0,4,4,0,3,3,0,3,3,1,3,82,0.82,""]
["Answers","7 d","","","","","10 replicates","acceptability for water quality met and also inferred acceptability criteria for USEPA methods","<24h old neonates","USEPA moderatly hard water with Ca and Mg adjusted for hardness","semi-static (daily renewal)","measured three times","","","","significance level not stated",7.7,113,"","1.3 mg/L","8.34 mg/L","25-26°C","Controls analysed. >97% purity reagent used."]
["Category","Freshwater/metal/non- plant","Paper and data unique identifier(eg. 1-1,10-150)","174-12"]
["Scores",10,5,5,5,5,5,5,5,5,4,4,0,4,4,4,3,3,0,3,3,1,3,85,0.85,""]
["Answers","7 d","","","","","10 replicates","acceptability for water quality met and also inferred acceptability criteria for USEPA methods","<24h old neonates","USEPA moderatly hard water with Ca and Mg adjusted for hardness","semi-static (daily renewal)","measured three times","","","","95% Cls ",7.7,113,"","1.3 mg/L","8.34 mg/L","25-26°C","Controls analysed. >97% purity reagent used."]
["Category","Freshwater/metal/non- plant","Paper and data unique identifier(eg. 1-1,10-150)","174-13"]
["Scores",10,10,5,5,5,5,5,5,5,4,4,0,4,4,0,3,3,0,3,3,1,3,87,0.87,""]
["Answers","7 d","Survival, defined as immobility after gentle prodding with a disposable pipet (i.e., the organism remained immobile after stimulation that would cause an avoidance response in a live organism). ","","","","10 replicates","acceptability for water quality met and also inferred acceptability criteria for USEPA methods","<24h old neonates","USEPA moderatly hard water with Ca and Mg adjusted for hardness","semi-static (daily renewal)","measured three times","","","","significance level not stated",7.61,161,"","1.3 mg/L","8.44 mg/L","25-26°C","Controls analysed. >97% purity reagent used."]
["Category","Freshwater/metal/non- plant","Paper and data unique identifier(eg. 1-1,10-150)","174-14"]
["Scores",10,10,5,5,5,5,5,5,5,4,4,0,4,4,0,3,3,0,3,3,1,3,87,0.87,""]
["Answers","7 d","Survival, defined as immobility after gentle prodding with a disposable pipet (i.e., the organism remained immobile after stimulation that would cause an avoidance response in a live organism). ","","","","10 replicates","acceptability for water quality met and also inferred acceptability criteria for USEPA methods","<24h old neonates","USEPA moderatly hard water with Ca and Mg adjusted for hardness","semi-static (daily renewal)","measured three times","","","","significance level not stated",7.61,161,"","1.3 mg/L","8.44 mg/L","25-26°C","Controls analysed. >97% purity reagent used."]
["Category","Freshwater/metal/non- plant","Paper and data unique identifier(eg. 1-1,10-150)","174-15"]
["Scores",10,10,5,5,5,5,5,5,5,4,4,0,4,4,4,3,3,0,3,3,1,3,91,0.91,""]
["Answers","7 d","Survival, defined as immobility after gentle prodding with a disposable pipet (i.e., the organism remained immobile after stimulation that would cause an avoidance response in a live organism). ","","","","10 replicates","acceptability for water quality met and also inferred acceptability criteria for USEPA methods","<24h old neonates","USEPA moderatly hard water with Ca and Mg adjusted for hardness","semi-static (daily renewal)","measured three times","","","","95% Cls ",7.61,161,"","1.3 mg/L","8.44 mg/L","25-26°C","Controls analysed. >97% purity reagent used."]
["Category","Freshwater/metal/non- plant","Paper and data unique identifier(eg. 1-1,10-150)","174-16"]
["Scores",10,5,5,5,5,5,5,5,5,4,4,0,4,4,0,3,3,0,3,3,1,3,82,0.82,""]
["Answers","7 d","","","","","10 replicates","acceptability for water quality met and also inferred acceptability criteria for USEPA methods","<24h old neonates","USEPA moderatly hard water with Ca and Mg adjusted for hardness","semi-static (daily renewal)","measured three times","","","","significance level not stated",7.61,161,"","1.3 mg/L","8.44 mg/L","25-26°C","Controls analysed. >97% purity reagent used."]
["Category","Freshwater/metal/non- plant","Paper and data unique identifier(eg. 1-1,10-150)","174-17"]
["Scores",10,5,5,5,5,5,5,5,5,4,4,0,4,4,0,3,3,0,3,3,1,3,82,0.82,""]
["Answers","7 d","","","","","10 replicates","acceptability for water quality met and also inferred acceptability criteria for USEPA methods","<24h old neonates","USEPA moderatly hard water with Ca and Mg adjusted for hardness","semi-static (daily renewal)","measured three times","","","","significance level not stated",7.61,161,"","1.3 mg/L","8.44 mg/L","25-26°C","Controls analysed. >97% purity reagent used."]
["Category","Freshwater/metal/non- plant","Paper and data unique identifier(eg. 1-1,10-150)","174-18"]
["Scores",10,5,5,5,5,5,5,5,5,4,4,0,4,4,4,3,3,0,3,3,1,3,85,0.85,""]
["Answers","7 d","","","","","10 replicates","acceptability for water quality met and also inferred acceptability criteria for USEPA methods","<24h old neonates","USEPA moderatly hard water with Ca and Mg adjusted for hardness","semi-static (daily renewal)","measured three times","","","","95% Cls ",7.61,161,"","1.3 mg/L","8.44 mg/L","25-26°C","Controls analysed. >97% purity reagent used."]
["Category","Freshwater/metal/non- plant","Paper and data unique identifier(eg. 1-1,10-150)","174-19"]
["Scores",10,10,5,5,5,5,5,5,5,4,4,0,4,4,0,3,3,0,3,3,1,3,87,0.87,""]
["Answers","7 d","Survival, defined as immobility after gentle prodding with a disposable pipet (i.e., the organism remained immobile after stimulation that would cause an avoidance response in a live organism). ","","","","10 replicates","acceptability for water quality met and also inferred acceptability criteria for USEPA methods","<24h old neonates","USEPA moderatly hard water with Ca and Mg adjusted for hardness","semi-static (daily renewal)","measured three times","","","","significance level not stated",7.8,253,"","1.3 mg/L","8.63 mg/L","25-26°C","Controls analysed. >97% purity reagent used."]
["Category","Freshwater/metal/non- plant","Paper and data unique identifier(eg. 1-1,10-150)","174-20"]
["Scores",10,10,5,5,5,5,5,5,5,4,4,0,4,4,0,3,3,0,3,3,1,3,87,0.87,""]
["Answers","7 d","Survival, defined as immobility after gentle prodding with a disposable pipet (i.e., the organism remained immobile after stimulation that would cause an avoidance response in a live organism). ","","","","10 replicates","acceptability for water quality met and also inferred acceptability criteria for USEPA methods","<24h old neonates","USEPA moderatly hard water with Ca and Mg adjusted for hardness","semi-static (daily renewal)","measured three times","","","","significance level not stated",7.8,253,"","1.3 mg/L","8.63 mg/L","25-26°C","Controls analysed. >97% purity reagent used."]
["Category","Freshwater/metal/non- plant","Paper and data unique identifier(eg. 1-1,10-150)","174-21"]
["Scores",10,10,5,5,5,5,5,5,5,4,4,0,4,4,4,3,3,0,3,3,1,3,91,0.91,""]
["Answers","7 d","Survival, defined as immobility after gentle prodding with a disposable pipet (i.e., the organism remained immobile after stimulation that would cause an avoidance response in a live organism). ","","","","10 replicates","acceptability for water quality met and also inferred acceptability criteria for USEPA methods","<24h old neonates","USEPA moderatly hard water with Ca and Mg adjusted for hardness","semi-static (daily renewal)","measured three times","","","","95% Cls ",7.8,253,"","1.3 mg/L","8.63 mg/L","25-26°C","Controls analysed. >97% purity reagent used."]
["Category","Freshwater/metal/non- plant","Paper and data unique identifier(eg. 1-1,10-150)","174-22"]
["Scores",10,5,5,5,5,5,5,5,5,4,4,0,4,4,0,3,3,0,3,3,1,3,82,0.82,""]
["Answers","7 d","","","","","10 replicates","acceptability for water quality met and also inferred acceptability criteria for USEPA methods","<24h old neonates","USEPA moderatly hard water with Ca and Mg adjusted for hardness","semi-static (daily renewal)","measured three times","","","","significance level not stated",7.8,253,"","1.3 mg/L","8.63 mg/L","25-26°C","Controls analysed. >97% purity reagent used."]
["Category","Freshwater/metal/non- plant","Paper and data unique identifier(eg. 1-1,10-150)","174-23"]
["Scores",10,5,5,5,5,5,5,5,5,4,4,0,4,4,0,3,3,0,3,3,1,3,82,0.82,""]
["Answers","7 d","","","","","10 replicates","acceptability for water quality met and also inferred acceptability criteria for USEPA methods","<24h old neonates","USEPA moderatly hard water with Ca and Mg adjusted for hardness","semi-static (daily renewal)","measured three times","","","","significance level not stated",7.8,253,"","1.3 mg/L","8.63 mg/L","25-26°C","Controls analysed. >97% purity reagent used."]
["Category","Freshwater/metal/non- plant","Paper and data unique identifier(eg. 1-1,10-150)","174-24"]
["Scores",10,5,5,5,5,5,5,5,5,4,4,0,4,4,4,3,3,0,3,3,1,3,85,0.85,""]
["Answers","7 d","","","","","10 replicates","acceptability for water quality met and also inferred acceptability criteria for USEPA methods","<24h old neonates","USEPA moderatly hard water with Ca and Mg adjusted for hardness","semi-static (daily renewal)","measured three times","","","","95% Cls ",7.8,253,"","1.3 mg/L","8.63 mg/L","25-26°C","Controls analysed. >97% purity reagent used."]
["Category","Freshwater/metal/non- plant","Paper and data unique identifier(eg. 1-1,10-150)","174-25"]
["Scores",10,10,5,5,5,5,5,5,5,4,2,0,4,4,0,3,3,3,3,3,1,3,88,0.88,""]
["Answers","14 d","survival - defined as immobility under gentle prodding","","","","10 replicates","acceptability for water quality met and also inferred acceptability criteria for USEPA methods","7-8 d old","natural spring water (hardness 91-98 mg/L)","static renewal using Zumwalt dilutor system","unclear how often measured for Hyallela","","","","no CLs provided","8.0-8.3",91,70,"0.66 mg/L (without food), 1.4 mg/L (with food).","7.2-8.3 mg/L","23°C","Controls analysed. >97% purity reagent used."]
["Category","Freshwater/metal/non- plant","Paper and data unique identifier(eg. 1-1,10-150)","174-26"]
["Scores",10,10,5,5,5,5,5,5,5,4,2,0,4,4,0,3,3,3,3,3,1,3,88,0.88,""]
["Answers","14 d","survival - defined as immobility under gentle prodding","","","","10 replicates","acceptability for water quality met and also inferred acceptability criteria for USEPA methods","7-8 d old","natural spring water (hardness 91-98 mg/L)","static renewal using Zumwalt dilutor system","unclear how often measured for Hyallela","","","","sig level not provided","8.0-8.3",91,70,"0.66 mg/L (without food), 1.4 mg/L (with food).","7.2-8.3 mg/L","23°C","Controls analysed. >97% purity reagent used."]
["Category","Freshwater/metal/non- plant","Paper and data unique identifier(eg. 1-1,10-150)","174-27"]
["Scores",10,10,5,5,5,5,5,5,5,4,2,0,4,4,0,3,3,3,3,3,1,3,88,0.88,""]
["Answers","14 d","survival - defined as immobility under gentle prodding","","","","10 replicates","acceptability for water quality met and also inferred acceptability criteria for USEPA methods","7-8 d old","natural spring water (hardness 91-98 mg/L)","static renewal using Zumwalt dilutor system","unclear how often measured for Hyallela","","","","sig level not provided","8.0-8.3",91,70,"0.66 mg/L (without food), 1.4 mg/L (with food).","7.2-8.3 mg/L","23°C","Controls analysed. >97% purity reagent used."]
["Category","Freshwater/metal/non- plant","Paper and data unique identifier(eg. 1-1,10-150)","176-1"]
["Scores",10,5,5,5,0,0,2,0,5,4,4,0,0,4,4,1,3,0,0,0,1,3,56,0.56000000000000005,""]
["Answers","96 h","population growth","EC10","10% effect","In Reithmuller et al. (2003) controls are mentioned","In Reithmuller et al. (2003) 3 reps are stated","Based on the ERISS SOP by Riethmuller et al (2003) which has a lot more detail that was not mentioned in this report","In Reithmuller et al. (2003) the hydra should have one developing bud that looks like a bump","Synthetic  Magela Creek Water (SMCW)","Static renewal (implied by feeding and renewal of solutions)","Mesured in fresh and old solutions were measured","In Reithmuller et al. (2003), a reference toxicant was used","","Cetis software","95% CL = NC-7 µg/L NC= not calculable",6.5,"1.1 mg/L - this is part of a hardness trial for deriving a Ni GV","","","In Reithmuller et al. (2003) DO is measured ","27 oC","Test solutions including controls were analysed for metals. In Reithmuller et al. (2003) accepability criteria are given = physchem and ref tox are within range and >30 healthy hydra in each control rep"]
["Category","Freshwater/metal/non- plant","Paper and data unique identifier(eg. 1-1,10-150)","176-2"]
["Scores",10,5,5,5,0,0,2,0,5,4,4,0,0,4,4,1,3,0,0,0,1,3,56,0.56000000000000005,""]
["Answers","96 h","population growth","EC10","10% effect","In Reithmuller et al. (2003) controls are mentioned","In Reithmuller et al. (2003) 3 reps are stated","Based on the ERISS SOP by Riethmuller et al (2003) which has a lot more detail that was not mentioned in this report","In Reithmuller et al. (2003) the hydra should have one developing bud that looks like a bump","Synthetic  Magela Creek Water (SMCW)","Static renewal (implied by feeding and renewal of solutions)","Mesured in fresh and old solutions were measured","In Reithmuller et al. (2003), a reference toxicant was used","","Cetis software","95% CL = NC-10 µg/L NC= not calculable",6.5,"1.3 mg/L - this is part of a hardness trial for deriving a Ni GV","","","In Reithmuller et al. (2003) DO is measured ","27 oC","Test solutions including controls were analysed for metals. In Reithmuller et al. (2003) accepability criteria are given = physchem and ref tox are within range and >30 healthy hydra in each control rep"]
["Category","Freshwater/metal/non- plant","Paper and data unique identifier(eg. 1-1,10-150)","176-3"]
["Scores",10,5,5,5,0,0,2,0,5,4,4,0,0,4,4,1,3,0,0,0,1,3,56,0.56000000000000005,""]
["Answers","96 h","population growth","EC10","10% effect","In Reithmuller et al. (2003) controls are mentioned","In Reithmuller et al. (2003) 3 reps are stated","Based on the ERISS SOP by Riethmuller et al (2003) which has a lot more detail that was not mentioned in this report","In Reithmuller et al. (2003) the hydra should have one developing bud that looks like a bump","Synthetic  Magela Creek Water (SMCW)","Static renewal (implied by feeding and renewal of solutions)","Mesured in fresh and old solutions were measured","In Reithmuller et al. (2003), a reference toxicant was used","","Cetis software","95% CL = NC-29 µg/L NC= not calculable",6.5,"2.9 mg/L - this is part of a hardness trial for deriving a Ni GV","","","In Reithmuller et al. (2003) DO is measured ","27 oC","Test solutions including controls were analysed for metals. In Reithmuller et al. (2003) accepability criteria are given = physchem and ref tox are within range and >30 healthy hydra in each control rep"]
["Category","Freshwater/metal/non- plant","Paper and data unique identifier(eg. 1-1,10-150)","176-4"]
["Scores",10,5,5,5,0,0,2,0,5,4,4,0,0,4,4,1,3,0,0,0,1,3,56,0.56000000000000005,""]
["Answers","96 h","population growth","EC10","10% effect","In Reithmuller et al. (2003) controls are mentioned","In Reithmuller et al. (2003) 3 reps are stated","Based on the ERISS SOP by Riethmuller et al (2003) which has a lot more detail that was not mentioned in this report","In Reithmuller et al. (2003) the hydra should have one developing bud that looks like a bump","Synthetic  Magela Creek Water (SMCW)","Static renewal (implied by feeding and renewal of solutions)","Mesured in fresh and old solutions were measured","In Reithmuller et al. (2003), a reference toxicant was used","","Cetis software","95% CL = 6-16 µg/L",6.5,"4.6 mg/L - this is part of a hardness trial for deriving a Ni GV","","","In Reithmuller et al. (2003) DO is measured ","27 oC","Test solutions including controls were analysed for metals. In Reithmuller et al. (2003) accepability criteria are given = physchem and ref tox are within range and >30 healthy hydra in each control rep"]
["Category","Freshwater/metal/non- plant","Paper and data unique identifier(eg. 1-1,10-150)","176-5"]
["Scores",10,5,5,5,0,0,2,0,5,4,4,0,0,4,4,1,3,0,0,0,1,3,56,0.56000000000000005,""]
["Answers","96 h","population growth","EC10","10% effect","In Reithmuller et al. (2003) controls are mentioned","In Reithmuller et al. (2003) 3 reps are stated","Based on the ERISS SOP by Riethmuller et al (2003) which has a lot more detail that was not mentioned in this report","In Reithmuller et al. (2003) the hydra should have one developing bud that looks like a bump","Synthetic  Magela Creek Water (SMCW)","Static renewal (implied by feeding and renewal of solutions)","Mesured in fresh and old solutions were measured","In Reithmuller et al. (2003), a reference toxicant was used","","Cetis software","95% CL = nc-49 µg/L nc=not calculable",6.5,"7.2 mg/L - this is part of a hardness trial for deriving a Ni GV","","","In Reithmuller et al. (2003) DO is measured ","27 oC","Test solutions including controls were analysed for metals. In Reithmuller et al. (2003) accepability criteria are given = physchem and ref tox are within range and >30 healthy hydra in each control rep"]
["Category","Freshwater/metal/non- plant","Paper and data unique identifier(eg. 1-1,10-150)","176-6"]
["Scores",10,5,5,5,0,0,2,0,5,4,4,0,0,4,4,1,3,0,0,0,1,3,56,0.56000000000000005,""]
["Answers","96 h","population growth","EC10","10% effect","In Reithmuller et al. (2003) controls are mentioned","In Reithmuller et al. (2003) 3 reps are stated","Based on the ERISS SOP by Riethmuller et al (2003) which has a lot more detail that was not mentioned in this report","In Reithmuller et al. (2003) the hydra should have one developing bud that looks like a bump","Synthetic  Magela Creek Water (SMCW)","Static renewal (implied by feeding and renewal of solutions)","Mesured in fresh and old solutions were measured","In Reithmuller et al. (2003), a reference toxicant was used","","Cetis software","95% CL =11-46 µg/L nc=not calculable",6.5,"21 mg/L - this is part of a hardness trial for deriving a Ni GV","","","In Reithmuller et al. (2003) DO is measured ","27 oC","Test solutions including controls were analysed for metals. In Reithmuller et al. (2003) accepability criteria are given = physchem and ref tox are within range and >30 healthy hydra in each control rep"]
["Category","Freshwater/metal/non- plant","Paper and data unique identifier(eg. 1-1,10-150)","176-7"]
["Scores",10,5,5,5,0,0,2,0,5,4,4,0,0,4,4,1,3,0,0,0,1,3,56,0.56000000000000005,""]
["Answers","96 h","population growth","EC10","10% effect","In Reithmuller et al. (2003) controls are mentioned","In Reithmuller et al. (2003) 3 reps are stated","Based on the ERISS SOP by Riethmuller et al (2003) which has a lot more detail that was not mentioned in this report","In Reithmuller et al. (2003) the hydra should have one developing bud that looks like a bump","Synthetic  Magela Creek Water (SMCW)","Static renewal (implied by feeding and renewal of solutions)","Mesured in fresh and old solutions were measured","In Reithmuller et al. (2003), a reference toxicant was used","","Cetis software","95% CL =nc-120 µg/L nc=not calculable",6.5,"18 mg/L - this is part of a hardness trial for deriving a Ni GV","","","In Reithmuller et al. (2003) DO is measured ","27 oC","Test solutions including controls were analysed for metals. In Reithmuller et al. (2003) accepability criteria are given = physchem and ref tox are within range and >30 healthy hydra in each control rep"]
["Category","Freshwater/metal/non- plant","Paper and data unique identifier(eg. 1-1,10-150)","176-8"]
["Scores",10,5,5,5,0,0,2,0,5,4,4,0,0,4,4,1,3,0,0,0,1,3,56,0.56000000000000005,""]
["Answers","96 h","population growth","EC10","10% effect","In Reithmuller et al. (2003) controls are mentioned","In Reithmuller et al. (2003) 3 reps are stated","Based on the ERISS SOP by Riethmuller et al (2003) which has a lot more detail that was not mentioned in this report","In Reithmuller et al. (2003) the hydra should have one developing bud that looks like a bump","Synthetic  Magela Creek Water (SMCW)","Static renewal (implied by feeding and renewal of solutions)","Mesured in fresh and old solutions were measured","In Reithmuller et al. (2003), a reference toxicant was used","","Cetis software","95% CL =nc-205 µg/L nc=not calculable",6.5,"55 mg/L - this is part of a hardness trial for deriving a Ni GV","","","In Reithmuller et al. (2003) DO is measured ","27 oC","Test solutions including controls were analysed for metals. In Reithmuller et al. (2003) accepability criteria are given = physchem and ref tox are within range and >30 healthy hydra in each control rep"]
["Category","Freshwater/metal/non- plant","Paper and data unique identifier(eg. 1-1,10-150)","177-1"]
["Scores",10,5,5,5,5,5,5,5,5,4,4,4,4,4,4,3,3,3,3,3,1,3,93,0.93,""]
["Answers","12-d","imbalance of hatched embryos","EC10","10% effect","Yes, DMW lab water control and River water control","4 replicates","Cited ESA SOP 126 (ESA, 2013) and USEPA (2002) and required >=80% survival in the controls","<24h fertilised eggs","Woronora River water","Static renewal. Solutions renewed every 48 h","Dissolved Ni measured at beginning, during and end of test on new and old test solutions","Copper reference test","","Toxcalc v5.0.23","95% CL =18-40 µg/L","7.1-7.4","Ca = 2.5 mg/L\nMg = 3.5 mg/L\nBased on Ca and Mg, hardness = 21 mg/L as CaCO3","Total Alkalinity as CaCO3 = 10 mg/L","DOC = 4 mg/L","100-108% saturation","25 +/- oC","Dilution water was analysed for multiple metals"]
["Category","Freshwater/metal/non- plant","Paper and data unique identifier(eg. 1-1,10-150)","177-2"]
["Scores",10,5,5,5,5,5,5,5,5,4,4,4,4,4,4,3,3,3,3,3,1,3,93,0.93,""]
["Answers","12-d","imbalance of hatched embryos","EC10","10% effect","Yes, DMW lab water control and River water control","4 replicates","Cited ESA SOP 126 (ESA, 2013) and USEPA (2002) and required >=80% survival in the controls","<24h fertilised eggs","Magela Creek water","Static renewal. Solutions renewed every 48 h","Dissolved Ni measured at beginning, during and end of test on new and old test solutions","Copper reference test","","Toxcalc v5.0.23","95% CL =2.2 - 41 µg/L",6.3,"Ca = <0.5 mg/L\nMg = <0.5 mg/L\nBased on Ca and Mg, hardness = not calculable","Total Alkalinity as CaCO3 = 8 mg/L","DOC = 3 mg/L","100-103% saturation","25 +/- oC","Dilution water was analysed for multiple metals"]
["Category","Freshwater/metal/non- plant","Paper and data unique identifier(eg. 1-1,10-150)","177-3"]
["Scores",10,5,5,5,5,5,5,5,5,4,4,4,4,4,4,3,3,3,3,3,1,3,93,0.93,""]
["Answers","12-d","imbalance of hatched embryos","EC10","10% effect","Yes, DMW lab water control and River water control","4 replicates","Cited ESA SOP 126 (ESA, 2013) and USEPA (2002) and required >=80% survival in the controls","<24h fertilised eggs","Peechalba water","Static renewal. Solutions renewed every 48 h","Dissolved Ni measured at beginning, during and end of test on new and old test solutions","Copper reference test","","Toxcalc v5.0.23","95% CL =6.3-52 µg/L","7.9-8.10","Ca = 3.1 mg/L\nMg = 2.9 mg/L\nBased on Ca and Mg, hardness = 20 mg/L as CaCO3","Total Alkalinity as CaCO3 = 27 mg/L","DOC = <1 mg/L","98-114% saturation","25 +/- oC","Dilution water was analysed for multiple metals"]
["Category","Freshwater/metal/non- plant","Paper and data unique identifier(eg. 1-1,10-150)","177-4"]
["Scores",10,5,5,5,5,5,5,5,5,4,4,4,4,4,4,3,3,3,3,3,1,3,93,0.93,""]
["Answers","13-d","imbalance of hatched embryos","EC10","10% effect","Yes, DMW lab water control and River water control","4 replicates","Cited ESA SOP 126 (ESA, 2013) and USEPA (2002) and required >=80% survival in the controls","<24h fertilised eggs","Wellington River water","Static renewal. Solutions renewed every 48 h","Dissolved Ni measured at beginning, during and end of test on new and old test solutions","Copper reference test","","Toxcalc v5.0.23","95% CL = 19-126 µg/L","7.7-7.9","Ca = 11 mg/L\nMg = 7.4 mg/L\nBased on Ca and Mg, hardness = 58 mg/L as CaCO3","Total Alkalinity as CaCO3 = 51 mg/L","DOC = 5 mg/L","105-111% saturation","25 +/- oC","Dilution water was analysed for multiple metals"]
["Category","Freshwater/metal/non- plant","Paper and data unique identifier(eg. 1-1,10-150)","177-5"]
["Scores",10,5,5,5,5,5,5,5,5,4,4,4,4,4,4,3,3,3,3,3,1,3,93,0.93,""]
["Answers","12-d","imbalance of hatched embryos","EC10","10% effect","Yes, DMW lab water control and River water control","4 replicates","Cited ESA SOP 126 (ESA, 2013) and USEPA (2002) and required >=80% survival in the controls","<24h fertilised eggs","Tea Tree River water","Static renewal. Solutions renewed every 48 h","Dissolved Ni measured at beginning, during and end of test on new and old test solutions","Copper reference test","","Toxcalc v5.0.23","95% CL = 10-60 µg/L","6.9-7.2","Ca = 2.1 mg/L\nMg = 4.7 mg/L\nBased on Ca and Mg, hardness = 25 mg/L as CaCO3","Total Alkalinity as CaCO3 = 14 mg/L","DOC = 10 mg/L","111-113% saturation","25 +/- oC","Dilution water was analysed for multiple metals"]
["Category","Freshwater/metal/non- plant","Paper and data unique identifier(eg. 1-1,10-150)","177-6"]
["Scores",10,5,5,5,5,5,5,5,5,4,4,4,4,4,4,3,3,3,3,3,1,3,93,0.93,""]
["Answers","12-d","imbalance of hatched embryos","EC50","50% effect","Yes, DMW lab water control and River water control","4 replicates","Cited ESA SOP 126 (ESA, 2013) and USEPA (2002) and required >=80% survival in the controls","<24h fertilised eggs","Woronora River water","Static renewal. Solutions renewed every 48 h","Dissolved Ni measured at beginning, during and end of test on new and old test solutions","Copper reference test","","Toxcalc v5.0.23","95% CL = 57-91 µg/L","7.1-7.4","Ca = 2.5 mg/L\nMg = 3.5 mg/L\nBased on Ca and Mg, hardness = 21 mg/L as CaCO3","Total Alkalinity as CaCO3 = 10 mg/L","DOC = 4 mg/L","100-108% saturation","25 +/- oC","Dilution water was analysed for multiple metals"]
["Category","Freshwater/metal/non- plant","Paper and data unique identifier(eg. 1-1,10-150)","177-7"]
["Scores",10,5,5,5,5,5,5,5,5,4,4,4,4,4,4,3,3,3,3,3,1,3,93,0.93,""]
["Answers","12-d","imbalance of hatched embryos","EC50","50% effect","Yes, DMW lab water control and River water control","4 replicates","Cited ESA SOP 126 (ESA, 2013) and USEPA (2002) and required >=80% survival in the controls","<24h fertilised eggs","Magela Creek water","Static renewal. Solutions renewed every 48 h","Dissolved Ni measured at beginning, during and end of test on new and old test solutions","Copper reference test","","Toxcalc v5.0.23","95% CL = 31-49 µg/L",6.3,"Ca = <0.5 mg/L\nMg = <0.5 mg/L\nBased on Ca and Mg, hardness = not calculable","Total Alkalinity as CaCO3 = 8 mg/L","DOC = 3 mg/L","100-103% saturation","25 +/- oC","Dilution water was analysed for multiple metals"]
["Category","Freshwater/metal/non- plant","Paper and data unique identifier(eg. 1-1,10-150)","177-8"]
["Scores",10,5,5,5,5,5,5,5,5,4,4,4,4,4,4,3,3,3,3,3,1,3,93,0.93,""]
["Answers","12-d","imbalance of hatched embryos","EC50","50% effect","Yes, DMW lab water control and River water control","4 replicates","Cited ESA SOP 126 (ESA, 2013) and USEPA (2002) and required >=80% survival in the controls","<24h fertilised eggs","Peechalba water","Static renewal. Solutions renewed every 48 h","Dissolved Ni measured at beginning, during and end of test on new and old test solutions","Copper reference test","","Toxcalc v5.0.23","95% CL = 58-140 µg/L","7.9-8.10","Ca = 3.1 mg/L\nMg = 2.9 mg/L\nBased on Ca and Mg, hardness = 20 mg/L as CaCO3","Total Alkalinity as CaCO3 = 27 mg/L","DOC = <1 mg/L","98-114% saturation","25 +/- oC","Dilution water was analysed for multiple metals"]
["Category","Freshwater/metal/non- plant","Paper and data unique identifier(eg. 1-1,10-150)","177-9"]
["Scores",10,5,5,5,5,5,5,5,5,4,4,4,4,4,4,3,3,3,3,3,1,3,93,0.93,""]
["Answers","13-d","imbalance of hatched embryos","EC50","50% effect","Yes, DMW lab water control and River water control","4 replicates","Cited ESA SOP 126 (ESA, 2013) and USEPA (2002) and required >=80% survival in the controls","<24h fertilised eggs","Wellington water","Static renewal. Solutions renewed every 48 h","Dissolved Ni measured at beginning, during and end of test on new and old test solutions","Copper reference test","","Toxcalc v5.0.23","95% CL = 106-255 µg/L","7.7-7.9","Ca = 11 mg/L\nMg = 7.4 mg/L\nBased on Ca and Mg, hardness = 58 mg/L as CaCO3","Total Alkalinity as CaCO3 = 51 mg/L","DOC = 5 mg/L","105-111% saturation","25 +/- oC","Dilution water was analysed for multiple metals"]
["Category","Freshwater/metal/non- plant","Paper and data unique identifier(eg. 1-1,10-150)","177-10"]
["Scores",10,5,5,5,5,5,5,5,5,4,4,4,4,4,4,3,3,3,3,3,1,3,93,0.93,""]
["Answers","12-d","imbalance of hatched embryos","EC50","50% effect","Yes, DMW lab water control and River water control","4 replicates","Cited ESA SOP 126 (ESA, 2013) and USEPA (2002) and required >=80% survival in the controls","<24h fertilised eggs","Tea Tree water","Static renewal. Solutions renewed every 48 h","Dissolved Ni measured at beginning, during and end of test on new and old test solutions","Copper reference test","","Toxcalc v5.0.23","95% CL = 70-164 µg/L","6.9-7.2","Ca = 2.1 mg/L\nMg = 4.7 mg/L\nBased on Ca and Mg, hardness = 25 mg/L as CaCO3","Total Alkalinity as CaCO3 = 14 mg/L","DOC = 10 mg/L","111-113% saturation","25 +/- oC","Dilution water was analysed for multiple metals"]
["Category","Freshwater/metal/non- plant","Paper and data unique identifier(eg. 1-1,10-150)","177-11"]
["Scores",10,5,5,5,5,5,5,5,5,4,4,4,4,4,4,3,3,3,3,3,1,3,93,0.93,""]
["Answers","12-d","imbalance of hatched embryos","NOEC","30% effect","Yes, DMW lab water control and River water control","4 replicates","Cited ESA SOP 126 (ESA, 2013) and USEPA (2002) and required >=80% survival in the controls","<24h fertilised eggs","Woronora River water","Static renewal. Solutions renewed every 48 h","Dissolved Ni measured at beginning, during and end of test on new and old test solutions","Copper reference test","","Toxcalc v5.0.23","P<0.05","7.1-7.4","Ca = 2.5 mg/L\nMg = 3.5 mg/L\nBased on Ca and Mg, hardness = 21 mg/L as CaCO3","Total Alkalinity as CaCO3 = 10 mg/L","DOC = 4 mg/L","100-108% saturation","25 +/- oC","Dilution water was analysed for multiple metals"]
["Category","Freshwater/metal/non- plant","Paper and data unique identifier(eg. 1-1,10-150)","177-12"]
["Scores",10,5,5,5,5,5,5,5,5,4,4,4,4,4,4,3,3,3,3,3,1,3,93,0.93,""]
["Answers","12-d","imbalance of hatched embryos","NOEC","53% effect","Yes, DMW lab water control and River water control","4 replicates","Cited ESA SOP 126 (ESA, 2013) and USEPA (2002) and required >=80% survival in the controls","<24h fertilised eggs","Magela Creek water","Static renewal. Solutions renewed every 48 h","Dissolved Ni measured at beginning, during and end of test on new and old test solutions","Copper reference test","","Toxcalc v5.0.23","P<0.05",6.3,"Ca = <0.5 mg/L\nMg = <0.5 mg/L\nBased on Ca and Mg, hardness = not calculable","Total Alkalinity as CaCO3 = 8 mg/L","DOC = 3 mg/L","100-103% saturation","25 +/- oC","Dilution water was analysed for multiple metals"]
["Category","Freshwater/metal/non- plant","Paper and data unique identifier(eg. 1-1,10-150)","177-13"]
["Scores",10,5,5,5,5,5,5,5,5,4,4,4,4,4,4,3,3,3,3,3,1,3,93,0.93,""]
["Answers","12-d","imbalance of hatched embryos","NOEC","33% effect","Yes, DMW lab water control and River water control","4 replicates","Cited ESA SOP 126 (ESA, 2013) and USEPA (2002) and required >=80% survival in the controls","<24h fertilised eggs","Peechalba water","Static renewal. Solutions renewed every 48 h","Dissolved Ni measured at beginning, during and end of test on new and old test solutions","Copper reference test","","Toxcalc v5.0.23","P<0.05","7.9-8.10","Ca = 3.1 mg/L\nMg = 2.9 mg/L\nBased on Ca and Mg, hardness = 20 mg/L as CaCO3","Total Alkalinity as CaCO3 = 27 mg/L","DOC = <1 mg/L","98-114% saturation","25 +/- oC","Dilution water was analysed for multiple metals"]
["Category","Freshwater/metal/non- plant","Paper and data unique identifier(eg. 1-1,10-150)","177-14"]
["Scores",10,5,5,5,5,5,5,5,5,4,4,4,4,4,4,3,3,3,3,3,1,3,93,0.93,""]
["Answers","13-d","imbalance of hatched embryos","NOEC","75% effect","Yes, DMW lab water control and River water control","4 replicates","Cited ESA SOP 126 (ESA, 2013) and USEPA (2002) and required >=80% survival in the controls","<24h fertilised eggs","Wellington water","Static renewal. Solutions renewed every 48 h","Dissolved Ni measured at beginning, during and end of test on new and old test solutions","Copper reference test","","Toxcalc v5.0.23","P<0.05","7.7-7.9","Ca = 11 mg/L\nMg = 7.4 mg/L\nBased on Ca and Mg, hardness = 58 mg/L as CaCO3","Total Alkalinity as CaCO3 = 51 mg/L","DOC = 5 mg/L","105-111% saturation","25 +/- oC","Dilution water was analysed for multiple metals"]
["Category","Freshwater/metal/non- plant","Paper and data unique identifier(eg. 1-1,10-150)","177-15"]
["Scores",10,5,5,5,5,5,5,5,5,4,4,4,4,4,4,3,3,3,3,3,1,3,93,0.93,""]
["Answers","12-d","imbalance of hatched embryos","NOEC","72% effect","Yes, DMW lab water control and River water control","4 replicates","Cited ESA SOP 126 (ESA, 2013) and USEPA (2002) and required >=80% survival in the controls","<24h fertilised eggs","Tea Tree water","Static renewal. Solutions renewed every 48 h","Dissolved Ni measured at beginning, during and end of test on new and old test solutions","Copper reference test","","Toxcalc v5.0.23","P<0.05","6.9-7.2","Ca = 2.1 mg/L\nMg = 4.7 mg/L\nBased on Ca and Mg, hardness = 25 mg/L as CaCO3","Total Alkalinity as CaCO3 = 14 mg/L","DOC = 10 mg/L","111-113% saturation","25 +/- oC","Dilution water was analysed for multiple metals"]
["Category","Freshwater/metal/non- plant","Paper and data unique identifier(eg. 1-1,10-150)","1-1"]
["Scores",10,5,5,5,5,5,2,5,5,0,4,0,4,4,4,1,1,0,0,0,3,3,71,0.71,""]
["Answers","257 h (10.7 d)","Survival","LC","50%","contrl (no Ni added)","duplicate","control survival was >80%","Age: 1-d old larvae hatched from a control","Springwater","Assumed to be static non-renewal","Measured on Day 1 and 10 (measured values within 1 mg/L of nominal; not clear if measured values were used to caluclate toxicity value)","no ref tox tests","figure presented","probit analysis (Finney, 1974)","95% CL (540–940) ","7.4 (media only)","128 ppm","","","","23–25","control (springwater) measured for Ni"]
["Category","Freshwater/metal/non- plant","Paper and data unique identifier(eg. 1-1,10-150)","2-1"]
["Scores",10,10,5,5,5,0,0,5,0,4,2,0,0,4,4,1,1,0,0,0,1,0,57,0.56999999999999995,""]
["Answers","28 days","survival (grossly deformed (Black, 1977) also defined as lethals)","LC",50,"referece to control-corrected data","Not reported (refer to Birge and Just 1975 for test procedures)","Control-corrected data used","age: fertilised eggs","refered to Birge and Just 1975","static renewal (twice daily)","Measured (unclear how measured results were used)","No ref tox reported","Not reported ","log-probit analysis (Black 1977)","95% CL (40–60)","7.2–7.8","93–105 ppm","Not reported (refered to Birge and Just 1975 for procedure)","Not reported (refered to Birge and Just 1975 for procedure)","Not reported (refered to Birge and Just 1975 for procedure)","12–13","Not reported (metals analysed but unclear how this data was used)"]
["Category","Freshwater/metal/non- plant","Paper and data unique identifier(eg. 1-1,10-150)","2-1"]
["Scores",10,10,5,5,5,0,0,5,0,4,2,0,0,4,4,1,1,0,0,0,1,0,57,0.56999999999999995,""]
["Answers","28 days","survival (grossly deformed (Black, 1977) also defined as lethals)","LC",1,"referece to control-corrected data","Not reported (refer to Birge and Just 1975 for test procedures)","Control-corrected data used","age: fertilised eggs","refered to Birge and Just 1975","static renewal (twice daily)","Measured (unclear how measured results were used)","No ref tox reported","Not reported ","log-probit analysis (Black 1977)","95% CL (0.2–1.2)","7.2–7.8","93–105 ppm","Not reported (refered to Birge and Just 1975 for procedure)","Not reported (refered to Birge and Just 1975 for procedure)","Not reported (refered to Birge and Just 1975 for procedure)","12–13","Not reported (metals analysed but unclear how this data was used)"]
["Category","Freshwater/metal/non- plant","Paper and data unique identifier(eg. 1-1,10-150)","2-3"]
["Scores",10,10,5,5,5,0,0,5,0,4,2,0,0,4,4,1,1,0,0,0,1,0,57,0.56999999999999995,""]
["Answers","8 days","survival (grossly deformed (Black, 1977) also defined as lethals)","LC",50,"referece to control-corrected data","Not reported (refer to Birge and Just 1975 for test procedures)","Control-corrected data used","age: fertilised eggs","refered to Birge and Just 1975","static renewal (twice daily)","Measured (unclear how measured results were used)","No ref tox reported","Not reported ","log-probit analysis (Black 1977)","95% CL (1460–2770)","7.2–7.8","93–105 ppm","Not reported (refered to Birge and Just 1975 for procedure)","Not reported (refered to Birge and Just 1975 for procedure)","Not reported (refered to Birge and Just 1975 for procedure)","19–22","Not reported (metals analysed but unclear how this data was used)"]
["Category","Freshwater/metal/non- plant","Paper and data unique identifier(eg. 1-1,10-150)","2-4"]
["Scores",10,10,5,5,5,0,0,5,0,4,2,0,0,4,4,1,1,0,0,0,1,0,57,0.56999999999999995,""]
["Answers","8 days","survival (grossly deformed (Black, 1977) also defined as lethals)","LC",1,"referece to control-corrected data","Not reported (refer to Birge and Just 1975 for test procedures)","Control-corrected data used","age: fertilised eggs","refered to Birge and Just 1975","static renewal (twice daily)","Measured (unclear how measured results were used)","No ref tox reported","Not reported ","log-probit analysis (Black 1977)","95% CL (3.7–20)","7.2–7.8","93–105 ppm","Not reported (refered to Birge and Just 1975 for procedure)","Not reported (refered to Birge and Just 1975 for procedure)","Not reported (refered to Birge and Just 1975 for procedure)","19–22","Not reported (metals analysed but unclear how this data was used)"]
["Category","Freshwater/metal/non- plant","Paper and data unique identifier(eg. 1-1,10-150)","2-5"]
["Scores",10,10,5,5,5,0,0,5,0,4,2,0,0,4,4,1,1,0,0,0,1,0,57,0.56999999999999995,""]
["Answers","8 days","survival (grossly deformed (Black, 1977) also defined as lethals)","LC",50,"referece to control-corrected data","Not reported (refer to Birge and Just 1975 for test procedures)","Control-corrected data used","age: fertilised eggs","refered to Birge and Just 1975","static renewal (twice daily)","Measured (unclear how measured results were used)","No ref tox reported","Not reported ","log-probit analysis (Black 1977)","95% CL (280–590)","7.2–7.8","93–105 ppm","Not reported (refered to Birge and Just 1975 for procedure)","Not reported (refered to Birge and Just 1975 for procedure)","Not reported (refered to Birge and Just 1975 for procedure)","19–22","Not reported (metals analysed but unclear how this data was used)"]
["Category","Freshwater/metal/non- plant","Paper and data unique identifier(eg. 1-1,10-150)","2-6"]
["Scores",10,10,5,5,5,0,0,5,0,4,2,0,0,4,4,1,1,0,0,0,1,0,57,0.56999999999999995,""]
["Answers","8 days","survival (grossly deformed (Black, 1977) also defined as lethals)","LC",1,"referece to control-corrected data","Not reported (refer to Birge and Just 1975 for test procedures)","Control-corrected data used","age: fertilised eggs","refered to Birge and Just 1975","static renewal (twice daily)","Measured (unclear how measured results were used)","No ref tox reported","Not reported ","log-probit analysis (Black 1977)","95% CL (4.2–32)","7.2–7.8","93–105 ppm","Not reported (refered to Birge and Just 1975 for procedure)","Not reported (refered to Birge and Just 1975 for procedure)","Not reported (refered to Birge and Just 1975 for procedure)","19–22","Not reported (metals analysed but unclear how this data was used)"]
["Category","Freshwater/metal/non- plant","Paper and data unique identifier(eg. 1-1,10-150)","3-1"]
["Scores",10,10,5,5,5,5,0,5,5,4,0,0,4,0,0,3,3,3,0,3,1,3,74,0.74,"The highest possible grade for this datum is acceptable."]
["Answers","3 weeks (21 d)","Reproduction (number of young produced each week over 3 weeks)","reproductive impairement (EC)","16%","no added Ni ","four replicates/treatment","procedure described followed standard protocols for reproductive endpoint. Other highlights: rangefinder tests carried out to determine apprpriate concentration range; 3–7 toxicity tests were carried out with data from all combined to derived toxicity values","neonates 12+/-12 h ","Lake Superior water (#20 mesh)","static, renewal (once per week)","control water was measured","no ref tox tests","at least three partial effect concentrations; some small stimulation at low effects for some metals","Method unclear: Sprague (1969)","no confidence limits reported for the EC16","measured and stated in control water (7.4–8.2); testments didn't change the pH by more than 0.3 units","44–53 mg CaCO3/L","41–50 mg CaCO3/L","not reported","Near saturation; ~9 mg/L (immediately prior to start of photoperiod)","18 (+/- 1)","ACS reagent grade; control water analysed for a suite of metals (including major ions); Ni <0.5 µg/L"]
["Category","Freshwater/metal/non- plant","Paper and data unique identifier(eg. 1-1,10-150)","4-5"]
["Scores",10,10,5,5,5,5,5,5,5,4,4,0,4,4,4,3,0,0,0,0,1,3,82,0.82,""]
["Answers","21 d","Reproduction (number of young produced per adult)","EC","EC10","no added Ni ","duplicate tanks, each with 5 adult daphnids (i.e. 10 daphnids)","Criteria evaluated against OECD method. Supp Data provided criteria and ","neonates <24 h old","modified M4-medium (details provided in Supp Data)","static, renewal (days 4, 7, 10, 13 & 17)","Measured twice (beginning and end of the bioassay) as a minimum","no ref tox tests","plots provided in Supp Data","STATISTICA 7 (Stat Soft)","95% CL (36–331)","measured daily (and pH adjusted if necessary)","Media composition was provided including Mg and Ca concentrations but detail provided in Supp Data on media composition contradict the Mg concentrations quoted. Hence data for hardness/Mg is unreliable","Media composition was provided (not clear if these were measured or not)3/L","inconclusive: states DOC was measured, but no measurements for D. magna tests","Solutions aerated but DO not measured",20," reagent grade"]
["Category","Freshwater/metal/non- plant","Paper and data unique identifier(eg. 1-1,10-150)","4-6"]
["Scores",10,10,5,5,5,5,5,5,5,4,4,0,4,4,4,3,0,0,0,0,1,3,82,0.82,""]
["Answers","21 d","Reproduction (number of young produced per adult)","EC","EC10","no added Ni ","duplicate tanks, each with 5 adult daphnids (i.e. 10 daphnids)","Criteria evaluated against OECD method. Supp Data provided criteria and ","neonates <24 h old","modified M4-medium (details provided in Supp Data)","static, renewal (days 4, 7, 10, 13 & 17)","Measured twice (beginning and end of the bioassay) as a minimum","no ref tox tests","plots provided in Supp Data","STATISTICA 7 (Stat Soft)","95% CL (39–228)","measured daily (and pH adjusted if necessary)","Media composition was provided including Mg and Ca concentrations but detail provided in Supp Data on media composition contradict the Mg concentrations quoted. Hence data for hardness/Mg is unreliable","Media composition was provided (not clear if these were measured or not)","inconclusive: states DOC was measured, but no measurements for D. magna tests","Solutions aerated but DO not measured",20," reagent grade"]
["Category","Freshwater/metal/non- plant","Paper and data unique identifier(eg. 1-1,10-150)","4-7"]
["Scores",10,10,5,5,5,5,5,5,5,0,4,0,4,4,4,3,0,0,0,0,1,3,78,0.78,""]
["Answers","48 h","Reproduction (number of rotifers)","EC","EC10","no added Ni ","10 replicates (1 rotifer per replicate)","Criteria evaluated against Cleseri et al 1998. Supp Data provided criteria and ","neonates <2 h old","modified USEPA medium","inferred to be static non-renewal","Measured twice (beginning and end of the bioassay) as a minimum","no ref tox tests","plots provided in Supp Data (hormesis was observed for this test)","STATISTICA 7 (Stat Soft)","95% CL (1244–2194)","8.12 SD=0.05 measured daily (and pH adjusted if necessary)","Media composition was provided including Mg and Ca concentrations but detail provided in Supp Data on media composition contradict the Mg concentrations quoted. Hence data for hardness/Mg is unreliable","Media composition was provided (not clear if these were measured or not)","inconclusive: states DOC was measured, but no measurements for B. calyciflorus tests","not mentioned",25," reagent grade"]
["Category","Freshwater/metal/non- plant","Paper and data unique identifier(eg. 1-1,10-150)","4-8"]
["Scores",10,10,5,5,5,5,5,5,5,0,4,0,4,4,4,3,0,0,0,0,1,3,78,0.78,""]
["Answers","48 h","Reproduction (number of rotifers)","EC","EC10","no added Ni ","10 replicates (1 rotifer per replicate)","Criteria evaluated against Cleseri et al 1998. Supp Data provided criteria and ","neonates <2 h old","modified USEPA medium","inferred to be static non-renewal","Measured twice (beginning and end of the bioassay) as a minimum","no ref tox tests","plots provided in Supp Data (hormesis was observed for this test)","STATISTICA 7 (Stat Soft)","95% CL (990–1219)","8.55 SD=0.18 measured daily (and pH adjusted if necessary)","Media composition was provided including Mg and Ca concentrations but detail provided in Supp Data on media composition contradict the Mg concentrations quoted. Hence data for hardness/Mg is unreliable","Media composition was provided (not clear if these were measured or not)","inconclusive: states DOC was measured, but no measurements for B. calyciflorus tests","not mentioned",25," reagent grade"]
["Category","Freshwater/metal/non- plant","Paper and data unique identifier(eg. 1-1,10-150)","4-9"]
["Scores",10,10,5,5,5,5,0,5,5,4,4,0,4,4,4,3,0,0,0,0,1,3,77,0.77,""]
["Answers","28 d","Growth (shell length)","EC","EC10","no added Ni ","2 tanks, 4 snails (separated) per tank (total 8 snails)","In-house protocol, no reported QA criteria","2-3 days old (accimitising to media, pH0)","composition provided in Supp Data","renewal 3 times per week","Measured twice (beginning and end of the bioassay) as a minimum","no ref tox tests","plots provided in Supp Data","STATISTICA 7 (Stat Soft)","95% CL (8.5–44.7)","8.11 SD=0.04 measured daily (and pH adjusted if necessary)","Media composition was provided including Mg and Ca concentrations but detail provided in Supp Data on media composition contradict the Mg concentrations quoted. Hence data for hardness/Mg is unreliable","Media composition was provided (not clear if these were measured or not)","inconclusive: states DOC was measured, but no measurements for L. stagnalis tests","not mentioned",20," reagent grade"]
["Category","Freshwater/metal/non- plant","Paper and data unique identifier(eg. 1-1,10-150)","4-10"]
["Scores",10,10,5,5,5,5,0,5,5,4,4,0,4,4,4,3,0,0,0,0,1,3,77,0.77,""]
["Answers","28 d","Growth (shell length)","EC","EC10","no added Ni ","2 tanks, 4 snails (separated) per tank (total 8 snails)","In-house protocol, no reported QA criteria","2-3 days old (accimitising to media, pH0)","composition provided in Supp Data","renewal 3 times per week","Measured twice (beginning and end of the bioassay) as a minimum","no ref tox tests","plots provided in Supp Data","STATISTICA 7 (Stat Soft)","95% CL (2.2–9.6)","8.64 SD=0.07 measured daily (and pH adjusted if necessary)","Media composition was provided including Mg and Ca concentrations but detail provided in Supp Data on media composition contradict the Mg concentrations quoted. Hence data for hardness/Mg is unreliable","Media composition was provided (not clear if these were measured or not)","inconclusive: states DOC was measured, but no measurements for L. stagnalis tests","not mentioned",20," reagent grade"]
["Category","Freshwater/metal/non- plant","Paper and data unique identifier(eg. 1-1,10-150)","5-2"]
["Scores",10,10,5,5,5,5,5,5,5,4,4,0,4,4,4,3,1,0,3,0,1,3,86,0.86,""]
["Answers","7 d","Reproduction (number of juveniles)","EC","EC10","no added Ni ","14 reps per Ni concentration, 100 controls","USEPA (2002) protocol, QA crieteria in Supp Data","juveniles (<24 h old)","Natural water from Brisy, Belgium (0.2 µm filtered) (i.e. with OC) with added CaCl2 ","renewal daily","Measured twice (beginning and end of the bioassay) as a minimum","no ref tox tests","plots provided","log-logistic 2 parameter model, STATISTICA (Dell)","95% CL (22–35)","7.4 SD=0.2 measured daily (and pH adjusted if necessary)","Media composition was provided including Mg and Ca measured concentrations. Hence hardness was calcualted as 84 mg CaCO3/L","Media composition was provided for major ions","DOC 7.3 mg/L (SD = 2.8) ","not mentioned (media areated before use in test)",25," reagent grade"]
["Category","Freshwater/metal/non- plant","Paper and data unique identifier(eg. 1-1,10-150)","5-3"]
["Scores",10,10,5,5,5,5,5,5,5,4,4,0,4,4,4,3,1,0,3,0,1,3,86,0.86,""]
["Answers","7 d","Reproduction (number of juveniles)","EC","EC10","no added Ni ","14 reps per Ni concentration, 100 controls","USEPA (2002) protocol, QA crieteria in Supp Data","juveniles (<24 h old)","Natural water from Brisy, Belgium (0.2 µm filtered) (i.e. with OC) with added CaCl2 ","renewal daily","Measured twice (beginning and end of the bioassay) as a minimum","no ref tox tests","plots provided","log-logistic 2 parameter model, STATISTICA (Dell)","95% CL (5–15)","7.4 SD=0.3 measured daily (and pH adjusted if necessary)","Media composition was provided including Mg and Ca measured concentrations. Hence hardness was calcualted as 88 mg CaCO3/L","Media composition was provided for major ions","DOC 7.2 mg/L (SD = 0.4) ","not mentioned (media areated before use in test)",25," reagent grade"]
["Category","Freshwater/metal/non- plant","Paper and data unique identifier(eg. 1-1,10-150)","6-1"]
["Scores",10,10,5,5,5,5,5,5,5,4,4,0,4,4,4,3,1,0,3,0,1,3,86,0.86,""]
["Answers","7 d","Reproduction (number of juveniles)","EC","EC10","no added Ni ","10 reps per Ni concentration, 45 controls","USEPA (2002) protocol, QA crieteria in Supp Data","juveniles (<24 h old)","Natural water from Brisy, Belgium (0.2 µm filtered) (i.e. with OC) with added CaCl2 and pH 7","renewal daily","Measured twice (beginning and end of the bioassay) as a minimum","no ref tox tests","plots provided","log-logistic 2 parameter model, STATISTICA (Dell) using time weighted average Ni Concs","95% CL (22–45)","7.1 SD=0.1 measured daily (and pH adjusted as renewed daily)","Media composition was provided including Mg and Ca measured concentrations. Hence hardness was calculated as 98 mg CaCO3/L","Media composition was provided for major ions","DOC 5.2 mg/L (SD = 0.9) ","not mentioned (but media areated before use in test)",25," reagent grade"]
["Category","Freshwater/metal/non- plant","Paper and data unique identifier(eg. 1-1,10-150)","6-2"]
["Scores",10,10,5,5,5,5,5,5,5,4,4,0,4,4,4,3,1,0,3,0,1,3,86,0.86,""]
["Answers","7 d","Reproduction (number of juveniles)","EC","EC10","no added Ni ","9–10 reps per Ni concentration, 45 controls","USEPA (2002) protocol, QA crieteria in Supp Data","juveniles (<24 h old)","Natural water from Brisy, Belgium (0.2 µm filtered) (i.e. with OC) with added CaCl2 and pH adjusted to 8","renewal daily","Measured twice (beginning and end of the bioassay) as a minimum","no ref tox tests","plots provided","log-logistic 2 parameter model, STATISTICA (Dell) using time weighted average Ni Concs","95% CL (4.7–9.0)","8.1 SD=0.1 measured daily (and pH adjusted as renewed daily)","Media composition was provided including Mg and Ca measured concentrations. Hence hardness was calculated as 101 mg CaCO3/L","Media composition was provided for major ions","DOC 5.4 mg/L (SD = 0.8) ","not mentioned (but media areated before use in test)",25," reagent grade"]
["Category","Freshwater/metal/non- plant","Paper and data unique identifier(eg. 1-1,10-150)","6-3"]
["Scores",10,10,5,5,5,5,5,5,5,4,4,0,4,4,4,3,1,0,3,0,1,3,86,0.86,""]
["Answers","7 d","Reproduction (number of juveniles)","EC","EC10","no added Ni ","9–10 reps per Ni concentration, 38 controls","USEPA (2002) protocol, QA crieteria in Supp Data","juveniles (<24 h old)","Natural water from Brisy, Belgium (0.2 µm filtered) (i.e. with OC) with extra added CaCl2 and pH 7","renewal daily","Measured twice (beginning and end of the bioassay) as a minimum","no ref tox tests","plots provided","log-logistic 2 parameter model, STATISTICA (Dell) using time weighted average Ni Concs","95% CL (8–16)","7.1 SD=0.6 measured daily (and pH adjusted as renewed daily)","Media composition was provided including Mg and Ca measured concentrations. Hence hardness was calculated as 101 mg CaCO3/L","Media composition was provided for major ions","DOC 6.1 mg/L (SD = 1.3) ","not mentioned (but media areated before use in test)",25," reagent grade"]
["Category","Freshwater/metal/non- plant","Paper and data unique identifier(eg. 1-1,10-150)","6-4"]
["Scores",10,10,5,5,5,5,5,5,5,4,4,0,4,4,4,3,1,0,3,0,1,3,86,0.86,""]
["Answers","7 d","Reproduction (number of juveniles)","EC","EC10","no added Ni ","10 reps per Ni concentration, 38 controls","USEPA (2002) protocol, QA crieteria in Supp Data","juveniles (<24 h old)","Natural water from Brisy, Belgium (0.2 µm filtered) (i.e. with OC) with extra added CaCl2 and pH 7","renewal daily","Measured twice (beginning and end of the bioassay) as a minimum","no ref tox tests","plots provided","log-logistic 2 parameter model, STATISTICA (Dell) using time weighted average Ni Concs","95% CL (15–24)","7.2 SD=0.1 measured daily (and pH adjusted as renewed daily)","Media composition was provided including Mg and Ca measured concentrations. Hence hardness was calculated as 206 mg CaCO3/L","Media composition was provided for major ions","DOC 5.9 mg/L (SD = 1.2) ","not mentioned (but media areated before use in test)",25," reagent grade"]
["Category","Freshwater/metal/non- plant","Paper and data unique identifier(eg. 1-1,10-150)","6-5"]
["Scores",10,10,5,5,5,5,5,5,5,4,4,0,4,4,4,3,1,0,3,0,1,3,86,0.86,""]
["Answers","7 d","Reproduction (number of juveniles)","EC","EC10","no added Ni ","8–10 reps per Ni concentration, 45 controls","USEPA (2002) protocol, QA crieteria in Supp Data","juveniles (<24 h old)","Natural water from Brisy, Belgium (0.2 µm filtered) (i.e. with OC) with added CaCl2 and pH 7","renewal daily","Measured twice (beginning and end of the bioassay) as a minimum","no ref tox tests","plots provided","log-logistic 2 parameter model, STATISTICA (Dell) using time weighted average Ni Concs","95% CL (2.7–11)","7.2 SD=0.4 measured daily (and pH adjusted as renewed daily)","Media composition was provided including Mg and Ca measured concentrations. Hence hardness was calculated as 101 mg CaCO3/L","Media composition was provided for major ions","DOC 5.1 mg/L (SD = 0.7) ","not mentioned (but media areated before use in test)",25," reagent grade"]
["Category","Freshwater/metal/non- plant","Paper and data unique identifier(eg. 1-1,10-150)","6-6"]
["Scores",10,10,5,5,5,5,5,5,5,4,4,0,4,4,4,3,1,0,3,0,1,3,86,0.86,""]
["Answers","7 d","Reproduction (number of juveniles)","EC","EC10","no added Ni ","10 reps per Ni concentration, 45 controls","USEPA (2002) protocol, QA crieteria in Supp Data","juveniles (<24 h old)","Natural water from Ankeveen, Netherlands (0.2 µm filtered) (pH 8)","renewal daily","Measured twice (beginning and end of the bioassay) as a minimum","no ref tox tests","plots provided","log-logistic 2 parameter model, STATISTICA (Dell) using time weighted average Ni Concs","95% CL (8–15)","8.0 SD=0.6 measured daily (and pH adjusted as renewed daily)","Media composition was provided including Mg and Ca measured concentrations. Hence hardness was calculated as 162 mg CaCO3/L","Media composition was provided for major ions","DOC 11.2 mg/L (SD = 2.2) ","not mentioned (but media areated before use in test)",25," reagent grade"]
["Category","Freshwater/metal/non- plant","Paper and data unique identifier(eg. 1-1,10-150)","7-1"]
["Scores",0,10,5,5,5,0,0,5,5,4,4,0,4,4,4,3,3,3,0,1,3,3,81,0.71,""]
["Answers","8 months in total but unclear for this endpoint","second generation (max number of larvae observed)","NOEL","p=0.05","no added Ni ","1 tank (in flow-through dilution series) each with 10 animals per tank","no protocol stated","late third-star and early fourth-star","Well water (characterised for hardness and alkalinity)","flow-through","Measured weekly (dissolved, does not state filter pore size)","no ref tox tests","data provided in table (note hormesis)","chi-square","alpha=0.05","6.8–7.4","54 (SD=8) mg CaCO3/L","45 (SD=7) mg CaCO3/L",null,"measured but not reported","15 (SD=2)"," reagent grade"]
["Category","Freshwater/metal/non- plant","Paper and data unique identifier(eg. 1-1,10-150)","7-2"]
["Scores",0,10,5,5,5,0,0,5,5,4,4,0,4,4,4,3,3,3,0,1,3,3,71,0.71,""]
["Answers","8 months in total but unclear for this endpoint","First generation (adult emergence)","NOEL","p=0.05","no added Ni ","1 tank (in flow-through dilution series) each with 10 animals per tank","no protocol stated","late third-star and early fourth-star","Well water (characterised for hardness and alkalinity)","flow-through","Measured weekly (dissolved, does not state filter pore size)","no ref tox tests","data provided in table ","chi-square","alpha=0.05","6.8–7.4","54 (SD=8) mg CaCO3/L","45 (SD=7) mg CaCO3/L","","measured but not reported","15 (SD=2)"," reagent grade"]
["Category","Freshwater/metal/non- plant","Paper and data unique identifier(eg. 1-1,10-150)","7-3"]
["Scores",0,10,5,5,5,0,0,5,5,4,4,0,4,4,4,3,3,3,0,1,3,3,71,0.71,""]
["Answers","8 months in total but unclear for this endpoint","First generation (larval survival)","NOEL","p=0.05","no added Ni ","1 tank (in flow-through dilution series) each with 10 animals per tank","no protocol stated","late third-star and early fourth-star","Well water (characterised for hardness and alkalinity)","flow-through","Measured weekly (dissolved, does not state filter pore size)","no ref tox tests","data provided in table ","chi-square","alpha=0.05","6.8–7.4","54 (SD=8) mg CaCO3/L","45 (SD=7) mg CaCO3/L","","measured but not reported","15 (SD=2)"," reagent grade"]
["Category","Freshwater/metal/non- plant","Paper and data unique identifier(eg. 1-1,10-150)","8-1"]
["Scores",10,10,5,5,5,0,0,5,5,4,4,0,4,4,4,3,3,3,0,3,3,3,83,0.83,""]
["Answers","85 d","4 h post fertilisation to total surviving fish ","NOEL","alpha=0.05","no added Ni ","unclear (two continuous flow diluter tanks available, 100 eggs per container)","no protocol stated","4-h post fertilised eggs","Well water (characterised for hardness and alkalinity)","flow-through","Measured weekly (total metal)","no ref tox tests","data provided in table ","Dunnett's multiple comparison and chi-square","alpha=0.05","7.0 (median)","53 (SD=10) mg CaCO3/L","45 (SD=8) mg CaCO3/L","","at or near saturation",12.1," reagent grade"]
["Category","Freshwater/metal/non- plant","Paper and data unique identifier(eg. 1-1,10-150)","8-2"]
["Scores",10,10,5,5,5,0,0,5,5,4,4,0,4,4,4,3,3,3,0,3,3,3,83,0.83,""]
["Answers","85 d","4 h post fertilisation to surviving fish fork length","NOEL","alpha=0.05","no added Ni ","unclear (two continuous flow diluter tanks available, 100 eggs per container)","no protocol stated","4-h post fertilised eggs","Well water (characterised for hardness and alkalinity)","flow-through","Measured weekly (total metal)","no ref tox tests","data provided in table ","Dunnett's multiple comparison and chi-square","alpha=0.05","7.0 (median)","53 (SD=10) mg CaCO3/L","45 (SD=8) mg CaCO3/L","NA","at or near saturation (8.3-10.2 mg/L)",12.1," reagent grade"]
["Category","Freshwater/metal/non- plant","Paper and data unique identifier(eg. 1-1,10-150)","8-3"]
["Scores",10,10,5,5,5,0,0,5,5,4,4,0,4,4,4,3,3,3,0,3,3,3,83,0.83,""]
["Answers","85 d","4 h post fertilisation to surviving fish wet weight","NOEL","alpha=0.05","no added Ni ","unclear (two continuous flow diluter tanks available, 100 eggs per container)","no protocol stated","4-h post fertilised eggs","Well water (characterised for hardness and alkalinity)","flow-through","Measured weekly (total metal)","no ref tox tests","data provided in table ","Dunnett's multiple comparison and chi-square","alpha=0.05","7.0 (median)","53 (SD=10) mg CaCO3/L","45 (SD=8) mg CaCO3/L","NA","at or near saturation (8.3-10.2 mg/L)",12.1," reagent grade"]
["Category","Freshwater/metal/non- plant","Paper and data unique identifier(eg. 1-1,10-150)","8-4"]
["Scores",10,10,5,5,5,0,0,5,5,4,4,0,4,4,4,3,3,3,0,3,3,3,83,0.83,""]
["Answers","52 d","fertilisation eyed eggs to total surviving fish ","NOEL","alpha=0.05","no added Ni ","unclear (two continuous flow diluter tanks available, 100 eggs per container)","no protocol stated","fertilised eyed eggs (25-d post fertilised eggs)","Well water (characterised for hardness and alkalinity)","flow-through","Measured weekly (total metal)","no ref tox tests","data provided in table ","Dunnett's multiple comparison and chi-square","alpha=0.05","7.1 (median)","39 (SD=11) mg CaCO3/L","49 (SD=7) mg CaCO3/L","NA","at or near saturation (8.3-10.2 mg/L)",12.5," reagent grade"]
["Category","Freshwater/metal/non- plant","Paper and data unique identifier(eg. 1-1,10-150)","8-5"]
["Scores",10,10,5,5,5,0,0,5,5,4,4,0,4,4,4,3,3,3,0,3,3,3,83,0.83,""]
["Answers","52 d","fertilisation eyed eggs to surviving fish fork length","NOEL","alpha=0.05","no added Ni ","unclear (two continuous flow diluter tanks available, 100 eggs per container)","no protocol stated","fertilised eyed eggs (25-d post fertilised eggs)","Well water (characterised for hardness and alkalinity)","flow-through","Measured weekly (total metal)","no ref tox tests","data provided in table ","Dunnett's multiple comparison and chi-square","alpha=0.05","7.1 (median)","39 (SD=11) mg CaCO3/L","49 (SD=7) mg CaCO3/L","NA","at or near saturation (8.3-10.2 mg/L)",12.5," reagent grade"]
["Category","Freshwater/metal/non- plant","Paper and data unique identifier(eg. 1-1,10-150)","8-6"]
["Scores",10,10,5,5,5,0,0,5,5,4,4,0,4,4,4,3,3,3,0,3,3,3,83,0.83,""]
["Answers","52 d","fertilisation eyed eggs to surviving fish wet weight ","NOEL","alpha=0.05","no added Ni ","unclear (two continuous flow diluter tanks available, 100 eggs per container)","no protocol stated","fertilised eyed eggs (25-d post fertilised eggs)","Well water (characterised for hardness and alkalinity)","flow-through","Measured weekly (total metal)","no ref tox tests","data provided in table ","Dunnett's multiple comparison and chi-square","alpha=0.05","7.1 (median)","39 (SD=11) mg CaCO3/L","49 (SD=7) mg CaCO3/L","NA","at or near saturation (8.3-10.2 mg/L)",12.5," reagent grade"]
["Category","Freshwater/metal/non- plant","Paper and data unique identifier(eg. 1-1,10-150)","8-7"]
["Scores",10,10,5,5,5,0,0,5,5,4,4,0,4,4,4,3,3,3,0,3,3,3,83,0.83,""]
["Answers","38 d","5-d post hatched pre-swim-up larvae to total surviving fish","NOEL","alpha=0.05","no added Ni ","unclear (two continuous flow diluter tanks available, 20 fish in each screen cage)","no protocol stated","5-d post hatched pre-swim-up larvae","Well water (characterised for hardness and alkalinity)","flow-through","Measured weekly (total metal)","no ref tox tests","data provided in table ","Dunnett's multiple comparison and chi-square","alpha=0.05",7.2,"50 (SD=11) mg CaCO3/L","43 (SD=9) mg CaCO3/L","NA","at or near saturation (8.3-10.2 mg/L)",12.7," reagent grade"]
["Category","Freshwater/metal/non- plant","Paper and data unique identifier(eg. 1-1,10-150)","8-8"]
["Scores",10,10,5,5,5,0,0,5,5,4,4,0,4,4,4,3,3,3,0,3,3,3,83,0.83,""]
["Answers","38 d","5-d post hatched pre-swim-up larvae to surviving fish fork length","NOEL","alpha=0.05","no added Ni ","unclear (two continuous flow diluter tanks available, 20 fish in each screen cage)","no protocol stated","5-d post hatched pre-swim-up larvae","Well water (characterised for hardness and alkalinity)","flow-through","Measured weekly (total metal)","no ref tox tests","data provided in table ","Dunnett's multiple comparison and chi-square","alpha=0.05",7.2,"50 (SD=11) mg CaCO3/L","43 (SD=9) mg CaCO3/L","NA","at or near saturation (8.3-10.2 mg/L)",12.7," reagent grade"]
["Category","Freshwater/metal/non- plant","Paper and data unique identifier(eg. 1-1,10-150)","8-9"]
["Scores",10,10,5,5,5,0,0,5,5,4,4,0,4,4,4,3,3,3,0,3,3,3,83,0.83,""]
["Answers","38 d","5-d post hatched pre-swim-up larvae to surviving fish wet weight","NOEL","alpha=0.05","no added Ni ","unclear (two continuous flow diluter tanks available, 20 fish in each screen cage)","no protocol stated","5-d post hatched pre-swim-up larvae","Well water (characterised for hardness and alkalinity)","flow-through","Measured weekly (total metal)","no ref tox tests","data provided in table ","Dunnett's multiple comparison and chi-square","alpha=0.05",7.2,"50 (SD=11) mg CaCO3/L","43 (SD=9) mg CaCO3/L","NA","at or near saturation (8.3-10.2 mg/L)",12.7," reagent grade"]
["Category","Freshwater/metal/non- plant","Paper and data unique identifier(eg. 1-1,10-150)","9-1"]
["Scores",10,10,5,5,5,0,0,5,5,4,4,0,0,4,4,3,3,3,0,1,1,3,75,0.75,""]
["Answers","21 d","survival (movement)","NOEL","alpha=0.05","no added Ni ","unclear (continuous flow diluter tanks used, 10 snails per concentration)","no protocol stated","adult (mature)","Well water (characterised for hardness and alkalinity)","flow-through","Measured weekly (total metal)","no ref tox tests","information not provided","chi-square","alpha=0.05",7.1,"59 mg CaCO3/L","50 mg CaCO3/L","NA","maintained near saturation","15 (SD = 1)"," reagent grade"]
["Category","Freshwater/metal/non- plant","Paper and data unique identifier(eg. 1-1,10-150)","10-1"]
["Scores",10,10,5,5,5,5,2,5,5,4,4,0,0,4,0,3,0,0,0,1,1,0,69,0.69,""]
["Answers","21 d","reproduction (total number of offspring)","NOEC","level of significance not reported","no added Ni ","four reps (5 animals per rep)","Federal Environmental Agency (1984)","Neonates (<24 h)","Artificial softwater","static renewal (3 times per week)","Measured twice (but measured concentrations not used if measurements were not less than 20% of nominal)","no ref tox tests","no infroamtion provided","student's t-test and U-test (Sachs, 1969)","not provided","8.0 (SD=0.2)","some data on Mg and Ca provided but final hardness is unclear","not provided","not provided","measured but result not given","25 (SD=1) degree C","not provided"]
["Category","Freshwater/metal/non- plant","Paper and data unique identifier(eg. 1-1,10-150)","10-2"]
["Scores",10,10,5,5,5,5,2,5,5,4,4,0,0,4,0,3,0,0,0,1,1,0,69,0.69,""]
["Answers","21 d","Survival (of parent organisms)","NOEC","level of significance not reported","no added Ni ","four reps (5 animals per rep)","Federal Environmental Agency (1984)","Neonates (<24 h)","Artificial softwater","static renewal (3 times per week)","Measured twice (but measured concentrations not used if measurements were not less than 20% of nominal)","no ref tox tests","no infroamtion provided","student's t-test and U-test (Sachs, 1969)","not provided","8.0 (SD=0.2)","some data on Mg and Ca provided but final hardness is unclear","not provided","not provided","measured but result not given","25 (SD=1) degree C","not provided"]
["Category","Freshwater/metal/non- plant","Paper and data unique identifier(eg. 1-1,10-150)","11-1"]
["Scores",10,5,5,5,5,0,0,5,5,4,0,0,0,4,4,3,0,0,0,0,1,0,56,0.56000000000000005,"The highest possible grade for this datum is acceptable."]
["Answers","7 d","Survival/mortality","LC","LC10","no added Ni ","duplicate (experiment run 3 times)","No standard test, no control treatment survival presented (consider including if taxa group not already incorporated into guideline derivation)","Embryos (complete operculum stage)","HS (10% Holtfreter solution)","static renewal (daily)","not measured","no ref tox tests","no information provided","Probit","confidence limits (810–1730)","7 to 8 ","not reported (HS media)","not reported (HS media)","not reported (HS media)","not reported (HS media)","20 +/- 2 C","not reported"]
["Category","Freshwater/metal/non- plant","Paper and data unique identifier(eg. 1-1,10-150)","12-1"]
["Scores",10,5,0,5,5,5,2,5,5,4,4,0,4,0,4,3,0,3,1,3,1,3,72,0.72,""]
["Answers","19 weeks","Survival","NOEC was extrpolated from text and table 3","p <0.05","no added Ni ","duplicate ","No standard test, control treatment survival presented (84%)","Larvae from first instar","dechlorinated tapwater","flow through","Measured throughout the 19 weeks (ranges of measrements for each of the three treatments was provided). ","no ref tox tests","Observed from data I table (three concentrations of Ni)","based on G-statistics (log-likelihood ratio test, Sokal and Rohlf 1969)","p<0.05","4.1 (3.9–4.3)","4.4 mg CaCO3/L","not reported","2.5–3.5 (measured in water used for other pH treatments)","8–10 mg/L","10–13","test water measured for range of metals, reagent grade NiCl2.6H2O "]
["Category","Freshwater/metal/non- plant","Paper and data unique identifier(eg. 1-1,10-150)","12-2"]
["Scores",10,5,0,5,5,5,2,5,5,4,4,0,4,0,4,3,3,0,3,3,1,3,74,0.74,""]
["Answers","19 weeks","Survival","NOEC was extrpolated from text and table 3","p <0.05","no added Ni ","duplicate ","No standard test, control treatment survival presented (84%)","Larvae from first instar","dechlorinated tapwater","flow through","Measured throughout the 19 weeks (ranges of measrements for each of the three treatments was provided). ","no ref tox tests","Observed from data I table (three concentrations of Ni)","based on G-statistics (log-likelihood ratio test, Sokal and Rohlf 1969)","p<0.05","5.5 (4.9–5.7)","4.5 mg CaCO3/L","not reported","2.5–3.5 ","8–10 mg/L","10–13","test water measured for range of metals, reagent grade NiCl2.6H2O "]
["Category","Freshwater/metal/non- plant","Paper and data unique identifier(eg. 1-1,10-150)","12-3"]
["Scores",10,5,0,5,5,5,2,5,5,4,4,0,4,0,4,3,3,0,3,3,1,3,74,0.74,""]
["Answers","19 weeks","Survival","NOEC was extrpolated from text and table 3","p <0.05","no added Ni ","duplicate ","No standard test, control treatment survival presented (84%)","Larvae from first instar","dechlorinated tapwater","flow through","Measured throughout the 19 weeks (ranges of measrements for each of the three treatments was provided). ","no ref tox tests","Observed from data I table (three concentrations of Ni)","based on G-statistics (log-likelihood ratio test, Sokal and Rohlf 1969)","p<0.05","6.2 (5.9–6.4)","4.5 mg CaCO3/L","not reported","2.5–3.5 ","8–10 mg/L","10–13","test water measured for range of metals, reagent grade NiCl2.6H2O "]
["Category","Freshwater/metal/non- plant","Paper and data unique identifier(eg. 1-1,10-150)","13-1"]
["Scores",10,5,0,5,5,5,2,5,5,4,0,0,4,0,4,3,3,3,0,0,1,3,67,0.67,"The highest possible grade for this datum is acceptable."]
["Answers","7 days","Survival","NOEC was extrpolated from text and table 6","p <0.05","no added Ni ","10 reps (1 animal per rep)","100% survival in the control","Neonate (<24 h)","30% demineralised water (ammended with low concentrations of trace metals to significantly increase the number of young)","Static, daily renewal","Measured throughout the 19 weeks (ranges of measrements for each of the three treatments was provided). ","no ref tox tests","Observed from data in Table 6 (three concentrations of Ni)","Weber et al (test for NOECs)","p<0.05","8.5 (+/- 0.1)","117 (+/- 7) mg/L CaCO3/L","84 (+/- 3) mg CaCO3/L","not reported","not reported","25 (+/- 2)","reagent grade NiCl2"]
["Category","Freshwater/metal/non- plant","Paper and data unique identifier(eg. 1-1,10-150)","13-2"]
["Scores",10,5,0,5,5,5,2,5,5,4,0,0,4,0,4,3,3,3,0,0,1,3,67,0.67,"The highest possible grade for this datum is acceptable."]
["Answers","7 days","Reproduction (fecundity)","NOEC was extrpolated from text and table 6","p <0.05","no added Ni ","10 reps (1 animal per rep)","100% survival in the control, good repeoduction in control","Neonate (<24 h)","30% demineralised water (ammended with low concentrations of trace metals to significantly increase the number of young)","Static, daily renewal","Measured throughout the 19 weeks (ranges of measrements for each of the three treatments was provided). ","no ref tox tests","Observed from data in Table 6 (three concentrations of Ni)","Weber et al (test for NOECs)","p<0.05","8.5 (+/- 0.1)","117 (+/- 7) mg/L CaCO3/L","84 (+/- 3) mg CaCO3/L","not reported","not reported","25 (+/- 2)","reagent grade NiCl2"]
["Category","Freshwater/metal/non- plant","Paper and data unique identifier(eg. 1-1,10-150)","13-3"]
["Scores",10,5,0,5,5,5,2,5,5,4,0,0,4,0,4,3,3,3,0,0,1,3,67,0.67,"The highest possible grade for this datum is acceptable."]
["Answers","21 days","Survival","NOEC was extrpolated from text and table 7","p <0.05","no added Ni ","10 reps (1 animal per rep)","90% survival in the control","Neonate (<24 h)","Well water (phys-chem provided)","Static, renewal every 2nd day","Not measured","no ref tox tests","Observed from data in Table 7 ","Weber et al (test for NOECs)","p<0.05","7.7 (+/- 0.2)","109 (+/- 16) mg/L CaCO3/L","91 (+/- 18) mg CaCO3/L","not reported","not reported (renewed every 2nd day)","21 (+/- 2)","reagent grade NiCl2"]
["Category","Freshwater/metal/non- plant","Paper and data unique identifier(eg. 1-1,10-150)","13-4"]
["Scores",10,5,0,5,5,5,2,5,5,4,0,0,4,0,4,3,3,3,0,0,1,3,67,0.67,"The highest possible grade for this datum is acceptable."]
["Answers","21 days","Reproduction (fecundity)","NOEC was extrpolated from text and table 7","p <0.05","no added Ni ","10 reps (1 animal per rep)","90% survival in the control (good reproduction output)","Neonate (<24 h)","Well water (phys-chem provided)","Static, renewal every 2nd day","Not measured","no ref tox tests","Observed from data in Table 7 ","Weber et al (test for NOECs)","p<0.05","7.7 (+/- 0.2)","109 (+/- 16) mg/L CaCO3/L","91 (+/- 18) mg CaCO3/L","not reported","not reported (renewed every 2nd day)","21 (+/- 2)","reagent grade NiCl2"]
["Category","Freshwater/metal/non- plant","Paper and data unique identifier(eg. 1-1,10-150)","13-5"]
["Scores",10,5,0,5,5,5,0,5,0,4,0,0,0,0,4,0,0,0,0,0,1,3,47,0.47,"The highest possible grade for this datum is acceptable."]
["Answers","7 days","Survival","NOEC was extrpolated from text (no reduced survival in any Ni concentration tested)","p <0.05","no added Ni ","4 reps (10 animal per rep)","Not stated","Larvae (<24 h after hatching)","assumed to be 20% demineralised water","Static, daily renewal","Not measured","no ref tox tests","no reduced survival after 7 dats at any Ni concentration tested","Weber et al (test for NOECs)","p<0.05","Unclear ","Unclear ","Unclear ","Not reported","Not reported (reviewed daily)","25 (+/- 2)","reagent grade NiCl2"]
["Category","Freshwater/metal/non- plant","Paper and data unique identifier(eg. 1-1,10-150)","15-1"]
["Scores",0,10,0,5,5,5,5,5,5,4,4,0,4,4,4,3,1,0,3,3,3,3,76,0.76,""]
["Answers","5 broods on control treatment (due to varying time to mature at different temperatures); however, time in weeks/daya was not reported","Total number of offspring per individual female until organisms in the control treatment released the 5th brood ","NOEC was extrapolated from data presented in Table 2 (lowest concentration tested (4 µg/L) was significantly different to the control) ","p <0.01","no added Ni ","15 reps (1 individual per rep)","Test accceptability was until 5th brood (described in paper), OECD (2012), Table S9 ","Neonates (<24 h)","modified M4 medium (reported in Pereira et al 2017)","Static renewal (3 times per week)","measured weekly in old and new test media (0.45 µm filtered)","no ref tox tests","refer to figure 2 and table 2 ","R drc (model 3-parameter Weibull)","p<0.01 and <0.001","8.0 SD=0.1","193 mg CaCO3/L Calculated from Mg and Ca concentrations ","not reported","3.5 SD=0.2 mg/L (DOC)","8.9 SD=0.7 mg/L","14.7 SD=0.8 degreesC","extensitve metal analyses including QA/QC; however nickel salt used was not reported "]
["Category","Freshwater/metal/non- plant","Paper and data unique identifier(eg. 1-1,10-150)","15-2"]
["Scores",0,10,5,5,5,5,5,5,5,4,4,0,4,4,4,3,1,0,3,3,3,3,81,0.81,""]
["Answers","5 broods on control treatment (due to varying time to mature at different temperatures); however, time in weeks/daya was not reported","Total number of offspring per individual female until organisms in the control treatment released the 5th brood ","EC ","EC10","no added Ni ","15 reps (1 individual per rep)","Test accceptability was until 5th brood (described in paper), OECD (2012), Table S9 ","Neonates (<24 h)","modified M4 medium (reported in Pereira et al 2017)","Static renewal (3 times per week)","measured weekly in old and new test media (0.45 µm filtered)","no ref tox tests","refer to figure 2 and table 2 ","R drc (model 3-parameter Weibull)","SD=5.7","8.0 SD=0.1","193 mg CaCO3/L Calculated from Mg and Ca concentrations ","not reported","3.5 SD=0.2 mg/L (DOC)","8.9 SD=0.7 mg/L","19.9 SD=0.5 degreesC","extensitve metal analyses including QA/QC; however nickel salt used was not reported "]
["Category","Freshwater/metal/non- plant","Paper and data unique identifier(eg. 1-1,10-150)","15-3"]
["Scores",0,10,5,5,5,5,5,5,5,4,4,0,4,4,4,3,1,0,3,3,3,3,81,0.81,""]
["Answers","5 broods on control treatment (due to varying time to mature at different temperatures); however, time in weeks/daya was not reported","Total number of offspring per individual female until organisms in the control treatment released the 5th brood ","EC ","EC10","no added Ni ","15 reps (1 individual per rep)","Test accceptability was until 5th brood (described in paper), OECD (2012), Table S9 ","Neonates (<24 h)","modified M4 medium (reported in Pereira et al 2017)","Static renewal (3 times per week)","measured weekly in old and new test media (0.45 µm filtered)","no ref tox tests","refer to figure 2 and table 2 ","R drc (model 3-parameter log-logistic)","SD=12.4","8.0 SD=0.1","193 mg CaCO3/L Calculated from Mg and Ca concentrations ","not reported","3.5 SD=0.2 mg/L (DOC)","8.9 SD=0.7 mg/L","24.8 SD=0.6 degreesC","extensitve metal analyses including QA/QC; however nickel salt used was not reported "]
["Category","Freshwater/metal/non- plant","Paper and data unique identifier(eg. 1-1,10-150)","15-4"]
["Scores",0,10,5,5,5,5,5,5,5,4,4,0,4,4,4,3,1,0,3,3,3,3,81,0.81,""]
["Answers","3 broods on control treatment (due to varying time to mature at different temperatures); however, time in weeks/daya was not reported","Total number of offspring per individual female until organisms in the control treatment released the 3rd brood ","EC ","EC10","no added Ni ","15 reps (1 individual per rep)","Test accceptability was until 3th brood (described in paper), OECD (2012) and table S9 ","Neonates (<24 h)","modified M4 medium (reported in Pereira et al 2017)","Static renewal (3 times per week)","measured weekly in old and new test media (0.45 µm filtered)","no ref tox tests","refer to figure 2 and table 2 ","R drc (model 3-parameter Weibull)","SD=7.8","8.0 SD=0.1","193 mg CaCO3/L Calculated from Mg and Ca concentrations ","not reported","3.5 SD=0.2 mg/L (DOC)","8.9 SD=0.7 mg/L","19.9 SD=0.5 degreesC","extensitve metal analyses including QA/QC; however nickel salt used was not reported "]
["Category","Freshwater/metal/non- plant","Paper and data unique identifier(eg. 1-1,10-150)","15-5"]
["Scores",0,10,5,5,5,5,5,5,5,4,4,0,4,4,4,3,1,0,3,3,3,3,81,0.81,""]
["Answers","3 broods on control treatment (due to varying time to mature at different temperatures); however, time in weeks/daya was not reported","Total number of offspring per individual female until organisms in the control treatment released the 3rd brood ","EC ","EC10","no added Ni ","15 reps (1 individual per rep)","Test accceptability was until 3th brood (described in paper), OECD (2012) and table S9 ","Neonates (<24 h)","modified M4 medium (reported in Pereira et al 2017)","Static renewal (3 times per week)","measured weekly in old and new test media (0.45 µm filtered)","no ref tox tests","refer to figure 2 and table 2 ","R drc (model 3-parameter Weibull)","SD=13.6","8.0 SD=0.1","193 mg CaCO3/L Calculated from Mg and Ca concentrations ","not reported","3.5 SD=0.2 mg/L (DOC)","8.9 SD=0.7 mg/L","24.8 SD=0.6 degreesC","extensitve metal analyses including QA/QC; however nickel salt used was not reported "]
["Category","Freshwater/metal/non- plant","Paper and data unique identifier(eg. 1-1,10-150)","16-1"]
["Scores",10,10,5,5,5,5,2,5,5,4,4,0,4,4,4,3,1,0,3,3,3,3,88,0.88,""]
["Answers","21 days","Total number of offspring per individual female until organisms ","EC ","EC10","no added Ni ","4 reps per treatment (for each of the 4 clones)i.e. total of 16 reps ","Test accceptability and control responses were presented in detail (table S3) and based on OECD (2012). For some temperatures and some clones, reproduction did not meet >60 offspring per individual female.    ","Neonates (<24 h) plus history of pre-acclimation to desired temperature","modified M4 medium with silicate, Na nitrate, KH2PO4 and K2HPO4 excluded, Zn at 13 µg/L","Static renewal (3 times per week)","measured once per week in old and new test media (0.45 µm filtered)","no ref tox tests","refer to figure 2","R drc (model 3-parameter log-logistic)","SE=19.5","7.5–7.8 (refer to table S2)","182 mg CaCO3/L Calculated from Mg and Ca concentrations ","not reported","4.56 SD=1.41 mg/L (DOC)","9.73 SD=0.29 mg/L","14.84 SD=0.44 degreesC","metal analyses with QA/QC; however nickel salt used was not reported "]
["Category","Freshwater/metal/non- plant","Paper and data unique identifier(eg. 1-1,10-150)","16-2"]
["Scores",10,10,5,5,5,5,2,5,5,4,4,0,4,4,4,3,1,0,3,3,3,3,88,0.88,""]
["Answers","21 days","Total number of offspring per individual female until organisms ","EC ","EC10","no added Ni ","4 reps per treatment (for each of the 4 clones)i.e. total of 16 reps ","Test accceptability and control responses were presented in detail (table S3) and based on OECD (2012). For some temperatures and some clones, reproduction did not meet >60 offspring per individual female.    ","Neonates (<24 h) plus history of pre-acclimation to desired temperature","modified M4 medium with silicate, Na nitrate, KH2PO4 and K2HPO4 excluded, Zn at 13 µg/L","Static renewal (3 times per week)","measured once per week in old and new test media (0.45 µm filtered)","no ref tox tests","refer to figure 2","R drc (model 3-parameter log-logistic)","SE=9.3","7.4–7.7 (refer to table S2)","182 mg CaCO3/L Calculated from Mg and Ca concentrations ","not reported","4.56 SD=1.41 mg/L (DOC)","9.08 SD=0.10 mg/L","19.64 SD=0.55 degreesC","metal analyses with QA/QC; however nickel salt used was not reported "]
["Category","Freshwater/metal/non- plant","Paper and data unique identifier(eg. 1-1,10-150)","16-3"]
["Scores",10,10,5,5,5,5,2,5,5,4,4,0,4,4,4,3,1,0,3,3,3,3,88,0.88,""]
["Answers","21 days","Total number of offspring per individual female until organisms ","EC ","EC10","no added Ni ","4 reps per treatment (for each of the 4 clones)i.e. total of 16 reps ","Test accceptability and control responses were presented in detail (table S3) and based on OECD (2012). For some temperatures and some clones, reproduction did not meet >60 offspring per individual female.    ","Neonates (<24 h) plus history of pre-acclimation to desired temperature","modified M4 medium with silicate, Na nitrate, KH2PO4 and K2HPO4 excluded, Zn at 13 µg/L","Static renewal (3 times per week)","measured once per week in old and new test media (0.45 µm filtered)","no ref tox tests","refer to figure 2","R drc (model 3-parameter log-logistic)","SE=20.6","7.4–7.7 (refer to table S2)","182 mg CaCO3/L Calculated from Mg and Ca concentrations ","not reported","4.56 SD=1.41 mg/L (DOC)","8.47 SD=0.16 mg/L","24.75 SD=0.25 degreesC","metal analyses with QA/QC; however nickel salt used was not reported "]
["Category","Freshwater/metal/non- plant","Paper and data unique identifier(eg. 1-1,10-150)","17-1"]
["Scores",0,10,0,5,5,0,5,5,5,4,4,0,4,4,4,1,1,1,0,0,1,3,62,0.62,""]
["Answers","unclear: 1st generation of a multigenerational study","Total number of offspring per individual female until organisms ","NOEC extrapolated from Table 2","p<0.05","no added Ni ","1 rep with 30 individuals","Control mortality did not exceed 10%","Neonates (24-44 h) ","Lake water (filtered, 40µm)","Static renewal (daily)","Checked weekly","no ref tox tests","refer to data in table 2","Dunnett test","p<0.05","7.7-7.9 (culture water parameter) test solutions cheked weekly but nor reported","62-76 mg CaCO3/L  (culture water parameter) test solutions cheked weekly but not reported","19-21 mg CO32- /L  (culture water parameter) test solutions cheked weekly but not reported","Not reported","Not reported","20.5 SD=0.5 degreesC (culture water parameter) test solutions cheked weekly but not reported","Culture water < 1ppb, NiCl2"]
["Category","Freshwater/metal/non- plant","Paper and data unique identifier(eg. 1-1,10-150)","18-1"]
["Scores",10,10,0,5,5,0,0,5,5,4,4,0,4,4,4,1,1,1,0,0,1,3,67,0.67,""]
["Answers","66 days","population: Total number of idividuals","NOEC extrapolated from Table 4","p<0.05","no added Ni ","4 reps per treatment","Not reported: novel population-based experiment","10 Adults (10-20 days old) plus 14 juveniles (5 days old) ","Lake water (filtered, 40µm)","flow through","Checked at least weekly","no ref tox tests","refer to data in table 4","Dunnett test","p<0.05","7.7-7.9 (culture water parameter) test solutions checked weekly but not reported","62-76 mg CaCO3/L  (culture water parameter) test solutions cheked weekly but not reported","19-21 mg CO32- /L  (culture water parameter) test solutions cheked weekly but not reported","Not reported","Not reported","21 SD=0.5 degreesC (culture water parameter) test solutions cheked weekly but not reported","measured concentraitons, NiCl2"]

{"sheet":"FW metal plant","index":7,"n_rows":87,"n_cols":53,"rows_kept":87,"cut":false,"hidden":false,"merged":[[3,4,7,4],[9,2,9,4],[11,2,13,2],[11,7,13,7],[14,2,16,2],[14,7,16,7],[17,2,19,2],[17,7,19,7],[20,2,21,2],[20,7,21,7],[22,2,24,2],[22,7,24,7],[25,2,27,2],[25,7,27,7],[28,2,30,2],[28,7,30,7],[31,2,33,2],[31,7,33,7],[34,2,36,2],[34,7,36,7],[37,2,39,2],[37,7,39,7],[40,2,42,2],[40,7,42,7],[43,2,45,2],[43,7,45,7],[46,2,48,2],[46,7,48,7],[49,2,51,2],[49,7,51,7],[71,2,74,2],[71,7,74,7],[52,2,54,2],[52,7,54,7],[68,2,70,2],[68,7,70,7],[65,7,67,7],[56,7,58,7],[59,7,61,7],[62,7,64,7]]}
[null,1,"Fill in the blank cells below, based on information provided in the paper being assessed. You can either pick an option from the dropdown list or add the appropriate detail using the 'Add to list' button. ",null,null,null,null,null,null,null,null,null,null,null,"* All the text in RED are used for drop down list ,make changes with caution."]
[null,null,"Category",{"$f":"IF(AF3=\"\",0,1)","v":1},"Freshwater/metal/plant",{"$f":"IF(E3=\"\",0,1)","v":1},"Citation No.",{"$f":"IF(ISERROR(FIND(\"-\",E3)),E3,LEFT(E3,FIND(\"-\",E3)-1))","v":"175"},null,"Taxonomic group",null,null,null,null,"Species",null,null,"Lifestage",null,null,"Exposure duration",null,null,"Measure of toxicity",null,null,"Toxicity endpoint",null,null,"Taxonomic group",null,null,"Phylum",null,null,"Class",null,null,"Media",null,null,"Temperature ",null,null,"Acute Or Chronic",null,null,"PH",null,null,"Salinity/Comdictivity"]
[null,null,"Paper and data unique identifier(eg. 1-1,10-150)",{"$f":"IF(AI3=\"\",0,1)","v":1},"175-5",{"$f":"IF(E4=\"\",0,1)","v":1},"Species (Scientific name)",null,null,"Phylum",null,null,null,null,"Aedes albopictus",26,{"$f":"IF(P3=0,\"\",INDEX(O3:O108,P3))","v":"Pediastrum duplex meyan (in multispecies assay)"},"1 month",6,{"$f":"IF(S3=0,\"\",INDEX(R3:R108,S3))","v":"exponentially growing cells"},"11 hour",7,{"$f":"IF(V3=0,\"\",INDEX(U3:U108,V3))","v":"72 h"},"EC10",1,{"$f":"IF(Y3=0,\"\",INDEX(X3:X108,Y3))","v":"EC10"},"Biomass (Chl a)",10,{"$f":"IF(AB3=0,\"\",INDEX(AA3:AA108,AB3))","v":"Growth rate"},"Fish ",3,{"$f":"IF(AE3=0,\"\",INDEX(AD3:AD108,AE3))","v":"Microalga"},"Angiosperms",2,{"$f":"IF(AH3=0,\"\",INDEX(AG3:AG108,AH3))","v":"Chlorophyta"},"Branchiopoda",3,{"$f":"IF(AK3=0,\"\",INDEX(AJ3:AJ108,AK3))","v":"Chlorophyceae"},"Freshwater",1,{"$f":"IF(AN3=0,\"\",INDEX(AM3:AM108,AN3))","v":"Freshwater"},"15°C",9,{"$f":"IF(AQ3=0,\"\",INDEX(AP3:AP108,AQ3))","v":27},"Acute ",2,{"$f":"IF(AT3=0,\"\",INDEX(AS3:AS108,AT3))","v":"Chronic"},6.4,17,{"$f":"IF(AW3=0,\"\",INDEX(AV3:AV108,AW3))","v":7.5},"Salinity1",null,"N.A."]
[null,null,"Citation",{"$f":"IF(AL3=\"\",0,1)","v":1},"McKnight et al 2018 (unpublished data)",{"$f":"IF(H8=\"\",0,1)","v":1},"Lifestage",null,null,"Class",null,null,null,null,"Ankistrodesmus falcatus",null,null,"1 year old",null,null,"12 d",null,null,"EC20",null,null,"Biomass (Chl b)",null,null,"Macrophyte",null,null,"Chlorophyta",null,null,"Chlorophyceae",null,null,"Marinewater",null,null,"25 ± 1",null,null,"Chronic",null,null,6.8,null,null,"Salinity2"]
[null,null,null,{"$f":"IF(AO3=\"\",0,1)","v":1},null,{"$f":"IF(AX3=\"\",0,1)","v":1},"Exposure duration",null,null,"Media",null,null,null,null,"Australian Bass",null,null,"3- and 4- frond colonies",null,null,"13 days",null,null,"EC25",null,null,"Biomass (dry weight)",null,null,"Microalga",null,null,"N.A.",null,null,"Chlorophyceae",null,null,"N.A.",null,null,"25 ± 2",null,null,"N.A.",null,null,6.9]
[null,null,null,{"$f":"IF(AR3=\"\",0,1)","v":1},null,{"$f":"IF(Q3=\"\",0,1)","v":1},"Measure of toxicity",null,null,"Temperature ",null,null,null,null,"Chlamydomonas sp",null,null,"3-frond colonies",null,null,"14 d",null,null,"EC50",null,null,"Biomass (fresh weight)",null,null,"N.A.",null,null,"Tracheophyta",null,null,"Liliopsida",null,null,null,null,null,"25°C",null,null,null,null,null,7.1]
[null,null,null,{"$f":"IF(AU3=\"\",0,1)","v":1},null,{"$f":"IF(T3=\"\",0,1)","v":1},"Toxicity endpoint",null,null,"Acute Or Chronic ",null,null,null,null,"Chlorella pyrenoidosa",null,null,"6 fronds",null,null,"5 d",null,null,"IC25",null,null,"Biomass cyanobacteria (zeaxanthin)",null,null,"phytoplankton community",null,null,"Tracheophyta",null,null,"N.A.",null,null,null,null,null,"28 ± 1",null,null,null,null,null,7.3]
[null,null,null,null,null,{"$f":"IF(W3=\"\",0,1)","v":1},"Toxicity value",173,null,"PH",null,null,null,null,"Chlorella sp",null,null,"exponentially growing cells",null,null,"7 d",null,null,"LC50",null,null,"Biomass green algae (lutein)",null,null,null,null,null,"Ochrophyta",null,null,"Eustigmatophyceae",null,null,null,null,null,"29 ± 2",null,null,null,null,null,7.8]
[null,2,"Select the appropriate answer option to each question. Comments can be added to the cells in column H.",null,null,{"$f":"IF(Z3=\"\",0,1)","v":1},null,null,null,"Salinity/Conductivity","N.A.",null,null,null,"Chlorella sp.",null,null,"exponentially growing cells",null,null,"72 h",null,null,"N.A.",null,null,"Growth",null,null,null,null,null,null,null,null,null,null,null,null,null,null,"N.A.",null,null,null,null,null,8]
[null,"*","If the selected answer option does not work try clicking on any other cell first and then click back on the answer option again.",null,null,{"$f":"IF(AC3=\"\",0,1)","v":1},null,null,null,null,null,null,null,null,"Coelastrum microporum",null,null,"late log phase growth cells",null,null,"96 h",null,null,"NOEC",null,null,"Growth (absorbance measurement)",null,null,null,null,null,null,null,null,null,null,null,null,null,null,"N.R.",null,null,null,null,null,8.15]
[null,"No.","Question","Marks Awarded","Answer Options","Option References","Scores","Answers",null,null,null,null,null,null,"Desmodesmus sp",null,null,"N.A.",null,null,"N.A.",null,null,null,null,null,"growth (yield)",null,null,null,null,null,null,null,null,null,null,null,null,null,null,27,null,null,null,null,null,"6.0 ± 0.1"]
[null,null,"Was the duration of the exposure stated (e.g. 48 or 96 h)?",10,null,1,{"$f":"IF(F15=0,0,INDEX($D12:$D13,F12,1))","v":10},"72 h",null,null,null,null,null,null,"Desmodesmus spinosus",null,null,"N.R.",null,null,null,null,null,null,null,null,"Growth rate",null,null,null,null,null,null,null,null,null,null,null,null,null,null,null,null,null,null,null,null,"6.0 ± 0.3"]
[null,1,null,0,null,null,null,null,null,null,null,null,null,null,"Lemna aequinoctialis",null,null,"turion (dormant front)",null,null,null,null,null,null,null,null,"growth rate (root length)",null,null,null,null,null,null,null,null,null,null,null,null,null,null,null,null,null,null,null,null,"8.15-8.23"]
[null,null,null,null,null,null,null,null,null,null,null,null,null,null,"Lemna minor",null,null,null,null,null,null,null,null,null,null,null,"Mortality",null,null,null,null,null,null,null,null,null,null,null,null,null,null,null,null,null,null,null,null,"N.A."]
[null,null,"Was the biological endpoint (e.g., immobilization or population growth) stated and defined (10 marks)? Award 5 marks if the biological endpoint is only stated.",10,null,1,{"$f":"IF(F15=0,0,INDEX($D15:$D17,F15,1))","v":10},"Growth rate, defined.",null,null,null,null,null,null,"mixed phytoplankton community",null,null,null,null,null,null,null,null,null,null,null,"N.A.",null,null,null,null,null,null,null,null,null,null,null,null,null,null,null,null,null,null,null,null,"N.R."]
[null,2,null,5,null,null,null,null,null,null,null,null,null,null,"N.A.",null,null,null,null,null,null,null,null,null,null,null,"Reproduction",null,null,null,null,null,null,null,null,null,null,null,null,null,null,null,null,null,null,null,null,"PH11"]
[null,null,null,0,null,null,null,null,null,null,null,null,null,null,"Pediastrum duplex",null,null,null,null,null,null,null,null,null,null,null,"Root length",null,null,null,null,null,null,null,null,null,null,null,null,null,null,null,null,null,null,null,null,"PH7.0 "]
[null,null,"Was the biological effect stated (e.g. LC or NOEC)?",5,null,1,{"$f":"IF(F18=0,0,INDEX($D18:$D19,F18,1))","v":5},"EC",null,null,null,null,null,null,"Pseudokirchneriella sp.",null,null,null,null,null,null,null,null,null,null,null,"Total Chl",null,null,null,null,null,null,null,null,null,null,null,null,null,null,null,null,null,null,null,null,7.9]
[null,3,null,0,null,null,null,null,null,null,null,null,null,null,"Pseudokirchneriella subcapitata",null,null,null,null,null,null,null,null,null,null,null,null,null,null,null,null,null,null,null,null,null,null,null,null,null,null,null,null,null,null,null,null,7.5]
[null,null,null,null,null,null,null,null,null,null,null,null,null,null,"Scenedesmus accuminatus"]
[null,4,"Was the biological effect quantified (e.g. 50% effect, 25% effect)? \nNote: The effect for NOEC and LOEC data must be quantified.",5,null,1,{"$f":"IF(F21=0,0,INDEX($D21:$D22,F21,1))","v":5},10,null,null,null,null,null,null,"Scenedesmus quadricauda"]
[null,null,null,0,null,null,null,null,null,null,null,null,null,null,"Spermatozopsis exultans"]
[null,5,"Were appropriate controls (e.g. a no-toxicant control and/or solvent control) used?",5,null,1,{"$f":"IF(F23=0,0,INDEX($D23:$D24,F23,1))","v":5},null,null,null,null,null,null,null,"Spirodela polyrhiza"]
[null,null,null,0,null,null,null,null,null,null,null,null,null,null,"Chlorella sp 12"]
[null,null,null,null,null,null,null,null,null,null,null,null,null,null,"Monoraphidium arcuatum "]
[null,6,"Was each control and contaminant concentration at least duplicated?",5,null,1,{"$f":"IF(F26=0,0,INDEX($D26:$D27,F26,1))","v":5},"duplicate",null,null,null,null,null,null,"Monoraphidium arcuatum (in multispecies assay)"]
[null,null,null,0,null,null,null,null,null,null,null,null,null,null,"Nannochloropsis like sp (in multispecies assay)"]
[null,null,null,null,null,null,null,null,null,null,null,null,null,null,"Pediastrum duplex meyan (in multispecies assay)"]
[null,7,"Were test acceptability criteria stated (e.g. mortality in controls must not exceed a certain percentage) (5 marks)?\nOR Were test acceptability criteria inferred (e.g. test method used [USEPA, OECD, ASTM etc.]) (award 2 marks). \nNote: Data that fail the acceptability criteria are automatically deemed to be of unacceptable quality and must not be used. ",5,null,1,{"$f":"IF(F29=0,0,INDEX($D29:$D31,F29,1))","v":5},"Control growth rate >1 doublings per day. Results of this study define acceptability criteria for future studies (optimisation paper)."]
[null,null,null,2]
[null,null,null,0]
[null,8,"Were the characteristics of the test organism (e.g. length, mass, age) stated?",5,null,1,{"$f":"IF(F32=0,0,INDEX($D32:$D34,F32,1))","v":5},"0.27 x 10^3 cells/mL in exponential growth"]
[null,null,null,0]
[]
[null,9,"Was the type of test media used stated?",5,null,1,{"$f":"IF(F35=0,0,INDEX($D35:$D37,F35,1))","v":5},"synthetic softwater "]
[null,null,null,0]
[]
[null,null,"Was the type of exposure (e.g. static, flow through) stated? ",4,null,1,{"$f":"IF(F38=0,0,INDEX($D38:$D40,F38,1))","v":4},"Static"]
[null,10,null,0]
[]
[null,null,"Were the contaminant concentrations measured at the beginning and end of the exposure (4 marks)? Award 2 marks if they were measured only once during the test.\nNote: If the concentrations were not measured then automatically the data cannot be high quality. ",4,null,1,{"$f":"IF(F41=0,0,INDEX($D41:$D43,F41,1))","v":4},"beginning and end"]
[null,11,null,2]
[null,null,null,0]
[null,null,"Were parallel reference toxicant toxicity tests conducted?",4,null,2,{"$f":"IF(F44=0,0,INDEX($D44:$D46,F44,1))","v":0},"Copper tests done alongside, however, this study will inform acceptability criteria and refotx data for future work"]
[null,12,null,0]
[]
[null,null,"Was there a concentration–response relationship either observable or stated?",4,null,1,{"$f":"IF(F47=0,0,INDEX($D47:$D49,F47,1))","v":4}]
[null,13,null,0]
[]
[null,null,"Was an appropriate statistical method or model used to determine the toxicity?\nNote: They should be accepted by a recognised national or international regulatory body (e.g. USEPA, OECD, ASTM). ",4,null,1,{"$f":"IF(F50=0,0,INDEX($D50:$D52,F50,1))","v":4}]
[null,14,null,0]
[]
[null,15,"For LC/EC/BEC data was an estimate of variability provided? \nOR \nFor NO EC/LOEC data was the significance level 0.05 or less?  \n\n",4,null,1,{"$f":"IF(F53=0,0,INDEX($D53:$D55,F53,1))","v":4},"95% CLs of 140-205"]
[null,null,null,0]
[]
[null,16,"Were the following parameters measured and stated? (3 marks if measured and stated, 1 mark if just measured)."]
[null,null,null,3,null,1,{"$f":"IF(F57=0,0,INDEX($D57:$D59,F57,1))","v":3},7.5]
[null,16.100000000000001,"pH ",1]
[null,null,null,0]
[null,null,null,3,null,2,{"$f":"IF(F60=0,0,INDEX($D60:$D62,F60,1))","v":1},"prepared according to USEPA methods to be 100-120 mg CaCO3/L"]
[null,16.2,"Hardness",1]
[null,null,null,0]
[null,null,null,3,null,3,{"$f":"IF(F63=0,0,INDEX($D63:$D65,F63,1))","v":0}]
[null,16.3,"Alkalinity ",1]
[null,null,null,0]
[null,null,null,3,null,1,{"$f":"IF(F66=0,0,INDEX($D66:$D68,F66,1))","v":3},"<0.5 mg/L"]
[null,16.399999999999999,"Organic carbon concentration",1]
[null,null,null,0]
[null,null,"Was the temperature measured and stated (3 marks)? Award 1 mark if the temperature was measured but not stated or if only the temperature settings of the room or chamber are stated.",3,null,1,{"$f":"IF(F69=0,0,INDEX($D69:$D71,F69,1))","v":3},"27 ± 2"]
[null,17,null,1]
[null,null,null,0]
[null,null,"Were test solutions, blanks and/or controls tested for contamination OR were analytical reagent grade chemicals used or the highest possible purity chemicals used for the experiment? (3 marks).",3,null,1,{"$f":"IF(F72=0,0,INDEX($D72:$D73,F72,1))","v":3},"AR grade used, and controls were analysed for contmaination"]
[null,18,null,0]
[]
[null,null,null,null,null,null,null,null,{"$f":"(COUNTIF(F12:F73,\"=0\"))+COUNTIF(F2:F10,\"=0\")+COUNTIF(D2:D7,\"=0\")","v":0}]
[]
[]
[null,null,"Total score",null,null,null,{"$f":"IF(SUM(G12:G72)=0,\"\",SUM(G12:G72))","v":88}]
[null,null,"Total Max. possible score for the various types of data and contaminants ",null,{"$f":"D12+D15+D18+D21+D23+D26+D29+D32+D35+D38+D41+D44+D47+D50+D53+D57+D66+D69+D72+D60+D63","v":97}]
[null,null,"Quality Score",null,{"$f":"\"= [Total score / Total possible score] * 100 = \"","v":"= [Total score / Total possible score] * 100 = "},null,{"$f":"IF(ISERROR(G78/E79),#N/A,G78/E79)","v":0.90721649484536082},{"$f":"IF(F41=3,\"The highest possible grade for this datum is acceptable.\",\"\")","v":""}]
[]
[null,null,"H = high quality                           Quality score ≥ 80%      "]
[null,null,"A = acceptable quality         > 50% Quality score < 80%      "]
[null,null,"U = unacceptable quality              Quality score ≤ 50%  "]
[]
[3,null,"Click the 'Save & Update' button to save and export the answers to the 'All results' worksheet. "]
[null,null,"Select the 'Reset Answers' button if you wish to clear all answers."]

{"sheet":"FW metal plant_WS","index":8,"n_rows":560,"n_cols":25,"rows_kept":560,"cut":false,"hidden":false,"merged":[]}
[]
["Question No.",1,2,3,4,5,6,7,8,9,10,11,12,13,14,15,16.100000000000001,16.2,16.3,16.399999999999999,17,18,"Total Score","Quality Score"]
["Short Questions","Duration of the exposure ","Biological endpoint","Biological effect stated or not","Biological effect quantified or not","Appropriate controls","Control & contaminant concentration","Test acceptability criteria","Characteristics of the test organism"," Type of test media","Type of exposure","Contaminant concentrations","Parallel reference toxicant toxicity tests","Concentration–response relationship","Determine the toxicity","NOEC/LOEC or LC/EC/BEC","pH","Hardness","Alkalinity ","Organic carbon concentration","Temperature","Grade or purity"]
["Marks Awarded ","10 or 0","10,5 or 0","5 or 0 ","5 or 0 ","5 or 0 ","5 or 0 ","5 or 0 ","5 or 0 ","5 or 0 ","4 or 0","4 or 2 or 0","4 or 2","4 or 2","4 or 2","4 or 2","3 or 1 or 0","3 or 1 or 0","3 or 1 or 0","3 or 1 or 0","3 or 0","3 or 0 "]
["Max. Possible Score",10,10,5,5,5,5,5,5,5,4,4,4,4,4,4,3,3,3,3,3,3,{"$f":"SUM(B5:V5)","v":97}]
["Category","Freshwater/metal/plant","Paper and data unique identifier(eg. 1-1,10-150)","150-1"]
["Scores",10,10,5,5,5,5,5,5,5,0,0,0,4,4,0,0,0,0,0,1,3,67,0.69072164948453607,"The highest possible grade for this datum is acceptable."]
["Answers","7 d","Growth, frond number","EC","EC10","yes","Assumed - followed ISO protcol","Controls response stated as increasing from 10 fronds to more than 100 over 7 days.","3- and 4- frond colonies","modified Steinberg medium","assume static","","","","","Not provided for EC10s. EC10s had to re-determined by calucator. They provided EC50 values, and a ratio of EC50/EC10.","","","","",25,"pro anlaysi' = AR grade chemicals used. Merck."]
["Category","Freshwater/metal/plant","Paper and data unique identifier(eg. 1-1,10-150)","150-2"]
["Scores",10,10,5,5,5,5,5,5,5,0,0,0,4,4,0,0,0,0,0,1,3,67,0.69072164948453607,"The highest possible grade for this datum is acceptable."]
["Answers","7 d","Biomass, fresh weight, method described.","EC","EC10","yes","Assumed - followed ISO protcol","Controls response stated as increasing from 10 fronds to more than 100 over 7 days.","3- and 4- frond colonies","modified Steinberg medium","assume static","","","","","Not provided for EC10s. EC10s had to re-determined by calucator. They provided EC50 values, and a ratio of EC50/EC10.","","","","",25,"pro anlaysi' = AR grade chemicals used. Merck."]
["Category","Freshwater/metal/plant","Paper and data unique identifier(eg. 1-1,10-150)","150-3"]
["Scores",10,10,5,5,5,5,5,5,5,0,0,0,4,4,0,0,0,0,0,1,3,67,0.69072164948453607,"The highest possible grade for this datum is acceptable."]
["Answers","7 d","Biomass, dry weight, method described.","EC","EC10","yes","Assumed - followed ISO protcol","Controls response stated as increasing from 10 fronds to more than 100 over 7 days.","3- and 4- frond colonies","modified Steinberg medium","assume static","","","","","Not provided for EC10s. EC10s had to re-determined by calucator. They provided EC50 values, and a ratio of EC50/EC10.","","","","",25,"pro anlaysi' = AR grade chemicals used. Merck."]
["Category","Freshwater/metal/plant","Paper and data unique identifier(eg. 1-1,10-150)","150-4"]
["Scores",10,10,5,5,5,5,5,5,5,0,0,0,4,4,0,0,0,0,0,1,3,67,0.69072164948453607,"The highest possible grade for this datum is acceptable."]
["Answers","7 d","Biomass, dry weight, method described.","EC","EC10","yes","Assumed - followed ISO protcol","Controls response stated as increasing from 10 fronds to more than 100 over 7 days.","3- and 4- frond colonies","modified Steinberg medium","assume static","","","","","Not provided for EC10s. EC10s had to re-determined by calucator. They provided EC50 values, and a ratio of EC50/EC10.","","","","",25,"pro anlaysi' = AR grade chemicals used. Merck."]
["Category","Freshwater/metal/plant","Paper and data unique identifier(eg. 1-1,10-150)","150-5"]
["Scores",10,10,5,5,5,5,5,5,5,0,0,0,4,4,0,0,0,0,0,1,3,67,0.69072164948453607,"The highest possible grade for this datum is acceptable."]
["Answers","7 d","Biomass, fresh weight, method described.","EC","EC10","yes","Assumed - followed ISO protcol","Controls response stated as increasing from 10 fronds to more than 100 over 7 days.","3- and 4- frond colonies","modified Steinberg medium","assume static","","","","","Not provided for EC10s. EC10s had to re-determined by calucator. They provided EC50 values, and a ratio of EC50/EC10.","","","","",25,"pro anlaysi' = AR grade chemicals used. Merck."]
["Category","Freshwater/metal/plant","Paper and data unique identifier(eg. 1-1,10-150)","150-6"]
["Scores",10,10,5,5,5,5,5,5,5,0,0,0,4,4,0,0,0,0,0,1,3,67,0.69072164948453607,"The highest possible grade for this datum is acceptable."]
["Answers","7 d","Biomass, dry weight, method described.","EC","EC10","yes","Assumed - followed ISO protcol","Controls response stated as increasing from 10 fronds to more than 100 over 7 days.","3- and 4- frond colonies","modified Steinberg medium","assume static","","","","","Not provided for EC10s. EC10s had to re-determined by calucator. They provided EC50 values, and a ratio of EC50/EC10.","","","","",25,"pro anlaysi' = AR grade chemicals used. Merck."]
["Category","Freshwater/metal/plant","Paper and data unique identifier(eg. 1-1,10-150)","152-1"]
["Scores",10,10,0,0,5,0,0,0,5,4,0,0,0,0,0,3,0,0,3,0,0,40,0.41237113402061853,"The highest possible grade for this datum is acceptable."]
["Answers","5 d","biomass endpoints measured","","","","","","","","","","","","","",8.15,"","","TOC 12.0 ± 0.6 mg/L","",""]
["Category","Freshwater/metal/plant","Paper and data unique identifier(eg. 1-1,10-150)","152-2"]
["Scores",10,10,0,0,5,0,0,0,5,4,0,0,0,0,0,3,0,0,3,0,0,40,0.41237113402061853,"The highest possible grade for this datum is acceptable."]
["Answers","5 d","biomass endpoints measured","","","","","","","","","","","","","",8.15,"","","TOC 12.0 ± 0.6 mg/L","",""]
["Category","Freshwater/metal/plant","Paper and data unique identifier(eg. 1-1,10-150)","152-3"]
["Scores",10,10,0,0,5,0,0,0,5,4,0,0,0,0,0,3,0,0,3,0,0,40,0.41237113402061853,"The highest possible grade for this datum is acceptable."]
["Answers","5 d","biomass endpoints measured","","","","","","","","","","","","","",8.15,"","","TOC 12.0 ± 0.6 mg/L","",""]
["Category","Freshwater/metal/plant","Paper and data unique identifier(eg. 1-1,10-150)","154-1"]
["Scores",10,10,5,5,5,5,2,5,5,4,4,0,4,4,4,1,3,1,0,1,3,81,0.83505154639175261,""]
["Answers","72 h","growth rate. Three data points were used to determine the average specific growth rate: (t0,N0), (t2,N2) and (t3,N3), representing the initial cell density and the cell densities at days 2 and 3, respectively.","LC, NOEC, LOEC","EC10 EC50","","3 reps","OECD","Late phase exposnentially growing cells used. Varying between 3000 and 5000 coenobia/mL for coenobial algae and between 15,000 and 150,000 cells/mL for single-celled algae","","static, continuous light, shaken twice daily.","start and end of each test","","","","","Says it was measured at start and end of test - but not reported.",16.3,"Says it was determined from measured IC concentrations and pH values - but not reported.","","","Dissolved Ni was <3 µg/L (LOD) in culture medium."]
["Category","Freshwater/metal/plant","Paper and data unique identifier(eg. 1-1,10-150)","154-2"]
["Scores",10,10,5,5,5,5,2,5,5,4,4,0,4,4,4,1,3,1,0,1,3,81,0.83505154639175261,""]
["Answers","72 h","growth rate. Three data points were used to determine the average specific growth rate: (t0,N0), (t2,N2) and (t3,N3), representing the initial cell density and the cell densities at days 2 and 3, respectively.","LC, NOEC, LOEC","EC10 EC50","","3 reps","OECD","Late phase exposnentially growing cells used. Varying between 3000 and 5000 coenobia/mL for coenobial algae and between 15,000 and 150,000 cells/mL for single-celled algae","","static, continuous light, shaken twice daily.","start and end of each test","","","","","Says it was measured at start and end of test - but not reported.",16.3,"Says it was determined from measured IC concentrations and pH values - but not reported.","","","Dissolved Ni was <3 µg/L (LOD) in culture medium."]
["Category","Freshwater/metal/plant","Paper and data unique identifier(eg. 1-1,10-150)","154-3"]
["Scores",10,10,5,5,5,5,2,5,5,4,4,0,4,4,4,1,3,1,0,1,3,81,0.83505154639175261,""]
["Answers","72 h","growth rate. Three data points were used to determine the average specific growth rate: (t0,N0), (t2,N2) and (t3,N3), representing the initial cell density and the cell densities at days 2 and 3, respectively.","LC, NOEC, LOEC","EC10 EC50","","3 reps","OECD","Late phase exposnentially growing cells used. Varying between 3000 and 5000 coenobia/mL for coenobial algae and between 15,000 and 150,000 cells/mL for single-celled algae","","static, continuous light, shaken twice daily.","start and end of each test","","","","","Says it was measured at start and end of test - but not reported.",16.3,"Says it was determined from measured IC concentrations and pH values - but not reported.","","","Dissolved Ni was <3 µg/L (LOD) in culture medium."]
["Category","Freshwater/metal/plant","Paper and data unique identifier(eg. 1-1,10-150)","154-4"]
["Scores",10,10,5,5,5,5,2,5,5,4,4,0,4,4,4,1,3,1,0,1,3,81,0.83505154639175261,""]
["Answers","72 h","growth rate. Three data points were used to determine the average specific growth rate: (t0,N0), (t2,N2) and (t3,N3), representing the initial cell density and the cell densities at days 2 and 3, respectively.","LC, NOEC, LOEC","EC10 EC50","","3 reps","OECD","Late phase exposnentially growing cells used. Varying between 3000 and 5000 coenobia/mL for coenobial algae and between 15,000 and 150,000 cells/mL for single-celled algae","","static, continuous light, shaken twice daily.","start and end of each test","","","","","Says it was measured at start and end of test - but not reported.",16.3,"Says it was determined from measured IC concentrations and pH values - but not reported.","","","Dissolved Ni was <3 µg/L (LOD) in culture medium."]
["Category","Freshwater/metal/plant","Paper and data unique identifier(eg. 1-1,10-150)","154-5"]
["Scores",10,10,5,5,5,5,2,5,5,4,4,0,4,4,4,1,3,1,0,1,3,81,0.83505154639175261,""]
["Answers","72 h","growth rate. Three data points were used to determine the average specific growth rate: (t0,N0), (t2,N2) and (t3,N3), representing the initial cell density and the cell densities at days 2 and 3, respectively.","LC, NOEC, LOEC","EC10 EC50","","3 reps","OECD","Late phase exposnentially growing cells used. Varying between 3000 and 5000 coenobia/mL for coenobial algae and between 15,000 and 150,000 cells/mL for single-celled algae","","static, continuous light, shaken twice daily.","start and end of each test","","","","","Says it was measured at start and end of test - but not reported.",43.4,"Says it was determined from measured IC concentrations and pH values - but not reported.","","","Dissolved Ni was <3 µg/L (LOD) in culture medium."]
["Category","Freshwater/metal/plant","Paper and data unique identifier(eg. 1-1,10-150)","154-6"]
["Scores",10,10,5,5,5,5,2,5,5,4,4,0,4,4,4,1,3,1,0,1,3,81,0.83505154639175261,""]
["Answers","72 h","growth rate. Three data points were used to determine the average specific growth rate: (t0,N0), (t2,N2) and (t3,N3), representing the initial cell density and the cell densities at days 2 and 3, respectively.","LC, NOEC, LOEC","EC10 EC50","","3 reps","OECD","Late phase exposnentially growing cells used. Varying between 3000 and 5000 coenobia/mL for coenobial algae and between 15,000 and 150,000 cells/mL for single-celled algae","","static, continuous light, shaken twice daily.","start and end of each test","","","","","Says it was measured at start and end of test - but not reported.",43.4,"Says it was determined from measured IC concentrations and pH values - but not reported.","","","Dissolved Ni was <3 µg/L (LOD) in culture medium."]
["Category","Freshwater/metal/plant","Paper and data unique identifier(eg. 1-1,10-150)","154-7"]
["Scores",10,10,5,5,5,5,2,5,5,4,4,0,4,4,4,1,3,1,0,1,3,81,0.83505154639175261,""]
["Answers","72 h","growth rate. Three data points were used to determine the average specific growth rate: (t0,N0), (t2,N2) and (t3,N3), representing the initial cell density and the cell densities at days 2 and 3, respectively.","LC, NOEC, LOEC","EC10 EC50","","3 reps","OECD","Late phase exposnentially growing cells used. Varying between 3000 and 5000 coenobia/mL for coenobial algae and between 15,000 and 150,000 cells/mL for single-celled algae","","static, continuous light, shaken twice daily.","start and end of each test","","","","","Says it was measured at start and end of test - but not reported.",43.4,"Says it was determined from measured IC concentrations and pH values - but not reported.","","","Dissolved Ni was <3 µg/L (LOD) in culture medium."]
["Category","Freshwater/metal/plant","Paper and data unique identifier(eg. 1-1,10-150)","154-8"]
["Scores",10,10,5,5,5,5,2,5,5,4,4,0,4,4,4,1,3,1,0,1,3,81,0.83505154639175261,""]
["Answers","72 h","growth rate. Three data points were used to determine the average specific growth rate: (t0,N0), (t2,N2) and (t3,N3), representing the initial cell density and the cell densities at days 2 and 3, respectively.","LC, NOEC, LOEC","EC10 EC50","","3 reps","OECD","Late phase exposnentially growing cells used. Varying between 3000 and 5000 coenobia/mL for coenobial algae and between 15,000 and 150,000 cells/mL for single-celled algae","","static, continuous light, shaken twice daily.","start and end of each test","","","","","Says it was measured at start and end of test - but not reported.",43.4,"Says it was determined from measured IC concentrations and pH values - but not reported.","","","Dissolved Ni was <3 µg/L (LOD) in culture medium."]
["Category","Freshwater/metal/plant","Paper and data unique identifier(eg. 1-1,10-150)","154-9"]
["Scores",10,10,5,5,5,5,2,5,5,4,4,0,4,4,4,1,3,1,0,1,3,81,0.83505154639175261,""]
["Answers","72 h","growth rate. Three data points were used to determine the average specific growth rate: (t0,N0), (t2,N2) and (t3,N3), representing the initial cell density and the cell densities at days 2 and 3, respectively.","LC, NOEC, LOEC","EC10 EC50","","3 reps","OECD","Late phase exposnentially growing cells used. Varying between 3000 and 5000 coenobia/mL for coenobial algae and between 15,000 and 150,000 cells/mL for single-celled algae","","static, continuous light, shaken twice daily.","start and end of each test","","","","","Says it was measured at start and end of test - but not reported.",16.3,"Says it was determined from measured IC concentrations and pH values - but not reported.","","","Dissolved Ni was <3 µg/L (LOD) in culture medium."]
["Category","Freshwater/metal/plant","Paper and data unique identifier(eg. 1-1,10-150)","154-10"]
["Scores",10,10,5,5,5,5,2,5,5,4,4,0,4,4,4,1,3,1,0,1,3,81,0.83505154639175261,""]
["Answers","72 h","growth rate. Three data points were used to determine the average specific growth rate: (t0,N0), (t2,N2) and (t3,N3), representing the initial cell density and the cell densities at days 2 and 3, respectively.","LC, NOEC, LOEC","EC10 EC50","","3 reps","OECD","Late phase exposnentially growing cells used. Varying between 3000 and 5000 coenobia/mL for coenobial algae and between 15,000 and 150,000 cells/mL for single-celled algae","","static, continuous light, shaken twice daily.","start and end of each test","","","","","Says it was measured at start and end of test - but not reported.",16.3,"Says it was determined from measured IC concentrations and pH values - but not reported.","","","Dissolved Ni was <3 µg/L (LOD) in culture medium."]
["Category","Freshwater/metal/plant","Paper and data unique identifier(eg. 1-1,10-150)","154-11"]
["Scores",10,10,5,5,5,5,2,5,5,4,4,0,4,4,4,1,3,1,0,1,3,81,0.83505154639175261,""]
["Answers","72 h","growth rate. Three data points were used to determine the average specific growth rate: (t0,N0), (t2,N2) and (t3,N3), representing the initial cell density and the cell densities at days 2 and 3, respectively.","LC, NOEC, LOEC","EC10 EC50","","3 reps","OECD","Late phase exposnentially growing cells used. Varying between 3000 and 5000 coenobia/mL for coenobial algae and between 15,000 and 150,000 cells/mL for single-celled algae","","static, continuous light, shaken twice daily.","start and end of each test","","","","","Says it was measured at start and end of test - but not reported.",43.4,"Says it was determined from measured IC concentrations and pH values - but not reported.","","","Dissolved Ni was <3 µg/L (LOD) in culture medium."]
["Category","Freshwater/metal/plant","Paper and data unique identifier(eg. 1-1,10-150)","154-12"]
["Scores",10,10,5,5,5,5,2,5,5,4,4,0,4,4,4,1,3,1,0,1,3,81,0.83505154639175261,""]
["Answers","72 h","growth rate. Three data points were used to determine the average specific growth rate: (t0,N0), (t2,N2) and (t3,N3), representing the initial cell density and the cell densities at days 2 and 3, respectively.","LC, NOEC, LOEC","EC10 EC50","","3 reps","OECD","Late phase exposnentially growing cells used. Varying between 3000 and 5000 coenobia/mL for coenobial algae and between 15,000 and 150,000 cells/mL for single-celled algae","","static, continuous light, shaken twice daily.","start and end of each test","","","","","Says it was measured at start and end of test - but not reported.",43.4,"Says it was determined from measured IC concentrations and pH values - but not reported.","","","Dissolved Ni was <3 µg/L (LOD) in culture medium."]
["Category","Freshwater/metal/plant","Paper and data unique identifier(eg. 1-1,10-150)","154-13"]
["Scores",10,10,5,5,5,5,2,5,5,4,4,0,4,4,4,1,3,1,0,1,3,81,0.83505154639175261,""]
["Answers","72 h","growth rate. Three data points were used to determine the average specific growth rate: (t0,N0), (t2,N2) and (t3,N3), representing the initial cell density and the cell densities at days 2 and 3, respectively.","LC, NOEC, LOEC","EC10 EC50","","3 reps","OECD","Late phase exposnentially growing cells used. Varying between 3000 and 5000 coenobia/mL for coenobial algae and between 15,000 and 150,000 cells/mL for single-celled algae","","static, continuous light, shaken twice daily.","start and end of each test","","","","","Says it was measured at start and end of test - but not reported.",16.3,"Says it was determined from measured IC concentrations and pH values - but not reported.","","","Dissolved Ni was <3 µg/L (LOD) in culture medium."]
["Category","Freshwater/metal/plant","Paper and data unique identifier(eg. 1-1,10-150)","154-14"]
["Scores",10,10,5,5,5,5,2,5,5,4,4,0,4,4,4,1,3,1,0,1,3,81,0.83505154639175261,""]
["Answers","72 h","growth rate. Three data points were used to determine the average specific growth rate: (t0,N0), (t2,N2) and (t3,N3), representing the initial cell density and the cell densities at days 2 and 3, respectively.","LC, NOEC, LOEC","EC10 EC50","","3 reps","OECD","Late phase exposnentially growing cells used. Varying between 3000 and 5000 coenobia/mL for coenobial algae and between 15,000 and 150,000 cells/mL for single-celled algae","","static, continuous light, shaken twice daily.","start and end of each test","","","","","Says it was measured at start and end of test - but not reported.",16.3,"Says it was determined from measured IC concentrations and pH values - but not reported.","","","Dissolved Ni was <3 µg/L (LOD) in culture medium."]
["Category","Freshwater/metal/plant","Paper and data unique identifier(eg. 1-1,10-150)","154-15"]
["Scores",10,10,5,5,5,5,2,5,5,4,4,0,4,4,4,1,3,1,0,1,3,81,0.83505154639175261,""]
["Answers","72 h","growth rate. Three data points were used to determine the average specific growth rate: (t0,N0), (t2,N2) and (t3,N3), representing the initial cell density and the cell densities at days 2 and 3, respectively.","LC, NOEC, LOEC","EC10 EC50","","3 reps","OECD","Late phase exposnentially growing cells used. Varying between 3000 and 5000 coenobia/mL for coenobial algae and between 15,000 and 150,000 cells/mL for single-celled algae","","static, continuous light, shaken twice daily.","start and end of each test","","","","","Says it was measured at start and end of test - but not reported.",43.4,"Says it was determined from measured IC concentrations and pH values - but not reported.","","","Dissolved Ni was <3 µg/L (LOD) in culture medium."]
["Category","Freshwater/metal/plant","Paper and data unique identifier(eg. 1-1,10-150)","154-16"]
["Scores",10,10,5,5,5,5,2,5,5,4,4,0,4,4,4,1,3,1,0,1,3,81,0.83505154639175261,""]
["Answers","72 h","growth rate. Three data points were used to determine the average specific growth rate: (t0,N0), (t2,N2) and (t3,N3), representing the initial cell density and the cell densities at days 2 and 3, respectively.","LC, NOEC, LOEC","EC10 EC50","","3 reps","OECD","Late phase exposnentially growing cells used. Varying between 3000 and 5000 coenobia/mL for coenobial algae and between 15,000 and 150,000 cells/mL for single-celled algae","","static, continuous light, shaken twice daily.","start and end of each test","","","","","Says it was measured at start and end of test - but not reported.",43.4,"Says it was determined from measured IC concentrations and pH values - but not reported.","","","Dissolved Ni was <3 µg/L (LOD) in culture medium."]
["Category","Freshwater/metal/plant","Paper and data unique identifier(eg. 1-1,10-150)","154-17"]
["Scores",10,10,5,5,5,5,2,5,5,4,4,0,4,4,4,1,3,1,0,1,3,81,0.83505154639175261,""]
["Answers","72 h","growth rate. Three data points were used to determine the average specific growth rate: (t0,N0), (t2,N2) and (t3,N3), representing the initial cell density and the cell densities at days 2 and 3, respectively.","LC, NOEC, LOEC","EC10 EC50","","3 reps","OECD","Late phase exposnentially growing cells used. Varying between 3000 and 5000 coenobia/mL for coenobial algae and between 15,000 and 150,000 cells/mL for single-celled algae","","static, continuous light, shaken twice daily.","start and end of each test","","","","","Says it was measured at start and end of test - but not reported.",16.3,"Says it was determined from measured IC concentrations and pH values - but not reported.","","","Dissolved Ni was <3 µg/L (LOD) in culture medium."]
["Category","Freshwater/metal/plant","Paper and data unique identifier(eg. 1-1,10-150)","154-18"]
["Scores",10,10,5,5,5,5,2,5,5,4,4,0,4,4,4,1,3,1,0,1,3,81,0.83505154639175261,""]
["Answers","72 h","growth rate. Three data points were used to determine the average specific growth rate: (t0,N0), (t2,N2) and (t3,N3), representing the initial cell density and the cell densities at days 2 and 3, respectively.","LC, NOEC, LOEC","EC10 EC50","","3 reps","OECD","Late phase exposnentially growing cells used. Varying between 3000 and 5000 coenobia/mL for coenobial algae and between 15,000 and 150,000 cells/mL for single-celled algae","","static, continuous light, shaken twice daily.","start and end of each test","","","","","Says it was measured at start and end of test - but not reported.",16.3,"Says it was determined from measured IC concentrations and pH values - but not reported.","","","Dissolved Ni was <3 µg/L (LOD) in culture medium."]
["Category","Freshwater/metal/plant","Paper and data unique identifier(eg. 1-1,10-150)","154-19"]
["Scores",10,10,5,5,5,5,2,5,5,4,4,0,4,4,4,1,3,1,0,1,3,81,0.83505154639175261,""]
["Answers","72 h","growth rate. Three data points were used to determine the average specific growth rate: (t0,N0), (t2,N2) and (t3,N3), representing the initial cell density and the cell densities at days 2 and 3, respectively.","LC, NOEC, LOEC","EC10 EC50","","3 reps","OECD","Late phase exposnentially growing cells used. Varying between 3000 and 5000 coenobia/mL for coenobial algae and between 15,000 and 150,000 cells/mL for single-celled algae","","static, continuous light, shaken twice daily.","start and end of each test","","","","","Says it was measured at start and end of test - but not reported.",16.3,"Says it was determined from measured IC concentrations and pH values - but not reported.","","","Dissolved Ni was <3 µg/L (LOD) in culture medium."]
["Category","Freshwater/metal/plant","Paper and data unique identifier(eg. 1-1,10-150)","154-20"]
["Scores",10,10,5,5,5,5,2,5,5,4,4,0,4,4,4,1,3,1,0,1,3,81,0.83505154639175261,""]
["Answers","72 h","growth rate. Three data points were used to determine the average specific growth rate: (t0,N0), (t2,N2) and (t3,N3), representing the initial cell density and the cell densities at days 2 and 3, respectively.","LC, NOEC, LOEC","EC10 EC50","","3 reps","OECD","Late phase exposnentially growing cells used. Varying between 3000 and 5000 coenobia/mL for coenobial algae and between 15,000 and 150,000 cells/mL for single-celled algae","","static, continuous light, shaken twice daily.","start and end of each test","","","","","Says it was measured at start and end of test - but not reported.",16.3,"Says it was determined from measured IC concentrations and pH values - but not reported.","","","Dissolved Ni was <3 µg/L (LOD) in culture medium."]
["Category","Freshwater/metal/plant","Paper and data unique identifier(eg. 1-1,10-150)","154-21"]
["Scores",10,10,5,5,5,5,2,5,5,4,4,0,4,4,4,1,3,1,0,1,3,81,0.83505154639175261,""]
["Answers","72 h","growth rate. Three data points were used to determine the average specific growth rate: (t0,N0), (t2,N2) and (t3,N3), representing the initial cell density and the cell densities at days 2 and 3, respectively.","LC, NOEC, LOEC","EC10 EC50","","3 reps","OECD","Late phase exposnentially growing cells used. Varying between 3000 and 5000 coenobia/mL for coenobial algae and between 15,000 and 150,000 cells/mL for single-celled algae","","static, continuous light, shaken twice daily.","start and end of each test","","","","","Says it was measured at start and end of test - but not reported.",43.4,"Says it was determined from measured IC concentrations and pH values - but not reported.","","","Dissolved Ni was <3 µg/L (LOD) in culture medium."]
["Category","Freshwater/metal/plant","Paper and data unique identifier(eg. 1-1,10-150)","154-22"]
["Scores",10,10,5,5,5,5,2,5,5,4,4,0,4,4,4,1,3,1,0,1,3,81,0.83505154639175261,""]
["Answers","72 h","growth rate. Three data points were used to determine the average specific growth rate: (t0,N0), (t2,N2) and (t3,N3), representing the initial cell density and the cell densities at days 2 and 3, respectively.","LC, NOEC, LOEC","EC10 EC50","","3 reps","OECD","Late phase exposnentially growing cells used. Varying between 3000 and 5000 coenobia/mL for coenobial algae and between 15,000 and 150,000 cells/mL for single-celled algae","","static, continuous light, shaken twice daily.","start and end of each test","","","","","Says it was measured at start and end of test - but not reported.",43.4,"Says it was determined from measured IC concentrations and pH values - but not reported.","","","Dissolved Ni was <3 µg/L (LOD) in culture medium."]
["Category","Freshwater/metal/plant","Paper and data unique identifier(eg. 1-1,10-150)","154-23"]
["Scores",10,10,5,5,5,5,2,5,5,4,4,0,4,4,4,1,3,1,0,1,3,81,0.83505154639175261,""]
["Answers","72 h","growth rate. Three data points were used to determine the average specific growth rate: (t0,N0), (t2,N2) and (t3,N3), representing the initial cell density and the cell densities at days 2 and 3, respectively.","LC, NOEC, LOEC","EC10 EC50","","3 reps","OECD","Late phase exposnentially growing cells used. Varying between 3000 and 5000 coenobia/mL for coenobial algae and between 15,000 and 150,000 cells/mL for single-celled algae","","static, continuous light, shaken twice daily.","start and end of each test","","","","","Says it was measured at start and end of test - but not reported.",43.4,"Says it was determined from measured IC concentrations and pH values - but not reported.","","","Dissolved Ni was <3 µg/L (LOD) in culture medium."]
["Category","Freshwater/metal/plant","Paper and data unique identifier(eg. 1-1,10-150)","154-24"]
["Scores",10,10,5,5,5,5,2,5,5,4,4,0,4,4,4,1,3,1,0,1,3,81,0.83505154639175261,""]
["Answers","72 h","growth rate. Three data points were used to determine the average specific growth rate: (t0,N0), (t2,N2) and (t3,N3), representing the initial cell density and the cell densities at days 2 and 3, respectively.","LC, NOEC, LOEC","EC10 EC50","","3 reps","OECD","Late phase exposnentially growing cells used. Varying between 3000 and 5000 coenobia/mL for coenobial algae and between 15,000 and 150,000 cells/mL for single-celled algae","","static, continuous light, shaken twice daily.","start and end of each test","","","","","Says it was measured at start and end of test - but not reported.",43.4,"Says it was determined from measured IC concentrations and pH values - but not reported.","","","Dissolved Ni was <3 µg/L (LOD) in culture medium."]
["Category","Freshwater/metal/plant","Paper and data unique identifier(eg. 1-1,10-150)","154-25"]
["Scores",10,10,5,5,5,5,2,5,5,4,4,0,4,4,4,1,3,1,0,1,3,81,0.83505154639175261,""]
["Answers","72 h","growth rate. Three data points were used to determine the average specific growth rate: (t0,N0), (t2,N2) and (t3,N3), representing the initial cell density and the cell densities at days 2 and 3, respectively.","LC, NOEC, LOEC","EC10 EC50","","3 reps","OECD","Late phase exposnentially growing cells used. Varying between 3000 and 5000 coenobia/mL for coenobial algae and between 15,000 and 150,000 cells/mL for single-celled algae","","static, continuous light, shaken twice daily.","start and end of each test","","","","","Says it was measured at start and end of test - but not reported.",16.3,"Says it was determined from measured IC concentrations and pH values - but not reported.","","","Dissolved Ni was <3 µg/L (LOD) in culture medium."]
["Category","Freshwater/metal/plant","Paper and data unique identifier(eg. 1-1,10-150)","154-26"]
["Scores",10,10,5,5,5,5,2,5,5,4,4,0,4,4,4,1,3,1,0,1,3,81,0.83505154639175261,""]
["Answers","72 h","growth rate. Three data points were used to determine the average specific growth rate: (t0,N0), (t2,N2) and (t3,N3), representing the initial cell density and the cell densities at days 2 and 3, respectively.","LC, NOEC, LOEC","EC10 EC50","","3 reps","OECD","Late phase exposnentially growing cells used. Varying between 3000 and 5000 coenobia/mL for coenobial algae and between 15,000 and 150,000 cells/mL for single-celled algae","","static, continuous light, shaken twice daily.","start and end of each test","","","","","Says it was measured at start and end of test - but not reported.",16.3,"Says it was determined from measured IC concentrations and pH values - but not reported.","","","Dissolved Ni was <3 µg/L (LOD) in culture medium."]
["Category","Freshwater/metal/plant","Paper and data unique identifier(eg. 1-1,10-150)","154-27"]
["Scores",10,10,5,5,5,5,2,5,5,4,4,0,4,4,4,1,3,1,0,1,3,81,0.83505154639175261,""]
["Answers","72 h","growth rate. Three data points were used to determine the average specific growth rate: (t0,N0), (t2,N2) and (t3,N3), representing the initial cell density and the cell densities at days 2 and 3, respectively.","LC, NOEC, LOEC","EC10 EC50","","3 reps","OECD","Late phase exposnentially growing cells used. Varying between 3000 and 5000 coenobia/mL for coenobial algae and between 15,000 and 150,000 cells/mL for single-celled algae","","static, continuous light, shaken twice daily.","start and end of each test","","","","","Says it was measured at start and end of test - but not reported.",43.4,"Says it was determined from measured IC concentrations and pH values - but not reported.","","","Dissolved Ni was <3 µg/L (LOD) in culture medium."]
["Category","Freshwater/metal/plant","Paper and data unique identifier(eg. 1-1,10-150)","154-28"]
["Scores",10,10,5,5,5,5,2,5,5,4,4,0,4,4,4,1,3,1,0,1,3,81,0.83505154639175261,""]
["Answers","72 h","growth rate. Three data points were used to determine the average specific growth rate: (t0,N0), (t2,N2) and (t3,N3), representing the initial cell density and the cell densities at days 2 and 3, respectively.","LC, NOEC, LOEC","EC10 EC50","","3 reps","OECD","Late phase exposnentially growing cells used. Varying between 3000 and 5000 coenobia/mL for coenobial algae and between 15,000 and 150,000 cells/mL for single-celled algae","","static, continuous light, shaken twice daily.","start and end of each test","","","","","Says it was measured at start and end of test - but not reported.",43.4,"Says it was determined from measured IC concentrations and pH values - but not reported.","","","Dissolved Ni was <3 µg/L (LOD) in culture medium."]
["Category","Freshwater/metal/plant","Paper and data unique identifier(eg. 1-1,10-150)","154-29"]
["Scores",10,10,5,5,5,5,2,5,5,4,4,0,4,4,4,1,3,1,0,1,3,81,0.83505154639175261,""]
["Answers","72 h","growth rate. Three data points were used to determine the average specific growth rate: (t0,N0), (t2,N2) and (t3,N3), representing the initial cell density and the cell densities at days 2 and 3, respectively.","LC, NOEC, LOEC","EC10 EC50","","3 reps","OECD","Late phase exposnentially growing cells used. Varying between 3000 and 5000 coenobia/mL for coenobial algae and between 15,000 and 150,000 cells/mL for single-celled algae","","static, continuous light, shaken twice daily.","start and end of each test","","","","","Says it was measured at start and end of test - but not reported.",6.25,"Says it was determined from measured IC concentrations and pH values - but not reported.","","","Dissolved Ni was <3 µg/L (LOD) in culture medium."]
["Category","Freshwater/metal/plant","Paper and data unique identifier(eg. 1-1,10-150)","154-30"]
["Scores",10,10,5,5,5,5,2,5,5,4,4,0,4,4,4,1,3,1,0,1,3,81,0.83505154639175261,""]
["Answers","72 h","growth rate. Three data points were used to determine the average specific growth rate: (t0,N0), (t2,N2) and (t3,N3), representing the initial cell density and the cell densities at days 2 and 3, respectively.","LC, NOEC, LOEC","EC10 EC50","","3 reps","OECD","Late phase exposnentially growing cells used. Varying between 3000 and 5000 coenobia/mL for coenobial algae and between 15,000 and 150,000 cells/mL for single-celled algae","","static, continuous light, shaken twice daily.","start and end of each test","","","","","Says it was measured at start and end of test - but not reported.",6.25,"Says it was determined from measured IC concentrations and pH values - but not reported.","","","Dissolved Ni was <3 µg/L (LOD) in culture medium."]
["Category","Freshwater/metal/plant","Paper and data unique identifier(eg. 1-1,10-150)","154-31"]
["Scores",10,10,5,5,5,5,2,5,5,4,4,0,4,4,4,1,3,1,0,1,3,81,0.83505154639175261,""]
["Answers","72 h","growth rate. Three data points were used to determine the average specific growth rate: (t0,N0), (t2,N2) and (t3,N3), representing the initial cell density and the cell densities at days 2 and 3, respectively.","LC, NOEC, LOEC","EC10 EC50","","3 reps","OECD","Late phase exposnentially growing cells used. Varying between 3000 and 5000 coenobia/mL for coenobial algae and between 15,000 and 150,000 cells/mL for single-celled algae","","static, continuous light, shaken twice daily.","start and end of each test","","","","","Says it was measured at start and end of test - but not reported.",16.3,"Says it was determined from measured IC concentrations and pH values - but not reported.","","","Dissolved Ni was <3 µg/L (LOD) in culture medium."]
["Category","Freshwater/metal/plant","Paper and data unique identifier(eg. 1-1,10-150)","154-32"]
["Scores",10,10,5,5,5,5,2,5,5,4,4,0,4,4,4,1,3,1,0,1,3,81,0.83505154639175261,""]
["Answers","72 h","growth rate. Three data points were used to determine the average specific growth rate: (t0,N0), (t2,N2) and (t3,N3), representing the initial cell density and the cell densities at days 2 and 3, respectively.","LC, NOEC, LOEC","EC10 EC50","","3 reps","OECD","Late phase exposnentially growing cells used. Varying between 3000 and 5000 coenobia/mL for coenobial algae and between 15,000 and 150,000 cells/mL for single-celled algae","","static, continuous light, shaken twice daily.","start and end of each test","","","","","Says it was measured at start and end of test - but not reported.",16.3,"Says it was determined from measured IC concentrations and pH values - but not reported.","","","Dissolved Ni was <3 µg/L (LOD) in culture medium."]
["Category","Freshwater/metal/plant","Paper and data unique identifier(eg. 1-1,10-150)","154-33"]
["Scores",10,10,5,5,5,5,2,5,5,4,4,0,4,4,4,1,3,1,0,1,3,81,0.83505154639175261,""]
["Answers","72 h","growth rate. Three data points were used to determine the average specific growth rate: (t0,N0), (t2,N2) and (t3,N3), representing the initial cell density and the cell densities at days 2 and 3, respectively.","LC, NOEC, LOEC","EC10 EC50","","3 reps","OECD","Late phase exposnentially growing cells used. Varying between 3000 and 5000 coenobia/mL for coenobial algae and between 15,000 and 150,000 cells/mL for single-celled algae","","static, continuous light, shaken twice daily.","start and end of each test","","","","","Says it was measured at start and end of test - but not reported.",6.25,"Says it was determined from measured IC concentrations and pH values - but not reported.","","","Dissolved Ni was <3 µg/L (LOD) in culture medium."]
["Category","Freshwater/metal/plant","Paper and data unique identifier(eg. 1-1,10-150)","154-34"]
["Scores",10,10,5,5,5,5,2,5,5,4,4,0,4,4,4,1,3,1,0,1,3,81,0.83505154639175261,""]
["Answers","72 h","growth rate. Three data points were used to determine the average specific growth rate: (t0,N0), (t2,N2) and (t3,N3), representing the initial cell density and the cell densities at days 2 and 3, respectively.","LC, NOEC, LOEC","EC10 EC50","","3 reps","OECD","Late phase exposnentially growing cells used. Varying between 3000 and 5000 coenobia/mL for coenobial algae and between 15,000 and 150,000 cells/mL for single-celled algae","","static, continuous light, shaken twice daily.","start and end of each test","","","","","Says it was measured at start and end of test - but not reported.",6.25,"Says it was determined from measured IC concentrations and pH values - but not reported.","","","Dissolved Ni was <3 µg/L (LOD) in culture medium."]
["Category","Freshwater/metal/plant","Paper and data unique identifier(eg. 1-1,10-150)","154-35"]
["Scores",10,10,5,5,5,5,2,5,5,4,4,0,4,4,4,1,3,1,0,1,3,81,0.83505154639175261,""]
["Answers","72 h","growth rate. Three data points were used to determine the average specific growth rate: (t0,N0), (t2,N2) and (t3,N3), representing the initial cell density and the cell densities at days 2 and 3, respectively.","LC, NOEC, LOEC","EC10 EC50","","3 reps","OECD","Late phase exposnentially growing cells used. Varying between 3000 and 5000 coenobia/mL for coenobial algae and between 15,000 and 150,000 cells/mL for single-celled algae","","static, continuous light, shaken twice daily.","start and end of each test","","","","","Says it was measured at start and end of test - but not reported.",16.3,"Says it was determined from measured IC concentrations and pH values - but not reported.","","","Dissolved Ni was <3 µg/L (LOD) in culture medium."]
["Category","Freshwater/metal/plant","Paper and data unique identifier(eg. 1-1,10-150)","154-36"]
["Scores",10,10,5,5,5,5,2,5,5,4,4,0,4,4,4,1,3,1,0,1,3,81,0.83505154639175261,""]
["Answers","72 h","growth rate. Three data points were used to determine the average specific growth rate: (t0,N0), (t2,N2) and (t3,N3), representing the initial cell density and the cell densities at days 2 and 3, respectively.","LC, NOEC, LOEC","EC10 EC50","","3 reps","OECD","Late phase exposnentially growing cells used. Varying between 3000 and 5000 coenobia/mL for coenobial algae and between 15,000 and 150,000 cells/mL for single-celled algae","","static, continuous light, shaken twice daily.","start and end of each test","","","","","Says it was measured at start and end of test - but not reported.",16.3,"Says it was determined from measured IC concentrations and pH values - but not reported.","","","Dissolved Ni was <3 µg/L (LOD) in culture medium."]
["Category","Freshwater/metal/plant","Paper and data unique identifier(eg. 1-1,10-150)","154-37"]
["Scores",10,10,5,5,5,5,2,5,5,4,4,0,4,4,4,1,3,1,0,1,3,81,0.83505154639175261,""]
["Answers","72 h","growth rate. Three data points were used to determine the average specific growth rate: (t0,N0), (t2,N2) and (t3,N3), representing the initial cell density and the cell densities at days 2 and 3, respectively.","LC, NOEC, LOEC","EC10 EC50","","3 reps","OECD","Late phase exposnentially growing cells used. Varying between 3000 and 5000 coenobia/mL for coenobial algae and between 15,000 and 150,000 cells/mL for single-celled algae","","static, continuous light, shaken twice daily.","start and end of each test","","","","","Says it was measured at start and end of test - but not reported.",6.25,"Says it was determined from measured IC concentrations and pH values - but not reported.","","","Dissolved Ni was <3 µg/L (LOD) in culture medium."]
["Category","Freshwater/metal/plant","Paper and data unique identifier(eg. 1-1,10-150)","154-38"]
["Scores",10,10,5,5,5,5,2,5,5,4,4,0,4,4,4,1,3,1,0,1,3,81,0.83505154639175261,""]
["Answers","72 h","growth rate. Three data points were used to determine the average specific growth rate: (t0,N0), (t2,N2) and (t3,N3), representing the initial cell density and the cell densities at days 2 and 3, respectively.","LC, NOEC, LOEC","EC10 EC50","","3 reps","OECD","Late phase exposnentially growing cells used. Varying between 3000 and 5000 coenobia/mL for coenobial algae and between 15,000 and 150,000 cells/mL for single-celled algae","","static, continuous light, shaken twice daily.","start and end of each test","","","","","Says it was measured at start and end of test - but not reported.",6.25,"Says it was determined from measured IC concentrations and pH values - but not reported.","","","Dissolved Ni was <3 µg/L (LOD) in culture medium."]
["Category","Freshwater/metal/plant","Paper and data unique identifier(eg. 1-1,10-150)","154-39"]
["Scores",10,10,5,5,5,5,2,5,5,4,4,0,4,4,4,1,3,1,0,1,3,81,0.83505154639175261,""]
["Answers","72 h","growth rate. Three data points were used to determine the average specific growth rate: (t0,N0), (t2,N2) and (t3,N3), representing the initial cell density and the cell densities at days 2 and 3, respectively.","LC, NOEC, LOEC","EC10 EC50","","3 reps","OECD","Late phase exposnentially growing cells used. Varying between 3000 and 5000 coenobia/mL for coenobial algae and between 15,000 and 150,000 cells/mL for single-celled algae","","static, continuous light, shaken twice daily.","start and end of each test","","","","","Says it was measured at start and end of test - but not reported.",16.3,"Says it was determined from measured IC concentrations and pH values - but not reported.","","","Dissolved Ni was <3 µg/L (LOD) in culture medium."]
["Category","Freshwater/metal/plant","Paper and data unique identifier(eg. 1-1,10-150)","154-40"]
["Scores",10,10,5,5,5,5,2,5,5,4,4,0,4,4,4,1,3,1,0,1,3,81,0.83505154639175261,""]
["Answers","72 h","growth rate. Three data points were used to determine the average specific growth rate: (t0,N0), (t2,N2) and (t3,N3), representing the initial cell density and the cell densities at days 2 and 3, respectively.","LC, NOEC, LOEC","EC10 EC50","","3 reps","OECD","Late phase exposnentially growing cells used. Varying between 3000 and 5000 coenobia/mL for coenobial algae and between 15,000 and 150,000 cells/mL for single-celled algae","","static, continuous light, shaken twice daily.","start and end of each test","","","","","Says it was measured at start and end of test - but not reported.",16.3,"Says it was determined from measured IC concentrations and pH values - but not reported.","","","Dissolved Ni was <3 µg/L (LOD) in culture medium."]
["Category","Freshwater/metal/plant","Paper and data unique identifier(eg. 1-1,10-150)","154-41"]
["Scores",10,10,5,5,5,5,2,5,5,4,4,0,4,4,4,1,3,1,0,1,3,81,0.83505154639175261,""]
["Answers","72 h","growth rate. Three data points were used to determine the average specific growth rate: (t0,N0), (t2,N2) and (t3,N3), representing the initial cell density and the cell densities at days 2 and 3, respectively.","LC, NOEC, LOEC","EC10 EC50","","3 reps","OECD","Late phase exposnentially growing cells used. Varying between 3000 and 5000 coenobia/mL for coenobial algae and between 15,000 and 150,000 cells/mL for single-celled algae","","static, continuous light, shaken twice daily.","start and end of each test","","","","","Says it was measured at start and end of test - but not reported.",6.25,"Says it was determined from measured IC concentrations and pH values - but not reported.","","","Dissolved Ni was <3 µg/L (LOD) in culture medium."]
["Category","Freshwater/metal/plant","Paper and data unique identifier(eg. 1-1,10-150)","154-42"]
["Scores",10,10,5,5,5,5,2,5,5,4,4,0,4,4,4,1,3,1,0,1,3,81,0.83505154639175261,""]
["Answers","72 h","growth rate. Three data points were used to determine the average specific growth rate: (t0,N0), (t2,N2) and (t3,N3), representing the initial cell density and the cell densities at days 2 and 3, respectively.","LC, NOEC, LOEC","EC10 EC50","","3 reps","OECD","Late phase exposnentially growing cells used. Varying between 3000 and 5000 coenobia/mL for coenobial algae and between 15,000 and 150,000 cells/mL for single-celled algae","","static, continuous light, shaken twice daily.","start and end of each test","","","","","Says it was measured at start and end of test - but not reported.",6.25,"Says it was determined from measured IC concentrations and pH values - but not reported.","","","Dissolved Ni was <3 µg/L (LOD) in culture medium."]
["Category","Freshwater/metal/plant","Paper and data unique identifier(eg. 1-1,10-150)","154-43"]
["Scores",10,10,5,5,5,5,2,5,5,4,4,0,4,4,4,1,3,1,0,1,3,81,0.83505154639175261,""]
["Answers","72 h","growth rate. Three data points were used to determine the average specific growth rate: (t0,N0), (t2,N2) and (t3,N3), representing the initial cell density and the cell densities at days 2 and 3, respectively.","LC, NOEC, LOEC","EC10 EC50","","3 reps","OECD","Late phase exposnentially growing cells used. Varying between 3000 and 5000 coenobia/mL for coenobial algae and between 15,000 and 150,000 cells/mL for single-celled algae","","static, continuous light, shaken twice daily.","start and end of each test","","","","","Says it was measured at start and end of test - but not reported.",16.3,"Says it was determined from measured IC concentrations and pH values - but not reported.","","","Dissolved Ni was <3 µg/L (LOD) in culture medium."]
["Category","Freshwater/metal/plant","Paper and data unique identifier(eg. 1-1,10-150)","154-44"]
["Scores",10,10,5,5,5,5,2,5,5,4,4,0,4,4,4,1,3,1,0,1,3,81,0.83505154639175261,""]
["Answers","72 h","growth rate. Three data points were used to determine the average specific growth rate: (t0,N0), (t2,N2) and (t3,N3), representing the initial cell density and the cell densities at days 2 and 3, respectively.","LC, NOEC, LOEC","EC10 EC50","","3 reps","OECD","Late phase exposnentially growing cells used. Varying between 3000 and 5000 coenobia/mL for coenobial algae and between 15,000 and 150,000 cells/mL for single-celled algae","","static, continuous light, shaken twice daily.","start and end of each test","","","","","Says it was measured at start and end of test - but not reported.",16.3,"Says it was determined from measured IC concentrations and pH values - but not reported.","","","Dissolved Ni was <3 µg/L (LOD) in culture medium."]
["Category","Freshwater/metal/plant","Paper and data unique identifier(eg. 1-1,10-150)","154-45"]
["Scores",10,10,5,5,5,5,2,5,5,4,4,0,4,4,4,1,3,1,0,1,3,81,0.83505154639175261,""]
["Answers","72 h","growth rate. Three data points were used to determine the average specific growth rate: (t0,N0), (t2,N2) and (t3,N3), representing the initial cell density and the cell densities at days 2 and 3, respectively.","LC, NOEC, LOEC","EC10 EC50","","3 reps","OECD","Late phase exposnentially growing cells used. Varying between 3000 and 5000 coenobia/mL for coenobial algae and between 15,000 and 150,000 cells/mL for single-celled algae","","static, continuous light, shaken twice daily.","start and end of each test","","","","","Says it was measured at start and end of test - but not reported.",6.25,"Says it was determined from measured IC concentrations and pH values - but not reported.","","","Dissolved Ni was <3 µg/L (LOD) in culture medium."]
["Category","Freshwater/metal/plant","Paper and data unique identifier(eg. 1-1,10-150)","154-46"]
["Scores",10,10,5,5,5,5,2,5,5,4,4,0,4,4,4,1,3,1,0,1,3,81,0.83505154639175261,""]
["Answers","72 h","growth rate. Three data points were used to determine the average specific growth rate: (t0,N0), (t2,N2) and (t3,N3), representing the initial cell density and the cell densities at days 2 and 3, respectively.","LC, NOEC, LOEC","EC10 EC50","","3 reps","OECD","Late phase exposnentially growing cells used. Varying between 3000 and 5000 coenobia/mL for coenobial algae and between 15,000 and 150,000 cells/mL for single-celled algae","","static, continuous light, shaken twice daily.","start and end of each test","","","","","Says it was measured at start and end of test - but not reported.",6.25,"Says it was determined from measured IC concentrations and pH values - but not reported.","","","Dissolved Ni was <3 µg/L (LOD) in culture medium."]
["Category","Freshwater/metal/plant","Paper and data unique identifier(eg. 1-1,10-150)","154-47"]
["Scores",10,10,5,5,5,5,2,5,5,4,4,0,4,4,4,1,3,1,0,1,3,81,0.83505154639175261,""]
["Answers","72 h","growth rate. Three data points were used to determine the average specific growth rate: (t0,N0), (t2,N2) and (t3,N3), representing the initial cell density and the cell densities at days 2 and 3, respectively.","LC, NOEC, LOEC","EC10 EC50","","3 reps","OECD","Late phase exposnentially growing cells used. Varying between 3000 and 5000 coenobia/mL for coenobial algae and between 15,000 and 150,000 cells/mL for single-celled algae","","static, continuous light, shaken twice daily.","start and end of each test","","","","","Says it was measured at start and end of test - but not reported.",16.3,"Says it was determined from measured IC concentrations and pH values - but not reported.","","","Dissolved Ni was <3 µg/L (LOD) in culture medium."]
["Category","Freshwater/metal/plant","Paper and data unique identifier(eg. 1-1,10-150)","154-48"]
["Scores",10,10,5,5,5,5,2,5,5,4,4,0,4,4,4,1,3,1,0,1,3,81,0.83505154639175261,""]
["Answers","72 h","growth rate. Three data points were used to determine the average specific growth rate: (t0,N0), (t2,N2) and (t3,N3), representing the initial cell density and the cell densities at days 2 and 3, respectively.","LC, NOEC, LOEC","EC10 EC50","","3 reps","OECD","Late phase exposnentially growing cells used. Varying between 3000 and 5000 coenobia/mL for coenobial algae and between 15,000 and 150,000 cells/mL for single-celled algae","","static, continuous light, shaken twice daily.","start and end of each test","","","","","Says it was measured at start and end of test - but not reported.",16.3,"Says it was determined from measured IC concentrations and pH values - but not reported.","","","Dissolved Ni was <3 µg/L (LOD) in culture medium."]
["Category","Freshwater/metal/plant","Paper and data unique identifier(eg. 1-1,10-150)","156-1"]
["Scores",10,10,5,5,5,5,0,5,5,4,0,0,0,4,4,0,0,0,0,1,0,63,0.64948453608247425,"The highest possible grade for this datum is acceptable."]
["Answers","12 d","growth rate inhibition by calculating coenobia number in hemocytometer","EC","EC50","","triplicate","no mention of acceptability criteria","Exponentially growing algae, 25,000 coenobia","modified Knopp solution without calcium (Fargasova 1994)","static","","","Just EC50 values provided","probit","95% CLs","","","","","25 ± 1",""]
["Category","Freshwater/metal/plant","Paper and data unique identifier(eg. 1-1,10-150)","156-2"]
["Scores",10,10,5,5,5,5,0,5,5,4,0,0,0,4,4,0,0,0,0,1,0,63,0.64948453608247425,"The highest possible grade for this datum is acceptable."]
["Answers","12 d","growth rate inhibition by calculating coenobia number in hemocytometer","EC","EC50","","triplicate","no mention of acceptability criteria","Exponentially growing algae, 25,000 coenobia","modified Knopp solution without calcium (Fargasova 1994)","static","","","Just EC50 values provided","probit","95% CLs","","","","","25 ± 1",""]
["Category","Freshwater/metal/plant","Paper and data unique identifier(eg. 1-1,10-150)","156-3"]
["Scores",10,10,5,5,5,5,0,5,5,4,0,0,0,4,4,0,0,0,0,1,0,63,0.64948453608247425,"The highest possible grade for this datum is acceptable."]
["Answers","12 d","growth rate inhibition by calculating coenobia number in hemocytometer","EC","EC50","","triplicate","no mention of acceptability criteria","Exponentially growing algae, 25,000 coenobia","modified Knopp solution without calcium (Fargasova 1994)","static","","","Just EC50 values provided","probit","95% CLs","","","","","25 ± 1",""]
["Category","Freshwater/metal/plant","Paper and data unique identifier(eg. 1-1,10-150)","156-4"]
["Scores",10,10,5,5,5,5,0,5,5,4,0,0,0,4,4,0,0,0,0,1,0,63,0.64948453608247425,"The highest possible grade for this datum is acceptable."]
["Answers","12 d","growth rate inhibition by calculating coenobia number in hemocytometer","EC","EC50","","triplicate","no mention of acceptability criteria","Exponentially growing algae, 25,000 coenobia","modified Knopp solution without calcium (Fargasova 1994)","static","","","Just EC50 values provided","probit","95% CLs","","","","","25 ± 1",""]
["Category","Freshwater/metal/plant","Paper and data unique identifier(eg. 1-1,10-150)","157-1"]
["Scores",10,10,5,5,5,5,2,0,5,0,4,0,4,4,4,3,3,0,1,3,3,76,0.78350515463917525,""]
["Answers","7 d","Root length","IC",25,"","3-6 reps","Environment Canada protocol","","APHA modified with 0.5mg DOC/L","","","","stated and figures.","CETIS, and removal of outliers, Linear regression or linear interpolation.","95% CLs in SI table","8.15-8.23","92 mg CaCO3/L","","0.5 mg/L DOC","25 ± 2","ultrapure Ni(NO3)2 powder (Puratronic\n99.9985%; Alfa Aesar)."]
["Category","Freshwater/metal/plant","Paper and data unique identifier(eg. 1-1,10-150)","157-3"]
["Scores",10,10,5,5,5,5,2,0,5,0,4,0,4,4,4,3,3,0,1,3,3,76,0.78350515463917525,""]
["Answers","7 d","Yield -  number of fronds","IC",25,"","3-6 reps","Environment Canada protocol","","APHA modified with 0.5mg DOC/L","","","","stated and figures.","CETIS, and removal of outliers, Linear regression or linear interpolation.","95% CLs in SI table","8.15-8.23","92 mg CaCO3/L","","0.5 mg/L DOC","25 ± 2","ultrapure Ni(NO3)2 powder (Puratronic\n99.9985%; Alfa Aesar)."]
["Category","Freshwater/metal/plant","Paper and data unique identifier(eg. 1-1,10-150)","157-2"]
["Scores",10,10,5,5,5,5,2,0,5,0,4,0,4,4,4,3,3,0,1,3,3,76,0.78350515463917525,""]
["Answers","7 d","Yield -  number of fronds","IC",25,"","3-6 reps","Environment Canada protocol","","APHA modified with 0.5mg DOC/L","","","","stated and figures.","CETIS, and removal of outliers, Linear regression or linear interpolation.","95% CLs in SI table","8.15-8.23","92 mg CaCO3/L","","0.5 mg/L DOC","25 ± 2","ultrapure Ni(NO3)2 powder (Puratronic\n99.9985%; Alfa Aesar)."]
["Category","Freshwater/metal/plant","Paper and data unique identifier(eg. 1-1,10-150)","160-1"]
["Scores",10,10,5,5,5,5,0,5,5,0,2,0,4,4,4,3,0,0,0,3,0,70,0.72164948453608246,""]
["Answers","14 d","no of leaves at end of test","EC",50,"","5 replicates","","healthy turions (dormant front) in the initial stage of first leafy stem development","detailed recipe given. Nutrient medium","","","","","","95% CLs","6.0 ± 0.3","","","","28 ± 1",""]
["Category","Freshwater/metal/plant","Paper and data unique identifier(eg. 1-1,10-150)","162-46"]
["Scores",10,10,5,5,5,5,5,5,5,4,4,0,4,4,4,3,3,3,3,3,3,93,0.95876288659793818,""]
["Answers","7 d","root length","","","","3 replicates","7-fold increase in frond number in controls","2 3-frond colonies","Calapooia R water","Daily static renewal","measured throughout","","","","",8,212,200,0.69,"25 ± 1",""]
["Category","Freshwater/metal/plant","Paper and data unique identifier(eg. 1-1,10-150)","162-47"]
["Scores",10,10,5,5,5,5,5,5,5,4,4,0,4,4,4,3,3,3,3,3,3,93,0.95876288659793818,""]
["Answers","7 d","root length","","","","3 replicates","7-fold increase in frond number in controls","2 3-frond colonies","Calapooia R water","Daily static renewal","measured throughout","","","","",8,212,200,0.69,"25 ± 1",""]
["Category","Freshwater/metal/plant","Paper and data unique identifier(eg. 1-1,10-150)","162-48"]
["Scores",10,10,5,5,5,5,5,5,5,4,4,0,4,4,4,3,3,3,3,3,3,93,0.95876288659793818,""]
["Answers","7 d","root length","","","","3 replicates","7-fold increase in frond number in controls","2 3-frond colonies","S. Platte R water","Daily static renewal","measured throughout","","","","",7.8,256,160,7.1,"25 ± 1",""]
["Category","Freshwater/metal/plant","Paper and data unique identifier(eg. 1-1,10-150)","162-49"]
["Scores",10,10,5,5,5,5,5,5,5,4,4,0,4,4,4,3,3,3,3,3,3,93,0.95876288659793818,""]
["Answers","7 d","root length","","","","3 replicates","7-fold increase in frond number in controls","2 3-frond colonies","S. Platte R water","Daily static renewal","measured throughout","","","","",7.8,256,160,7.1,"25 ± 1",""]
["Category","Freshwater/metal/plant","Paper and data unique identifier(eg. 1-1,10-150)","162-50"]
["Scores",10,10,5,5,5,5,5,5,5,4,4,0,4,4,4,3,3,3,3,3,3,93,0.95876288659793818,""]
["Answers","7 d","root length","","","","3 replicates","7-fold increase in frond number in controls","2 3-frond colonies","S. Platte R water, pH amended","Daily static renewal","measured throughout","","","","",6.9,256,16,7,"25 ± 1",""]
["Category","Freshwater/metal/plant","Paper and data unique identifier(eg. 1-1,10-150)","162-51"]
["Scores",10,10,5,5,5,5,5,5,5,4,4,0,4,4,4,3,3,3,3,3,3,93,0.95876288659793818,""]
["Answers","7 d","root length","","","","3 replicates","7-fold increase in frond number in controls","2 3-frond colonies","S. Platte R water, pH amended","Daily static renewal","measured throughout","","","","",6.9,256,16,7,"25 ± 1",""]
["Category","Freshwater/metal/plant","Paper and data unique identifier(eg. 1-1,10-150)","162-52"]
["Scores",10,10,5,5,5,5,5,5,5,4,4,0,4,4,4,3,3,3,3,3,3,93,0.95876288659793818,""]
["Answers","7 d","root length","","","","3 replicates","7-fold increase in frond number in controls","2 3-frond colonies","S. Sanitam R water","Daily static renewal","measured throughout","","","","",7.1,16,24,0.94,"25 ± 1",""]
["Category","Freshwater/metal/plant","Paper and data unique identifier(eg. 1-1,10-150)","162-53"]
["Scores",10,10,5,5,5,5,5,5,5,4,4,0,4,4,4,3,3,3,3,3,3,93,0.95876288659793818,""]
["Answers","7 d","root length","","","","3 replicates","7-fold increase in frond number in controls","2 3-frond colonies","S. Sanitam R water","Daily static renewal","measured throughout","","","","",7.1,16,24,0.94,"25 ± 1",""]
["Category","Freshwater/metal/plant","Paper and data unique identifier(eg. 1-1,10-150)","162-54"]
["Scores",10,10,5,5,5,5,5,5,5,4,4,0,4,4,4,3,3,3,3,3,3,93,0.95876288659793818,""]
["Answers","7 d","root length","","","","3 replicates","7-fold increase in frond number in controls","2 3-frond colonies","Zollner Creek water","Daily static renewal","measured throughout","","","","",7.3,136,28,7.1,"25 ± 1",""]
["Category","Freshwater/metal/plant","Paper and data unique identifier(eg. 1-1,10-150)","162-55"]
["Scores",10,10,5,5,5,5,5,5,5,4,4,0,4,4,4,3,3,3,3,3,3,93,0.95876288659793818,""]
["Answers","7 d","root length","","","","3 replicates","7-fold increase in frond number in controls","2 3-frond colonies","Zollner Creek water","Daily static renewal","measured throughout","","","","",7.3,136,28,7.1,"25 ± 1",""]
["Category","Freshwater/metal/plant","Paper and data unique identifier(eg. 1-1,10-150)","162-56"]
["Scores",10,10,5,5,5,5,5,5,5,4,4,0,4,4,4,0,0,0,0,3,3,81,0.83505154639175261,""]
["Answers","7 d","root length","","","","3 replicates","7-fold increase in frond number in controls","2 3-frond colonies","APHA media","Daily static renewal","measured throughout","","","","","","","","","25 ± 1",""]
["Category","Freshwater/metal/plant","Paper and data unique identifier(eg. 1-1,10-150)","162-57"]
["Scores",10,10,5,5,5,5,5,5,5,4,4,0,4,4,4,0,0,0,0,3,3,81,0.83505154639175261,""]
["Answers","7 d","root length","","","","3 replicates","7-fold increase in frond number in controls","2 3-frond colonies","APHA media","Daily static renewal","measured throughout","","","","","","","","","25 ± 1",""]
["Category","Freshwater/metal/plant","Paper and data unique identifier(eg. 1-1,10-150)","165-1"]
["Scores",10,10,5,5,5,5,2,5,5,4,2,0,4,4,4,3,3,0,3,3,3,85,0.87628865979381443,""]
["Answers","72 h","growth rate","EC",10,"","","Reithmuller et al protocol and OECD","exponentially growing cells","Collected water sample (Tea tree)","static","Not mentioned in report if measured more than once","Suspect this is actually a yes, but it is not stated in the report.","","","",7.3,25,"",10,"29 ± 2",""]
["Category","Freshwater/metal/plant","Paper and data unique identifier(eg. 1-1,10-150)","165-2"]
["Scores",10,10,5,5,5,5,2,5,5,4,2,0,4,4,4,3,3,0,3,3,3,85,0.87628865979381443,""]
["Answers","72 h","growth rate","EC",10,"","","Reithmuller et al protocol and OECD","exponentially growing cells","Collected water sample (Woronora)","static","Not mentioned in report if measured more than once","Suspect this is actually a yes, but it is not stated in the report.","","","",7.2,21,"",4,"29 ± 2",""]
["Category","Freshwater/metal/plant","Paper and data unique identifier(eg. 1-1,10-150)","165-3"]
["Scores",10,10,5,5,5,5,2,5,5,4,2,0,4,4,4,3,3,0,3,3,3,85,0.87628865979381443,""]
["Answers","72 h","growth rate","EC",10,"","","Reithmuller et al protocol and OECD","exponentially growing cells","Collected water sample (Peechelba)","static","Not mentioned in report if measured more than once","Suspect this is actually a yes, but it is not stated in the report.","","","",8.1999999999999993,20,"",0.5,"29 ± 2",""]
["Category","Freshwater/metal/plant","Paper and data unique identifier(eg. 1-1,10-150)","165-4"]
["Scores",10,10,5,5,5,5,2,5,5,4,2,0,4,4,4,3,3,0,3,3,3,85,0.87628865979381443,""]
["Answers","72 h","growth rate","EC",10,"","","Reithmuller et al protocol and OECD","exponentially growing cells","Collected water sample (Wellington)","static","Not mentioned in report if measured more than once","Suspect this is actually a yes, but it is not stated in the report.","","","",7.9,58,"",5,"29 ± 2",""]
["Category","Freshwater/metal/plant","Paper and data unique identifier(eg. 1-1,10-150)","165-5"]
["Scores",10,10,5,5,5,5,2,5,5,4,2,0,4,4,4,3,3,0,3,3,3,85,0.87628865979381443,""]
["Answers","72 h","growth rate","EC",10,"","","Reithmuller et al protocol and OECD","exponentially growing cells","Collected water sample (Magela Ck)","static","Not mentioned in report if measured more than once","Suspect this is actually a yes, but it is not stated in the report.","","","",6.4,1.7,"",3,"29 ± 2",""]
["Category","Freshwater/metal/plant","Paper and data unique identifier(eg. 1-1,10-150)","165-6"]
["Scores",10,10,5,5,5,5,2,5,5,4,2,0,4,4,4,3,3,0,3,3,3,85,0.87628865979381443,""]
["Answers","96 h","growth (yield)","EC",10,"","","ESA SOP 112 (ESA 2012). This procedure is based on OECD method 221 (2006)","exponentially growing cells","Collected water sample (Tea tree)","static","Not mentioned in report if measured more than once","Suspect this is actually a yes, but it is not stated in the report.","","","",7.3,25,"",10,"29 ± 2",""]
["Category","Freshwater/metal/plant","Paper and data unique identifier(eg. 1-1,10-150)","165-7"]
["Scores",10,10,5,5,5,5,2,5,5,4,2,0,4,4,4,3,3,0,3,3,3,85,0.87628865979381443,""]
["Answers","96 h","growth (yield)","EC",10,"","","ESA SOP 112 (ESA 2012). This procedure is based on OECD method 221 (2006)","exponentially growing cells","Collected water sample (Woronora)","static","Not mentioned in report if measured more than once","Suspect this is actually a yes, but it is not stated in the report.","","","",7.2,21,"",4,"29 ± 2",""]
["Category","Freshwater/metal/plant","Paper and data unique identifier(eg. 1-1,10-150)","165-8"]
["Scores",10,10,5,5,5,5,2,5,5,4,2,0,4,4,4,3,3,0,3,3,3,85,0.87628865979381443,""]
["Answers","96 h","growth (yield)","EC",10,"","","ESA SOP 112 (ESA 2012). This procedure is based on OECD method 221 (2006)","exponentially growing cells","Collected water sample (Peechelba)","static","Not mentioned in report if measured more than once","Suspect this is actually a yes, but it is not stated in the report.","","","",8.1999999999999993,20,"",0.5,"29 ± 2",""]
["Category","Freshwater/metal/plant","Paper and data unique identifier(eg. 1-1,10-150)","165-9"]
["Scores",10,10,5,5,5,5,2,5,5,4,2,0,4,4,4,3,3,0,3,3,3,85,0.87628865979381443,""]
["Answers","96 h","growth (yield)","EC",10,"","","ESA SOP 112 (ESA 2012). This procedure is based on OECD method 221 (2006)","exponentially growing cells","Collected water sample (Wellington)","static","Not mentioned in report if measured more than once","Suspect this is actually a yes, but it is not stated in the report.","","","",7.9,58,"",5,"29 ± 2",""]
["Category","Freshwater/metal/plant","Paper and data unique identifier(eg. 1-1,10-150)","165-10"]
["Scores",10,10,5,5,5,5,2,5,5,4,2,0,4,4,4,3,3,0,3,3,3,85,0.87628865979381443,""]
["Answers","96 h","growth (yield)","EC",10,"","","ESA SOP 112 (ESA 2012). This procedure is based on OECD method 221 (2006)","exponentially growing cells","Collected water sample (Magela Ck)","static","Not mentioned in report if measured more than once","Suspect this is actually a yes, but it is not stated in the report.","","","",6.4,1.7,"",3,"29 ± 2",""]
["Category","Freshwater/metal/plant","Paper and data unique identifier(eg. 1-1,10-150)","169-1"]
["Scores",10,10,5,5,5,5,2,5,5,4,4,0,4,4,4,3,3,3,0,1,3,85,0.87628865979381443,""]
["Answers","72 h","growth rate. Formulas provided","","","","triplicate","OECD","1 x 10^4 cells/mL 5-d old exponentially growing - confirmed by microscope counts","OECD media, Ca 0.12 mM","static, shaken twice daily","measured twice and averagev values used for stats","","","","",7.4,19.899999999999999,27.3,"","individual temp not provided. Test exposure was at 25 degrees C.","reagent greade chemicals, and controls measured for contamination"]
["Category","Freshwater/metal/plant","Paper and data unique identifier(eg. 1-1,10-150)","169-2"]
["Scores",10,10,5,5,5,5,2,5,5,4,4,0,4,4,4,3,3,3,0,1,3,85,0.87628865979381443,""]
["Answers","72 h","growth rate. Formulas provided","","","","triplicate","OECD","1 x 10^4 cells/mL 5-d old exponentially growing - confirmed by microscope counts","OECD media Ca 0.5 mM","static, shaken twice daily","measured twice and averagev values used for stats","","","","",7.38,46.4,27.2,"","individual temp not provided. Test exposure was at 25 degrees C.","reagent greade chemicals, and controls measured for contamination"]
["Category","Freshwater/metal/plant","Paper and data unique identifier(eg. 1-1,10-150)","169-3"]
["Scores",10,10,5,5,5,5,2,5,5,4,4,0,4,4,4,3,3,3,0,1,3,85,0.87628865979381443,""]
["Answers","72 h","growth rate. Formulas provided","","","","triplicate","OECD","1 x 10^4 cells/mL 5-d old exponentially growing - confirmed by microscope counts","OECD media Ca 1.0 mM","static, shaken twice daily","measured twice and averagev values used for stats","","","","",7.4,81.400000000000006,27.3,"","individual temp not provided. Test exposure was at 25 degrees C.","reagent greade chemicals, and controls measured for contamination"]
["Category","Freshwater/metal/plant","Paper and data unique identifier(eg. 1-1,10-150)","169-4"]
["Scores",10,10,5,5,5,5,2,5,5,4,4,0,4,4,4,3,3,3,0,1,3,85,0.87628865979381443,""]
["Answers","72 h","growth rate. Formulas provided","","","","triplicate","OECD","1 x 10^4 cells/mL 5-d old exponentially growing - confirmed by microscope counts","OECD media Ca 2.0 mM","static, shaken twice daily","measured twice and averagev values used for stats","","","","",7.39,156,27.3,null,"individual temp not provided. Test exposure was at 25 degrees C.","reagent greade chemicals, and controls measured for contamination"]
["Category","Freshwater/metal/plant","Paper and data unique identifier(eg. 1-1,10-150)","169-5"]
["Scores",10,10,5,5,5,5,2,5,5,4,4,0,4,4,4,3,3,3,0,1,3,85,0.87628865979381443,""]
["Answers","72 h","growth rate. Formulas provided","","","","triplicate","OECD","1 x 10^4 cells/mL 5-d old exponentially growing - confirmed by microscope counts","OECD media Ca 3.0 mM","static, shaken twice daily","measured twice and averagev values used for stats","","","","",7.39,229,27.3,"","individual temp not provided. Test exposure was at 25 degrees C.","reagent greade chemicals, and controls measured for contamination"]
["Category","Freshwater/metal/plant","Paper and data unique identifier(eg. 1-1,10-150)","169-6"]
["Scores",10,10,5,5,5,5,2,5,5,4,4,0,4,4,4,3,3,3,0,1,3,85,0.87628865979381443,""]
["Answers","72 h","growth rate. Formulas provided","","","","triplicate","OECD","1 x 10^4 cells/mL 5-d old exponentially growing - confirmed by microscope counts","OECD media Ca 4.0 mM","static, shaken twice daily","measured twice and averagev values used for stats","","","","",7.41,299,27.4,"","individual temp not provided. Test exposure was at 25 degrees C.","reagent greade chemicals, and controls measured for contamination"]
["Category","Freshwater/metal/plant","Paper and data unique identifier(eg. 1-1,10-150)","169-7"]
["Scores",10,10,5,5,5,5,2,5,5,4,4,0,4,4,4,3,3,3,0,1,3,85,0.87628865979381443,""]
["Answers","72 h","growth rate. Formulas provided","","","","triplicate","OECD","1 x 10^4 cells/mL 5-d old exponentially growing - confirmed by microscope counts","OECD media Ca 5.0 mM","static, shaken twice daily","measured twice and averagev values used for stats","","","","",7.44,370,27.5,"","individual temp not provided. Test exposure was at 25 degrees C.","reagent greade chemicals, and controls measured for contamination"]
["Category","Freshwater/metal/plant","Paper and data unique identifier(eg. 1-1,10-150)","169-8"]
["Scores",10,10,5,5,5,5,2,5,5,4,4,0,4,4,4,3,3,3,0,1,3,85,0.87628865979381443,""]
["Answers","72 h","growth rate. Formulas provided","","","","triplicate","OECD","1 x 10^4 cells/mL 5-d old exponentially growing - confirmed by microscope counts","OECD media Mg 0.12 mM","static, shaken twice daily","measured twice and averagev values used for stats","","","","",7.48,20.100000000000001,27.7,"","individual temp not provided. Test exposure was at 25 degrees C.","reagent greade chemicals, and controls measured for contamination"]
["Category","Freshwater/metal/plant","Paper and data unique identifier(eg. 1-1,10-150)","169-9"]
["Scores",10,10,5,5,5,5,2,5,5,4,4,0,4,4,4,3,3,3,0,1,3,85,0.87628865979381443,""]
["Answers","72 h","growth rate. Formulas provided","","","","triplicate","OECD","1 x 10^4 cells/mL 5-d old exponentially growing - confirmed by microscope counts","OECD media Mg 0.5 mM","static, shaken twice daily","measured twice and averagev values used for stats","","","","",7.51,54.5,27.9,"","individual temp not provided. Test exposure was at 25 degrees C.","reagent greade chemicals, and controls measured for contamination"]
["Category","Freshwater/metal/plant","Paper and data unique identifier(eg. 1-1,10-150)","169-10"]
["Scores",10,10,5,5,5,5,2,5,5,4,4,0,4,4,4,3,3,3,0,1,3,85,0.87628865979381443,""]
["Answers","72 h","growth rate. Formulas provided","","","","triplicate","OECD","1 x 10^4 cells/mL 5-d old exponentially growing - confirmed by microscope counts","OECD media Mg 1.0 mM","static, shaken twice daily","measured twice and averagev values used for stats","","","","",7.5,92.2,27.8,"","individual temp not provided. Test exposure was at 25 degrees C.","reagent greade chemicals, and controls measured for contamination"]
["Category","Freshwater/metal/plant","Paper and data unique identifier(eg. 1-1,10-150)","169-11"]
["Scores",10,10,5,5,5,5,2,5,5,4,4,0,4,4,4,3,3,3,0,1,3,85,0.87628865979381443,""]
["Answers","72 h","growth rate. Formulas provided","","","","triplicate","OECD","1 x 10^4 cells/mL 5-d old exponentially growing - confirmed by microscope counts","OECD media Mg 1.5 mM","static, shaken twice daily","measured twice and averagev values used for stats","","","","",7.52,191,27.9,"","individual temp not provided. Test exposure was at 25 degrees C.","reagent greade chemicals, and controls measured for contamination"]
["Category","Freshwater/metal/plant","Paper and data unique identifier(eg. 1-1,10-150)","169-12"]
["Scores",10,10,5,5,5,5,2,5,5,4,4,0,4,4,4,3,3,3,0,1,3,85,0.87628865979381443,""]
["Answers","72 h","growth rate. Formulas provided","","","","triplicate","OECD","1 x 10^4 cells/mL 5-d old exponentially growing - confirmed by microscope counts","OECD media Mg 2.0 mM","static, shaken twice daily","measured twice and averagev values used for stats","","","","",7.53,198,28,"","individual temp not provided. Test exposure was at 25 degrees C.","reagent greade chemicals, and controls measured for contamination"]
["Category","Freshwater/metal/plant","Paper and data unique identifier(eg. 1-1,10-150)","169-13"]
["Scores",10,10,5,5,5,5,2,5,5,4,4,0,4,4,4,3,3,3,0,1,3,85,0.87628865979381443,""]
["Answers","72 h","growth rate. Formulas provided","","","","triplicate","OECD","1 x 10^4 cells/mL 5-d old exponentially growing - confirmed by microscope counts","OECD media Mg 2.5 mM","static, shaken twice daily","measured twice and averagev values used for stats","","","","",7.54,243,28,"","individual temp not provided. Test exposure was at 25 degrees C.","reagent greade chemicals, and controls measured for contamination"]
["Category","Freshwater/metal/plant","Paper and data unique identifier(eg. 1-1,10-150)","169-14"]
["Scores",10,10,5,5,5,5,2,5,5,4,4,0,4,4,4,3,3,3,0,1,3,85,0.87628865979381443,""]
["Answers","72 h","growth rate. Formulas provided","","","","triplicate","OECD","1 x 10^4 cells/mL 5-d old exponentially growing - confirmed by microscope counts","OECD media Mg 3.0 mM","static, shaken twice daily","measured twice and averagev values used for stats","","","","",7.53,300,28,"","individual temp not provided. Test exposure was at 25 degrees C.","reagent greade chemicals, and controls measured for contamination"]
["Category","Freshwater/metal/plant","Paper and data unique identifier(eg. 1-1,10-150)","169-15"]
["Scores",10,10,5,5,5,5,2,5,5,4,4,0,4,4,4,3,3,3,0,1,3,85,0.87628865979381443,""]
["Answers","72 h","growth rate. Formulas provided","","","","triplicate","OECD","1 x 10^4 cells/mL 5-d old exponentially growing - confirmed by microscope counts","OECD media Mg 4.0 mM","static, shaken twice daily","measured twice and averagev values used for stats","","","","",7.54,392,28,"","individual temp not provided. Test exposure was at 25 degrees C.","reagent greade chemicals, and controls measured for contamination"]
["Category","Freshwater/metal/plant","Paper and data unique identifier(eg. 1-1,10-150)","169-16"]
["Scores",10,10,5,5,5,5,2,5,5,4,4,0,4,4,4,3,3,3,0,1,3,85,0.87628865979381443,""]
["Answers","72 h","growth rate. Formulas provided","","","","triplicate","OECD","1 x 10^4 cells/mL 5-d old exponentially growing - confirmed by microscope counts","OECD media Mg 5.0 mM","static, shaken twice daily","measured twice and averagev values used for stats","","","","",7.52,481,27.9,"","individual temp not provided. Test exposure was at 25 degrees C.","reagent greade chemicals, and controls measured for contamination"]
["Category","Freshwater/metal/plant","Paper and data unique identifier(eg. 1-1,10-150)","169-17"]
["Scores",10,10,5,5,5,5,2,5,5,4,4,0,4,4,4,3,3,3,0,1,3,85,0.87628865979381443,""]
["Answers","72 h","growth rate. Formulas provided","","","","triplicate","OECD","1 x 10^4 cells/mL 5-d old exponentially growing - confirmed by microscope counts","OECD media pH 6.0","static, shaken twice daily","measured twice and averagev values used for stats","","","","",6.01,21.2,9.3000000000000007,"","individual temp not provided. Test exposure was at 25 degrees C.","reagent greade chemicals, and controls measured for contamination"]
["Category","Freshwater/metal/plant","Paper and data unique identifier(eg. 1-1,10-150)","169-18"]
["Scores",10,10,5,5,5,5,2,5,5,4,4,0,4,4,4,3,3,3,0,1,3,85,0.87628865979381443,""]
["Answers","72 h","growth rate. Formulas provided","","","","triplicate","OECD","1 x 10^4 cells/mL 5-d old exponentially growing - confirmed by microscope counts","OECD media pH 6.4","static, shaken twice daily","measured twice and averagev values used for stats","","","","",6.45,21.5,16.600000000000001,"","individual temp not provided. Test exposure was at 25 degrees C.","reagent greade chemicals, and controls measured for contamination"]
["Category","Freshwater/metal/plant","Paper and data unique identifier(eg. 1-1,10-150)","169-19"]
["Scores",10,10,5,5,5,5,2,5,5,4,4,0,4,4,4,3,3,3,0,1,3,85,0.87628865979381443,""]
["Answers","72 h","growth rate. Formulas provided","","","","triplicate","OECD","1 x 10^4 cells/mL 5-d old exponentially growing - confirmed by microscope counts","OECD media pH 7.2","static, shaken twice daily","measured twice and averagev values used for stats","","","","",7.29,20.8,26.7,"","individual temp not provided. Test exposure was at 25 degrees C.","reagent greade chemicals, and controls measured for contamination"]
["Category","Freshwater/metal/plant","Paper and data unique identifier(eg. 1-1,10-150)","169-20"]
["Scores",10,10,5,5,5,5,2,5,5,4,4,0,4,4,4,3,3,3,0,1,3,85,0.87628865979381443,""]
["Answers","72 h","growth rate. Formulas provided","","","","triplicate","OECD","1 x 10^4 cells/mL 5-d old exponentially growing - confirmed by microscope counts","OECD media pH 7.6","static, shaken twice daily","measured twice and averagev values used for stats","","","","",7.65,20.7,28.4,"","individual temp not provided. Test exposure was at 25 degrees C.","reagent greade chemicals, and controls measured for contamination"]
["Category","Freshwater/metal/plant","Paper and data unique identifier(eg. 1-1,10-150)","169-21"]
["Scores",10,10,5,5,5,5,2,5,5,4,4,0,4,4,4,3,3,3,0,1,3,85,0.87628865979381443,""]
["Answers","72 h","growth rate. Formulas provided","","","","triplicate","OECD","1 x 10^4 cells/mL 5-d old exponentially growing - confirmed by microscope counts","OECD media pH 8.0","static, shaken twice daily","measured twice and averagev values used for stats","","","","",7.92,21.3,29.1,"","individual temp not provided. Test exposure was at 25 degrees C.","reagent greade chemicals, and controls measured for contamination"]
["Category","Freshwater/metal/plant","Paper and data unique identifier(eg. 1-1,10-150)","169-22"]
["Scores",10,10,5,5,5,5,2,5,5,4,4,0,4,4,4,3,3,3,0,1,3,85,0.87628865979381443,""]
["Answers","72 h","growth rate. Formulas provided","","","","triplicate","OECD","1 x 10^4 cells/mL 5-d old exponentially growing - confirmed by microscope counts","OECD media pH 6.0, Mg 0.12 mM","static, shaken twice daily","measured twice and averagev values used for stats","","","","",6.23,24.5,12.8,"","individual temp not provided. Test exposure was at 25 degrees C.","reagent greade chemicals, and controls measured for contamination"]
["Category","Freshwater/metal/plant","Paper and data unique identifier(eg. 1-1,10-150)","169-23"]
["Scores",10,10,5,5,5,5,2,5,5,4,4,0,4,4,4,3,3,3,0,1,3,85,0.87628865979381443,""]
["Answers","72 h","growth rate. Formulas provided","","","","triplicate","OECD","1 x 10^4 cells/mL 5-d old exponentially growing - confirmed by microscope counts","OECD media pH 6.0, Mg 1.5 mM","static, shaken twice daily","measured twice and averagev values used for stats","","","","",6.13,159,11.2,"","individual temp not provided. Test exposure was at 25 degrees C.","reagent greade chemicals, and controls measured for contamination"]
["Category","Freshwater/metal/plant","Paper and data unique identifier(eg. 1-1,10-150)","169-24"]
["Scores",10,10,5,5,5,5,2,5,5,4,4,0,4,4,4,3,3,3,0,1,3,85,0.87628865979381443,""]
["Answers","72 h","growth rate. Formulas provided","","","","triplicate","OECD","1 x 10^4 cells/mL 5-d old exponentially growing - confirmed by microscope counts","OECD media pH 6.0, Mg 3.0 mM","static, shaken twice daily","measured twice and averagev values used for stats","","","","",6.08,312,10.4,"","individual temp not provided. Test exposure was at 25 degrees C.","reagent greade chemicals, and controls measured for contamination"]
["Category","Freshwater/metal/plant","Paper and data unique identifier(eg. 1-1,10-150)","169-25"]
["Scores",10,10,5,5,5,5,2,5,5,4,4,0,4,4,4,3,3,3,0,1,3,85,0.87628865979381443,""]
["Answers","72 h","growth rate. Formulas provided","","","","triplicate","OECD","1 x 10^4 cells/mL 5-d old exponentially growing - confirmed by microscope counts","OECD media pH 7.0, 0.12 mM","static, shaken twice daily","measured twice and averagev values used for stats","","","","",7.2,28.9,26.1,"","individual temp not provided. Test exposure was at 25 degrees C.","reagent greade chemicals, and controls measured for contamination"]
["Category","Freshwater/metal/plant","Paper and data unique identifier(eg. 1-1,10-150)","169-26"]
["Scores",10,10,5,5,5,5,2,5,5,4,4,0,4,4,4,3,3,3,0,1,3,85,0.87628865979381443,""]
["Answers","72 h","growth rate. Formulas provided","","","","triplicate","OECD","1 x 10^4 cells/mL 5-d old exponentially growing - confirmed by microscope counts","OECD media pH 7.0, 1.5 mM","static, shaken twice daily","measured twice and averagev values used for stats","","","","",7.16,149,25.8,"","individual temp not provided. Test exposure was at 25 degrees C.","reagent greade chemicals, and controls measured for contamination"]
["Category","Freshwater/metal/plant","Paper and data unique identifier(eg. 1-1,10-150)","169-27"]
["Scores",10,10,5,5,5,5,2,5,5,4,4,0,4,4,4,3,3,3,0,1,3,85,0.87628865979381443,""]
["Answers","72 h","growth rate. Formulas provided","","","","triplicate","OECD","1 x 10^4 cells/mL 5-d old exponentially growing - confirmed by microscope counts","OECD media pH 7.0, 3.0 mM","static, shaken twice daily","measured twice and averagev values used for stats","","","","",7.15,315,25.7,"","individual temp not provided. Test exposure was at 25 degrees C.","reagent greade chemicals, and controls measured for contamination"]
["Category","Freshwater/metal/plant","Paper and data unique identifier(eg. 1-1,10-150)","169-28"]
["Scores",10,10,5,5,5,5,2,5,5,4,4,0,4,4,4,3,3,3,0,1,3,85,0.87628865979381443,""]
["Answers","72 h","growth rate. Formulas provided","","","","triplicate","OECD","1 x 10^4 cells/mL 5-d old exponentially growing - confirmed by microscope counts","OECD media pH 7.8, 0.12 mM","static, shaken twice daily","measured twice and averagev values used for stats","","","","",7.95,23,29.2,"","individual temp not provided. Test exposure was at 25 degrees C.","reagent greade chemicals, and controls measured for contamination"]
["Category","Freshwater/metal/plant","Paper and data unique identifier(eg. 1-1,10-150)","169-29"]
["Scores",10,10,5,5,5,5,2,5,5,4,4,0,4,4,4,3,3,3,0,1,3,85,0.87628865979381443,""]
["Answers","72 h","growth rate. Formulas provided","","","","triplicate","OECD","1 x 10^4 cells/mL 5-d old exponentially growing - confirmed by microscope counts","OECD media pH 7.8, 1.5 mM","static, shaken twice daily","measured twice and averagev values used for stats","","","","",7.88,157,29,"","individual temp not provided. Test exposure was at 25 degrees C.","reagent greade chemicals, and controls measured for contamination"]
["Category","Freshwater/metal/plant","Paper and data unique identifier(eg. 1-1,10-150)","169-30"]
["Scores",10,10,5,5,5,5,2,5,5,4,4,0,4,4,4,3,3,3,0,1,3,85,0.87628865979381443,""]
["Answers","72 h","growth rate. Formulas provided","","","","triplicate","OECD","1 x 10^4 cells/mL 5-d old exponentially growing - confirmed by microscope counts","OECD media pH 7.8, 3.0 mM","static, shaken twice daily","measured twice and averagev values used for stats","","","","",7.85,312,28.9,"","individual temp not provided. Test exposure was at 25 degrees C.","reagent greade chemicals, and controls measured for contamination"]
["Category","Freshwater/metal/plant","Paper and data unique identifier(eg. 1-1,10-150)","169-31"]
["Scores",10,10,5,5,5,5,2,5,5,4,4,0,4,4,4,3,3,3,3,1,3,88,0.90721649484536082,""]
["Answers","72 h","growth rate. Formulas provided","","","","triplicate","OECD","1 x 10^4 cells/mL 5-d old exponentially growing - confirmed by microscope counts","Filtered Bihain water","static, shaken twice daily","measured twice and averagev values used for stats","","","","",6.35,116,0.74299999999999999,6.62,"individual temp not provided. Test exposure was at 25 degrees C.","reagent greade chemicals, and controls measured for contamination"]
["Category","Freshwater/metal/plant","Paper and data unique identifier(eg. 1-1,10-150)","169-32"]
["Scores",10,10,5,5,5,5,2,5,5,4,4,0,4,4,4,3,3,3,3,1,3,88,0.90721649484536082,""]
["Answers","72 h","growth rate. Formulas provided","","","","triplicate","OECD","1 x 10^4 cells/mL 5-d old exponentially growing - confirmed by microscope counts","Filtered Bihain water","static, shaken twice daily","measured twice and averagev values used for stats","","","","",6.35,116,0.74299999999999999,6.62,"individual temp not provided. Test exposure was at 25 degrees C.","reagent greade chemicals, and controls measured for contamination"]
["Category","Freshwater/metal/plant","Paper and data unique identifier(eg. 1-1,10-150)","169-33"]
["Scores",10,10,5,5,5,5,2,5,5,4,4,0,4,4,4,3,3,3,3,1,3,88,0.90721649484536082,""]
["Answers","72 h","growth rate. Formulas provided","","","","triplicate","OECD","1 x 10^4 cells/mL 5-d old exponentially growing - confirmed by microscope counts","Filtered Ankeveen water","static, shaken twice daily","measured twice and averagev values used for stats","","","","","7.37/7.47",178,"29.6/30.2",25.8,"individual temp not provided. Test exposure was at 25 degrees C.","reagent greade chemicals, and controls measured for contamination"]
["Category","Freshwater/metal/plant","Paper and data unique identifier(eg. 1-1,10-150)","169-34"]
["Scores",10,10,5,5,5,5,2,5,5,4,4,0,4,4,4,3,3,3,3,1,3,88,0.90721649484536082,""]
["Answers","72 h","growth rate. Formulas provided","","","","triplicate","OECD","1 x 10^4 cells/mL 5-d old exponentially growing - confirmed by microscope counts","Filtered Ankeveen water","static, shaken twice daily","measured twice and averagev values used for stats","","","","","7.37/7.47",178,"29.6/30.2",25.8,"individual temp not provided. Test exposure was at 25 degrees C.","reagent greade chemicals, and controls measured for contamination"]
["Category","Freshwater/metal/plant","Paper and data unique identifier(eg. 1-1,10-150)","169-35"]
["Scores",10,10,5,5,5,5,2,5,5,4,4,0,4,4,4,3,3,3,3,1,3,88,0.90721649484536082,""]
["Answers","72 h","growth rate. Formulas provided","","","","triplicate","OECD","1 x 10^4 cells/mL 5-d old exponentially growing - confirmed by microscope counts","Filtered River Mole water","static, shaken twice daily","measured twice and averagev values used for stats","","","","","7.99/8.01",186,"94.3/94.4",5.14,"individual temp not provided. Test exposure was at 25 degrees C.","reagent greade chemicals, and controls measured for contamination"]
["Category","Freshwater/metal/plant","Paper and data unique identifier(eg. 1-1,10-150)","169-36"]
["Scores",10,10,5,5,5,5,2,5,5,4,4,0,4,4,4,3,3,3,3,1,3,88,0.90721649484536082,""]
["Answers","72 h","growth rate. Formulas provided","","","","triplicate","OECD","1 x 10^4 cells/mL 5-d old exponentially growing - confirmed by microscope counts","Filtered River Mole water","static, shaken twice daily","measured twice and averagev values used for stats","","","","","7.99/8.01",186,"94.3/94.4",5.14,"individual temp not provided. Test exposure was at 25 degrees C.","reagent greade chemicals, and controls measured for contamination"]
["Category","Freshwater/metal/plant","Paper and data unique identifier(eg. 1-1,10-150)","169-37"]
["Scores",10,10,5,5,5,5,2,5,5,4,4,0,4,4,4,3,3,3,0,1,3,85,0.87628865979381443,""]
["Answers","72 h","growth rate. Formulas provided","","","","triplicate","OECD","1 x 10^4 cells/mL 5-d old exponentially growing - confirmed by microscope counts","OECD media","static, shaken twice daily","measured twice and averagev values used for stats","","","","",7.7,24,29.2,"–","individual temp not provided. Test exposure was at 25 degrees C.","reagent greade chemicals, and controls measured for contamination"]
["Category","Freshwater/metal/plant","Paper and data unique identifier(eg. 1-1,10-150)","169-38"]
["Scores",10,10,5,5,5,5,2,5,5,4,4,0,4,4,4,3,3,3,0,1,3,85,0.87628865979381443,""]
["Answers","72 h","growth rate. Formulas provided","","","","triplicate","OECD","1 x 10^4 cells/mL 5-d old exponentially growing - confirmed by microscope counts","OECD media","static, shaken twice daily","measured twice and averagev values used for stats","","","","",7.7,24,29.2,"–","individual temp not provided. Test exposure was at 25 degrees C.","reagent greade chemicals, and controls measured for contamination"]
["Category","Freshwater/metal/plant","Paper and data unique identifier(eg. 1-1,10-150)","169-39"]
["Scores",10,10,5,5,5,5,2,5,5,4,4,0,4,4,4,3,3,3,3,1,3,88,0.90721649484536082,""]
["Answers","72 h","growth rate. Formulas provided","","","","triplicate","OECD","1 x 10^4 cells/mL 5-d old exponentially growing - confirmed by microscope counts","Filtered Ankeveen water","static, shaken twice daily","measured twice and averagev values used for stats","","","","",7.29,204,35.299999999999997,22.4,"individual temp not provided. Test exposure was at 25 degrees C.","reagent greade chemicals, and controls measured for contamination"]
["Category","Freshwater/metal/plant","Paper and data unique identifier(eg. 1-1,10-150)","169-40"]
["Scores",10,10,5,5,5,5,2,5,5,4,4,0,4,4,4,3,3,3,3,1,3,88,0.90721649484536082,""]
["Answers","72 h","growth rate. Formulas provided","","","","triplicate","OECD","1 x 10^4 cells/mL 5-d old exponentially growing - confirmed by microscope counts","Filtered Brisy water","static, shaken twice daily","measured twice and averagev values used for stats","","","","",6.53,37.700000000000003,5.98,4.0999999999999996,"individual temp not provided. Test exposure was at 25 degrees C.","reagent greade chemicals, and controls measured for contamination"]
["Category","Freshwater/metal/plant","Paper and data unique identifier(eg. 1-1,10-150)","169-41"]
["Scores",10,10,5,5,5,5,2,5,5,4,4,0,4,4,4,3,3,3,3,1,3,88,0.90721649484536082,""]
["Answers","72 h","growth rate. Formulas provided","","","","triplicate","OECD","1 x 10^4 cells/mL 5-d old exponentially growing - confirmed by microscope counts","Filtered Regge water","static, shaken twice daily","measured twice and averagev values used for stats","","","","",7.78,181,133,10.9,"individual temp not provided. Test exposure was at 25 degrees C.","reagent greade chemicals, and controls measured for contamination"]
["Category","Freshwater/metal/plant","Paper and data unique identifier(eg. 1-1,10-150)","169-42"]
["Scores",10,10,5,5,5,5,2,5,5,4,4,0,4,4,4,3,3,3,0,1,3,85,0.87628865979381443,""]
["Answers","72 h","growth rate. Formulas provided","","","","triplicate","OECD","1 x 10^4 cells/mL 5-d old exponentially growing - confirmed by microscope counts","OECD media","static, shaken twice daily","measured twice and averagev values used for stats","","","","",7.42,24,24,"–","individual temp not provided. Test exposure was at 25 degrees C.","reagent greade chemicals, and controls measured for contamination"]
["Category","Freshwater/metal/plant","Paper and data unique identifier(eg. 1-1,10-150)","169-43"]
["Scores",10,10,5,5,5,5,2,5,5,4,4,0,4,4,4,3,3,3,0,1,3,85,0.87628865979381443,""]
["Answers","72 h","growth rate. Formulas provided","","","","triplicate","OECD","1 x 10^4 cells/mL 5-d old exponentially growing - confirmed by microscope counts","OECD media","static, shaken twice daily","measured twice and averagev values used for stats","","","","",7.42,250,23.9,"–","individual temp not provided. Test exposure was at 25 degrees C.","reagent greade chemicals, and controls measured for contamination"]
["Category","Freshwater/metal/plant","Paper and data unique identifier(eg. 1-1,10-150)","169-44"]
["Scores",10,10,5,5,5,5,2,5,5,4,4,0,4,4,4,3,3,3,0,1,3,85,0.87628865979381443,""]
["Answers","72 h","growth rate. Formulas provided","","","","triplicate","OECD","1 x 10^4 cells/mL 5-d old exponentially growing - confirmed by microscope counts","OECD media, Ca 0.12 mM","static, shaken twice daily","measured twice and averagev values used for stats","","","","",7.4,19.899999999999999,27.3,"","individual temp not provided. Test exposure was at 25 degrees C.","reagent greade chemicals, and controls measured for contamination"]
["Category","Freshwater/metal/plant","Paper and data unique identifier(eg. 1-1,10-150)","169-45"]
["Scores",10,10,5,5,5,5,2,5,5,4,4,0,4,4,4,3,3,3,0,1,3,85,0.87628865979381443,""]
["Answers","72 h","growth rate. Formulas provided","","","","triplicate","OECD","1 x 10^4 cells/mL 5-d old exponentially growing - confirmed by microscope counts","OECD media Ca 0.5 mM","static, shaken twice daily","measured twice and averagev values used for stats","","","","",7.38,46.4,27.2,"","individual temp not provided. Test exposure was at 25 degrees C.","reagent greade chemicals, and controls measured for contamination"]
["Category","Freshwater/metal/plant","Paper and data unique identifier(eg. 1-1,10-150)","169-46"]
["Scores",10,10,5,5,5,5,2,5,5,4,4,0,4,4,4,3,3,3,0,1,3,85,0.87628865979381443,""]
["Answers","72 h","growth rate. Formulas provided","","","","triplicate","OECD","1 x 10^4 cells/mL 5-d old exponentially growing - confirmed by microscope counts","OECD media Ca 1.0 mM","static, shaken twice daily","measured twice and averagev values used for stats","","","","",7.4,81.400000000000006,27.3,"","individual temp not provided. Test exposure was at 25 degrees C.","reagent greade chemicals, and controls measured for contamination"]
["Category","Freshwater/metal/plant","Paper and data unique identifier(eg. 1-1,10-150)","169-47"]
["Scores",10,10,5,5,5,5,2,5,5,4,4,0,4,4,4,3,3,3,0,1,3,85,0.87628865979381443,""]
["Answers","72 h","growth rate. Formulas provided","","","","triplicate","OECD","1 x 10^4 cells/mL 5-d old exponentially growing - confirmed by microscope counts","OECD media Ca 2.0 mM","static, shaken twice daily","measured twice and averagev values used for stats","","","","",7.39,156,27.3,null,"individual temp not provided. Test exposure was at 25 degrees C.","reagent greade chemicals, and controls measured for contamination"]
["Category","Freshwater/metal/plant","Paper and data unique identifier(eg. 1-1,10-150)","169-48"]
["Scores",10,10,5,5,5,5,2,5,5,4,4,0,4,4,4,3,3,3,0,1,3,85,0.87628865979381443,""]
["Answers","72 h","growth rate. Formulas provided","","","","triplicate","OECD","1 x 10^4 cells/mL 5-d old exponentially growing - confirmed by microscope counts","OECD media Ca 3.0 mM","static, shaken twice daily","measured twice and averagev values used for stats","","","","",7.39,229,27.3,"","individual temp not provided. Test exposure was at 25 degrees C.","reagent greade chemicals, and controls measured for contamination"]
["Category","Freshwater/metal/plant","Paper and data unique identifier(eg. 1-1,10-150)","169-49"]
["Scores",10,10,5,5,5,5,2,5,5,4,4,0,4,4,4,3,3,3,0,1,3,85,0.87628865979381443,""]
["Answers","72 h","growth rate. Formulas provided","","","","triplicate","OECD","1 x 10^4 cells/mL 5-d old exponentially growing - confirmed by microscope counts","OECD media Ca 4.0 mM","static, shaken twice daily","measured twice and averagev values used for stats","","","","",7.41,299,27.4,"","individual temp not provided. Test exposure was at 25 degrees C.","reagent greade chemicals, and controls measured for contamination"]
["Category","Freshwater/metal/plant","Paper and data unique identifier(eg. 1-1,10-150)","169-50"]
["Scores",10,10,5,5,5,5,2,5,5,4,4,0,4,4,4,3,3,3,0,1,3,85,0.87628865979381443,""]
["Answers","72 h","growth rate. Formulas provided","","","","triplicate","OECD","1 x 10^4 cells/mL 5-d old exponentially growing - confirmed by microscope counts","OECD media Ca 5.0 mM","static, shaken twice daily","measured twice and averagev values used for stats","","","","",7.44,370,27.5,"","individual temp not provided. Test exposure was at 25 degrees C.","reagent greade chemicals, and controls measured for contamination"]
["Category","Freshwater/metal/plant","Paper and data unique identifier(eg. 1-1,10-150)","169-51"]
["Scores",10,10,5,5,5,5,2,5,5,4,4,0,4,4,4,3,3,3,0,1,3,85,0.87628865979381443,""]
["Answers","72 h","growth rate. Formulas provided","","","","triplicate","OECD","1 x 10^4 cells/mL 5-d old exponentially growing - confirmed by microscope counts","OECD media Mg 0.12 mM","static, shaken twice daily","measured twice and averagev values used for stats","","","","",7.48,20.100000000000001,27.7,"","individual temp not provided. Test exposure was at 25 degrees C.","reagent greade chemicals, and controls measured for contamination"]
["Category","Freshwater/metal/plant","Paper and data unique identifier(eg. 1-1,10-150)","169-52"]
["Scores",10,10,5,5,5,5,2,5,5,4,4,0,4,4,4,3,3,3,0,1,3,85,0.87628865979381443,""]
["Answers","72 h","growth rate. Formulas provided","","","","triplicate","OECD","1 x 10^4 cells/mL 5-d old exponentially growing - confirmed by microscope counts","OECD media Mg 0.5 mM","static, shaken twice daily","measured twice and averagev values used for stats","","","","",7.51,54.5,27.9,"","individual temp not provided. Test exposure was at 25 degrees C.","reagent greade chemicals, and controls measured for contamination"]
["Category","Freshwater/metal/plant","Paper and data unique identifier(eg. 1-1,10-150)","169-53"]
["Scores",10,10,5,5,5,5,2,5,5,4,4,0,4,4,4,3,3,3,0,1,3,85,0.87628865979381443,""]
["Answers","72 h","growth rate. Formulas provided","","","","triplicate","OECD","1 x 10^4 cells/mL 5-d old exponentially growing - confirmed by microscope counts","OECD media Mg 1.0 mM","static, shaken twice daily","measured twice and averagev values used for stats","","","","",7.5,92.2,27.8,"","individual temp not provided. Test exposure was at 25 degrees C.","reagent greade chemicals, and controls measured for contamination"]
["Category","Freshwater/metal/plant","Paper and data unique identifier(eg. 1-1,10-150)","169-54"]
["Scores",10,10,5,5,5,5,2,5,5,4,4,0,4,4,4,3,3,3,0,1,3,85,0.87628865979381443,""]
["Answers","72 h","growth rate. Formulas provided","","","","triplicate","OECD","1 x 10^4 cells/mL 5-d old exponentially growing - confirmed by microscope counts","OECD media Mg 1.5 mM","static, shaken twice daily","measured twice and averagev values used for stats","","","","",7.52,191,27.9,"","individual temp not provided. Test exposure was at 25 degrees C.","reagent greade chemicals, and controls measured for contamination"]
["Category","Freshwater/metal/plant","Paper and data unique identifier(eg. 1-1,10-150)","169-55"]
["Scores",10,10,5,5,5,5,2,5,5,4,4,0,4,4,4,3,3,3,0,1,3,85,0.87628865979381443,""]
["Answers","72 h","growth rate. Formulas provided","","","","triplicate","OECD","1 x 10^4 cells/mL 5-d old exponentially growing - confirmed by microscope counts","OECD media Mg 2.0 mM","static, shaken twice daily","measured twice and averagev values used for stats","","","","",7.53,198,28,"","individual temp not provided. Test exposure was at 25 degrees C.","reagent greade chemicals, and controls measured for contamination"]
["Category","Freshwater/metal/plant","Paper and data unique identifier(eg. 1-1,10-150)","169-56"]
["Scores",10,10,5,5,5,5,2,5,5,4,4,0,4,4,4,3,3,3,0,1,3,85,0.87628865979381443,""]
["Answers","72 h","growth rate. Formulas provided","","","","triplicate","OECD","1 x 10^4 cells/mL 5-d old exponentially growing - confirmed by microscope counts","OECD media Mg 2.5 mM","static, shaken twice daily","measured twice and averagev values used for stats","","","","",7.54,243,28,"","individual temp not provided. Test exposure was at 25 degrees C.","reagent greade chemicals, and controls measured for contamination"]
["Category","Freshwater/metal/plant","Paper and data unique identifier(eg. 1-1,10-150)","169-57"]
["Scores",10,10,5,5,5,5,2,5,5,4,4,0,4,4,4,3,3,3,0,1,3,85,0.87628865979381443,""]
["Answers","72 h","growth rate. Formulas provided","","","","triplicate","OECD","1 x 10^4 cells/mL 5-d old exponentially growing - confirmed by microscope counts","OECD media Mg 3.0 mM","static, shaken twice daily","measured twice and averagev values used for stats","","","","",7.53,300,28,"","individual temp not provided. Test exposure was at 25 degrees C.","reagent greade chemicals, and controls measured for contamination"]
["Category","Freshwater/metal/plant","Paper and data unique identifier(eg. 1-1,10-150)","169-58"]
["Scores",10,10,5,5,5,5,2,5,5,4,4,0,4,4,4,3,3,3,0,1,3,85,0.87628865979381443,""]
["Answers","72 h","growth rate. Formulas provided","","","","triplicate","OECD","1 x 10^4 cells/mL 5-d old exponentially growing - confirmed by microscope counts","OECD media Mg 4.0 mM","static, shaken twice daily","measured twice and averagev values used for stats","","","","",7.54,392,28,"","individual temp not provided. Test exposure was at 25 degrees C.","reagent greade chemicals, and controls measured for contamination"]
["Category","Freshwater/metal/plant","Paper and data unique identifier(eg. 1-1,10-150)","169-59"]
["Scores",10,10,5,5,5,5,2,5,5,4,4,0,4,4,4,3,3,3,0,1,3,85,0.87628865979381443,""]
["Answers","72 h","growth rate. Formulas provided","","","","triplicate","OECD","1 x 10^4 cells/mL 5-d old exponentially growing - confirmed by microscope counts","OECD media Mg 5.0 mM","static, shaken twice daily","measured twice and averagev values used for stats","","","","",7.52,481,27.9,"","individual temp not provided. Test exposure was at 25 degrees C.","reagent greade chemicals, and controls measured for contamination"]
["Category","Freshwater/metal/plant","Paper and data unique identifier(eg. 1-1,10-150)","169-60"]
["Scores",10,10,5,5,5,5,2,5,5,4,4,0,4,4,4,3,3,3,0,1,3,85,0.87628865979381443,""]
["Answers","72 h","growth rate. Formulas provided","","","","triplicate","OECD","1 x 10^4 cells/mL 5-d old exponentially growing - confirmed by microscope counts","OECD media pH 6.0","static, shaken twice daily","measured twice and averagev values used for stats","","","","",6.01,21.2,9.3000000000000007,"","individual temp not provided. Test exposure was at 25 degrees C.","reagent greade chemicals, and controls measured for contamination"]
["Category","Freshwater/metal/plant","Paper and data unique identifier(eg. 1-1,10-150)","169-61"]
["Scores",10,10,5,5,5,5,2,5,5,4,4,0,4,4,4,3,3,3,0,1,3,85,0.87628865979381443,""]
["Answers","72 h","growth rate. Formulas provided","","","","triplicate","OECD","1 x 10^4 cells/mL 5-d old exponentially growing - confirmed by microscope counts","OECD media pH 6.4","static, shaken twice daily","measured twice and averagev values used for stats","","","","",6.45,21.5,16.600000000000001,"","individual temp not provided. Test exposure was at 25 degrees C.","reagent greade chemicals, and controls measured for contamination"]
["Category","Freshwater/metal/plant","Paper and data unique identifier(eg. 1-1,10-150)","169-62"]
["Scores",10,10,5,5,5,5,2,5,5,4,4,0,4,4,4,3,3,3,0,1,3,85,0.87628865979381443,""]
["Answers","72 h","growth rate. Formulas provided","","","","triplicate","OECD","1 x 10^4 cells/mL 5-d old exponentially growing - confirmed by microscope counts","OECD media pH 7.2","static, shaken twice daily","measured twice and averagev values used for stats","","","","",7.29,20.8,26.7,"","individual temp not provided. Test exposure was at 25 degrees C.","reagent greade chemicals, and controls measured for contamination"]
["Category","Freshwater/metal/plant","Paper and data unique identifier(eg. 1-1,10-150)","169-63"]
["Scores",10,10,5,5,5,5,2,5,5,4,4,0,4,4,4,3,3,3,0,1,3,85,0.87628865979381443,""]
["Answers","72 h","growth rate. Formulas provided","","","","triplicate","OECD","1 x 10^4 cells/mL 5-d old exponentially growing - confirmed by microscope counts","OECD media pH 7.6","static, shaken twice daily","measured twice and averagev values used for stats","","","","",7.65,20.7,28.4,"","individual temp not provided. Test exposure was at 25 degrees C.","reagent greade chemicals, and controls measured for contamination"]
["Category","Freshwater/metal/plant","Paper and data unique identifier(eg. 1-1,10-150)","169-64"]
["Scores",10,10,5,5,5,5,2,5,5,4,4,0,4,4,4,3,3,3,0,1,3,85,0.87628865979381443,""]
["Answers","72 h","growth rate. Formulas provided","","","","triplicate","OECD","1 x 10^4 cells/mL 5-d old exponentially growing - confirmed by microscope counts","OECD media pH 8.0","static, shaken twice daily","measured twice and averagev values used for stats","","","","",7.92,21.3,29.1,"","individual temp not provided. Test exposure was at 25 degrees C.","reagent greade chemicals, and controls measured for contamination"]
["Category","Freshwater/metal/plant","Paper and data unique identifier(eg. 1-1,10-150)","169-65"]
["Scores",10,10,5,5,5,5,2,5,5,4,4,0,4,4,4,3,3,3,0,1,3,85,0.87628865979381443,""]
["Answers","72 h","growth rate. Formulas provided","","","","triplicate","OECD","1 x 10^4 cells/mL 5-d old exponentially growing - confirmed by microscope counts","OECD media pH 6.0, Mg 0.12 mM","static, shaken twice daily","measured twice and averagev values used for stats","","","","",6.23,24.5,12.8,"","individual temp not provided. Test exposure was at 25 degrees C.","reagent greade chemicals, and controls measured for contamination"]
["Category","Freshwater/metal/plant","Paper and data unique identifier(eg. 1-1,10-150)","169-66"]
["Scores",10,10,5,5,5,5,2,5,5,4,4,0,4,4,4,3,3,3,0,1,3,85,0.87628865979381443,""]
["Answers","72 h","growth rate. Formulas provided","","","","triplicate","OECD","1 x 10^4 cells/mL 5-d old exponentially growing - confirmed by microscope counts","OECD media pH 6.0, Mg 1.5 mM","static, shaken twice daily","measured twice and averagev values used for stats","","","","",6.13,159,11.2,"","individual temp not provided. Test exposure was at 25 degrees C.","reagent greade chemicals, and controls measured for contamination"]
["Category","Freshwater/metal/plant","Paper and data unique identifier(eg. 1-1,10-150)","169-67"]
["Scores",10,10,5,5,5,5,2,5,5,4,4,0,4,4,4,3,3,3,0,1,3,85,0.87628865979381443,""]
["Answers","72 h","growth rate. Formulas provided","","","","triplicate","OECD","1 x 10^4 cells/mL 5-d old exponentially growing - confirmed by microscope counts","OECD media pH 6.0, Mg 3.0 mM","static, shaken twice daily","measured twice and averagev values used for stats","","","","",6.08,312,10.4,"","individual temp not provided. Test exposure was at 25 degrees C.","reagent greade chemicals, and controls measured for contamination"]
["Category","Freshwater/metal/plant","Paper and data unique identifier(eg. 1-1,10-150)","169-68"]
["Scores",10,10,5,5,5,5,2,5,5,4,4,0,4,4,4,3,3,3,0,1,3,85,0.87628865979381443,""]
["Answers","72 h","growth rate. Formulas provided","","","","triplicate","OECD","1 x 10^4 cells/mL 5-d old exponentially growing - confirmed by microscope counts","OECD media pH 7.0, 0.12 mM","static, shaken twice daily","measured twice and averagev values used for stats","","","","",7.2,28.9,26.1,"","individual temp not provided. Test exposure was at 25 degrees C.","reagent greade chemicals, and controls measured for contamination"]
["Category","Freshwater/metal/plant","Paper and data unique identifier(eg. 1-1,10-150)","169-69"]
["Scores",10,10,5,5,5,5,2,5,5,4,4,0,4,4,4,3,3,3,0,1,3,85,0.87628865979381443,""]
["Answers","72 h","growth rate. Formulas provided","","","","triplicate","OECD","1 x 10^4 cells/mL 5-d old exponentially growing - confirmed by microscope counts","OECD media pH 7.0, 1.5 mM","static, shaken twice daily","measured twice and averagev values used for stats","","","","",7.16,149,25.8,"","individual temp not provided. Test exposure was at 25 degrees C.","reagent greade chemicals, and controls measured for contamination"]
["Category","Freshwater/metal/plant","Paper and data unique identifier(eg. 1-1,10-150)","169-70"]
["Scores",10,10,5,5,5,5,2,5,5,4,4,0,4,4,4,3,3,3,0,1,3,85,0.87628865979381443,""]
["Answers","72 h","growth rate. Formulas provided","","","","triplicate","OECD","1 x 10^4 cells/mL 5-d old exponentially growing - confirmed by microscope counts","OECD media pH 7.0, 3.0 mM","static, shaken twice daily","measured twice and averagev values used for stats","","","","",7.15,315,25.7,"","individual temp not provided. Test exposure was at 25 degrees C.","reagent greade chemicals, and controls measured for contamination"]
["Category","Freshwater/metal/plant","Paper and data unique identifier(eg. 1-1,10-150)","169-71"]
["Scores",10,10,5,5,5,5,2,5,5,4,4,0,4,4,4,3,3,3,0,1,3,85,0.87628865979381443,""]
["Answers","72 h","growth rate. Formulas provided","","","","triplicate","OECD","1 x 10^4 cells/mL 5-d old exponentially growing - confirmed by microscope counts","OECD media pH 7.8, 0.12 mM","static, shaken twice daily","measured twice and averagev values used for stats","","","","",7.95,23,29.2,"","individual temp not provided. Test exposure was at 25 degrees C.","reagent greade chemicals, and controls measured for contamination"]
["Category","Freshwater/metal/plant","Paper and data unique identifier(eg. 1-1,10-150)","169-72"]
["Scores",10,10,5,5,5,5,2,5,5,4,4,0,4,4,4,3,3,3,0,1,3,85,0.87628865979381443,""]
["Answers","72 h","growth rate. Formulas provided","","","","triplicate","OECD","1 x 10^4 cells/mL 5-d old exponentially growing - confirmed by microscope counts","OECD media pH 7.8, 1.5 mM","static, shaken twice daily","measured twice and averagev values used for stats","","","","",7.88,157,29,"","individual temp not provided. Test exposure was at 25 degrees C.","reagent greade chemicals, and controls measured for contamination"]
["Category","Freshwater/metal/plant","Paper and data unique identifier(eg. 1-1,10-150)","169-73"]
["Scores",10,10,5,5,5,5,2,5,5,4,4,0,4,4,4,3,3,3,0,1,3,85,0.87628865979381443,""]
["Answers","72 h","growth rate. Formulas provided","","","","triplicate","OECD","1 x 10^4 cells/mL 5-d old exponentially growing - confirmed by microscope counts","OECD media pH 7.8, 3.0 mM","static, shaken twice daily","measured twice and averagev values used for stats","","","","",7.85,312,28.9,"","individual temp not provided. Test exposure was at 25 degrees C.","reagent greade chemicals, and controls measured for contamination"]
["Category","Freshwater/metal/plant","Paper and data unique identifier(eg. 1-1,10-150)","169-74"]
["Scores",10,10,5,5,5,5,2,5,5,4,4,0,4,4,4,3,3,3,3,1,3,88,0.90721649484536082,""]
["Answers","72 h","growth rate. Formulas provided","","","","triplicate","OECD","1 x 10^4 cells/mL 5-d old exponentially growing - confirmed by microscope counts","Filtered Bihain water","static, shaken twice daily","measured twice and averagev values used for stats","","","","",6.35,116,0.74299999999999999,6.62,"individual temp not provided. Test exposure was at 25 degrees C.","reagent greade chemicals, and controls measured for contamination"]
["Category","Freshwater/metal/plant","Paper and data unique identifier(eg. 1-1,10-150)","169-75"]
["Scores",10,10,5,5,5,5,2,5,5,4,4,0,4,4,4,3,3,3,3,1,3,88,0.90721649484536082,""]
["Answers","72 h","growth rate. Formulas provided","","","","triplicate","OECD","1 x 10^4 cells/mL 5-d old exponentially growing - confirmed by microscope counts","Filtered Bihain water","static, shaken twice daily","measured twice and averagev values used for stats","","","","",6.35,116,0.74299999999999999,6.62,"individual temp not provided. Test exposure was at 25 degrees C.","reagent greade chemicals, and controls measured for contamination"]
["Category","Freshwater/metal/plant","Paper and data unique identifier(eg. 1-1,10-150)","169-76"]
["Scores",10,10,5,5,5,5,2,5,5,4,4,0,4,4,4,3,3,3,3,1,3,88,0.90721649484536082,""]
["Answers","72 h","growth rate. Formulas provided","","","","triplicate","OECD","1 x 10^4 cells/mL 5-d old exponentially growing - confirmed by microscope counts","Filtered Ankeveen water","static, shaken twice daily","measured twice and averagev values used for stats","","","","","7.37/7.47",178,"29.6/30.2",25.8,"individual temp not provided. Test exposure was at 25 degrees C.","reagent greade chemicals, and controls measured for contamination"]
["Category","Freshwater/metal/plant","Paper and data unique identifier(eg. 1-1,10-150)","169-77"]
["Scores",10,10,5,5,5,5,2,5,5,4,4,0,4,4,4,3,3,3,3,1,3,88,0.90721649484536082,""]
["Answers","72 h","growth rate. Formulas provided","","","","triplicate","OECD","1 x 10^4 cells/mL 5-d old exponentially growing - confirmed by microscope counts","Filtered Ankeveen water","static, shaken twice daily","measured twice and averagev values used for stats","","","","","7.37/7.47",178,"29.6/30.2",25.8,"individual temp not provided. Test exposure was at 25 degrees C.","reagent greade chemicals, and controls measured for contamination"]
["Category","Freshwater/metal/plant","Paper and data unique identifier(eg. 1-1,10-150)","169-78"]
["Scores",10,10,5,5,5,5,2,5,5,4,4,0,4,4,4,3,3,3,3,1,3,88,0.90721649484536082,""]
["Answers","72 h","growth rate. Formulas provided","","","","triplicate","OECD","1 x 10^4 cells/mL 5-d old exponentially growing - confirmed by microscope counts","Filtered River Mole water","static, shaken twice daily","measured twice and averagev values used for stats","","","","","7.99/8.01",186,"94.3/94.4",5.14,"individual temp not provided. Test exposure was at 25 degrees C.","reagent greade chemicals, and controls measured for contamination"]
["Category","Freshwater/metal/plant","Paper and data unique identifier(eg. 1-1,10-150)","169-79"]
["Scores",10,10,5,5,5,5,2,5,5,4,4,0,4,4,4,3,3,3,3,1,3,88,0.90721649484536082,""]
["Answers","72 h","growth rate. Formulas provided","","","","triplicate","OECD","1 x 10^4 cells/mL 5-d old exponentially growing - confirmed by microscope counts","Filtered River Mole water","static, shaken twice daily","measured twice and averagev values used for stats","","","","","7.99/8.01",186,"94.3/94.4",5.14,"individual temp not provided. Test exposure was at 25 degrees C.","reagent greade chemicals, and controls measured for contamination"]
["Category","Freshwater/metal/plant","Paper and data unique identifier(eg. 1-1,10-150)","169-80"]
["Scores",10,10,5,5,5,5,2,5,5,4,4,0,4,4,4,3,3,3,0,1,3,85,0.87628865979381443,""]
["Answers","72 h","growth rate. Formulas provided","","","","triplicate","OECD","1 x 10^4 cells/mL 5-d old exponentially growing - confirmed by microscope counts","OECD media","static, shaken twice daily","measured twice and averagev values used for stats","","","","",7.7,24,29.2,"–","individual temp not provided. Test exposure was at 25 degrees C.","reagent greade chemicals, and controls measured for contamination"]
["Category","Freshwater/metal/plant","Paper and data unique identifier(eg. 1-1,10-150)","169-81"]
["Scores",10,10,5,5,5,5,2,5,5,4,4,0,4,4,4,3,3,3,0,1,3,85,0.87628865979381443,""]
["Answers","72 h","growth rate. Formulas provided","","","","triplicate","OECD","1 x 10^4 cells/mL 5-d old exponentially growing - confirmed by microscope counts","OECD media","static, shaken twice daily","measured twice and averagev values used for stats","","","","",7.7,24,29.2,"–","individual temp not provided. Test exposure was at 25 degrees C.","reagent greade chemicals, and controls measured for contamination"]
["Category","Freshwater/metal/plant","Paper and data unique identifier(eg. 1-1,10-150)","169-82"]
["Scores",10,10,5,5,5,5,2,5,5,4,4,0,4,4,4,3,3,3,3,1,3,88,0.90721649484536082,""]
["Answers","72 h","growth rate. Formulas provided","","","","triplicate","OECD","1 x 10^4 cells/mL 5-d old exponentially growing - confirmed by microscope counts","Filtered Ankeveen water","static, shaken twice daily","measured twice and averagev values used for stats","","","","",7.29,204,35.299999999999997,22.4,"individual temp not provided. Test exposure was at 25 degrees C.","reagent greade chemicals, and controls measured for contamination"]
["Category","Freshwater/metal/plant","Paper and data unique identifier(eg. 1-1,10-150)","169-83"]
["Scores",10,10,5,5,5,5,2,5,5,4,4,0,4,4,4,3,3,3,3,1,3,88,0.90721649484536082,""]
["Answers","72 h","growth rate. Formulas provided","","","","triplicate","OECD","1 x 10^4 cells/mL 5-d old exponentially growing - confirmed by microscope counts","Filtered Brisy water","static, shaken twice daily","measured twice and averagev values used for stats","","","","",6.53,37.700000000000003,5.98,4.0999999999999996,"individual temp not provided. Test exposure was at 25 degrees C.","reagent greade chemicals, and controls measured for contamination"]
["Category","Freshwater/metal/plant","Paper and data unique identifier(eg. 1-1,10-150)","169-84"]
["Scores",10,10,5,5,5,5,2,5,5,4,4,0,4,4,4,3,3,3,3,1,3,88,0.90721649484536082,""]
["Answers","72 h","growth rate. Formulas provided","","","","triplicate","OECD","1 x 10^4 cells/mL 5-d old exponentially growing - confirmed by microscope counts","Filtered Regge water","static, shaken twice daily","measured twice and averagev values used for stats","","","","",7.78,181,133,10.9,"individual temp not provided. Test exposure was at 25 degrees C.","reagent greade chemicals, and controls measured for contamination"]
["Category","Freshwater/metal/plant","Paper and data unique identifier(eg. 1-1,10-150)","169-85"]
["Scores",10,10,5,5,5,5,2,5,5,4,4,0,4,4,4,3,3,3,0,1,3,85,0.87628865979381443,""]
["Answers","72 h","growth rate. Formulas provided","","","","triplicate","OECD","1 x 10^4 cells/mL 5-d old exponentially growing - confirmed by microscope counts","OECD media","static, shaken twice daily","measured twice and averagev values used for stats","","","","",7.42,24,24,"–","individual temp not provided. Test exposure was at 25 degrees C.","reagent greade chemicals, and controls measured for contamination"]
["Category","Freshwater/metal/plant","Paper and data unique identifier(eg. 1-1,10-150)","169-86"]
["Scores",10,10,5,5,5,5,2,5,5,4,4,0,4,4,4,3,3,3,0,1,3,85,0.87628865979381443,""]
["Answers","72 h","growth rate. Formulas provided","","","","triplicate","OECD","1 x 10^4 cells/mL 5-d old exponentially growing - confirmed by microscope counts","OECD media","static, shaken twice daily","measured twice and averagev values used for stats","","","","",7.42,250,23.9,"–","individual temp not provided. Test exposure was at 25 degrees C.","reagent greade chemicals, and controls measured for contamination"]
["Category","Freshwater/metal/plant","Paper and data unique identifier(eg. 1-1,10-150)","170-1"]
["Scores",10,10,5,5,5,5,0,5,5,0,2,0,4,4,4,1,0,0,0,1,3,69,0.71134020618556704,""]
["Answers","14 d","growth rate based on absorbance. ","NOEC","NOEC","","triplicate","","late log phase","MCM media, but recipe for this media is unnavailable. Source thesis does not contain full recipe of medium.","assume static","","","","","","6.8 in test medium","","","",25,"reagent grade"]
["Category","Freshwater/metal/plant","Paper and data unique identifier(eg. 1-1,10-150)","175-1"]
["Scores",10,10,5,5,5,5,5,5,5,4,4,0,4,4,4,3,1,0,3,3,3,88,0.90721649484536082,""]
["Answers","72 h","Growth rate, defined.","EC",10,"","duplicate","Control growth rate >1 doublings per day. Results of this study define acceptability criteria for future studies (optimisation paper).","2-4 x 10^3 cells/mL in exponential growth","synthetic softwater ","Static","beginning and end","Copper tests done alongside, however, this study will inform acceptability criteria and refotx data for future work","","","95% CLs of 17-30",7.9,"prepared according to USEPA methods to be 80-90 mg CaCO3/L","","<0.5 mg/L","27 ± 2","AR grade used, and controls were analysed for contmaination"]
["Category","Freshwater/metal/plant","Paper and data unique identifier(eg. 1-1,10-150)","175-2"]
["Scores",10,10,5,5,5,5,5,5,5,4,4,0,4,4,4,3,1,0,3,3,3,88,0.90721649484536082,""]
["Answers","72 h","Growth rate, defined.","EC",10,"","duplicate","Control growth rate >1 doublings per day. Results of this study define acceptability criteria for future studies (optimisation paper).","2-4 x 10^3 cells/mL in exponential growth","synthetic softwater ","Static","beginning and end","Copper tests done alongside, however, this study will inform acceptability criteria and refotx data for future work","","","95% CLs of 34-69",7.8,"prepared according to USEPA methods to be 80-90 mg CaCO3/L","","<0.5 mg/L","27 ± 2","AR grade used, and controls were analysed for contmaination"]
["Category","Freshwater/metal/plant","Paper and data unique identifier(eg. 1-1,10-150)","175-3"]
["Scores",10,10,5,5,5,5,5,5,5,4,4,0,4,4,4,3,1,0,3,3,3,88,0.90721649484536082,""]
["Answers","72 h","Growth rate, defined.","EC",10,"","duplicate","Control growth rate >1 doublings per day. Results of this study define acceptability criteria for future studies (optimisation paper).","0.4-0.6 x 10^3 cells/mL in exponential growth","synthetic softwater ","Static","beginning and end","Copper tests done alongside, however, this study will inform acceptability criteria and refotx data for future work","","","95% CLs of 256-354",7.5,"prepared according to USEPA methods to be 100-120 mg CaCO3/L","","<0.5 mg/L","27 ± 2","AR grade used, and controls were analysed for contmaination"]
["Category","Freshwater/metal/plant","Paper and data unique identifier(eg. 1-1,10-150)","175-4"]
["Scores",10,10,5,5,5,5,5,5,5,4,4,0,4,4,4,3,1,0,3,3,3,88,0.90721649484536082,""]
["Answers","72 h","Growth rate, defined.","EC",10,"","duplicate","Control growth rate >1 doublings per day. Results of this study define acceptability criteria for future studies (optimisation paper).","2.4 x 10^3 cells/mL in exponential growth","synthetic softwater ","Static","beginning and end","Copper tests done alongside, however, this study will inform acceptability criteria and refotx data for future work","","","95% CLs of 14-26",7.5,"prepared according to USEPA methods to be 100-120 mg CaCO3/L","","<0.5 mg/L","27 ± 2","AR grade used, and controls were analysed for contmaination"]
["Category","Freshwater/metal/plant","Paper and data unique identifier(eg. 1-1,10-150)","175-5"]
["Scores",10,10,5,5,5,5,5,5,5,4,4,0,4,4,4,3,1,0,3,3,3,88,0.90721649484536082,""]
["Answers","72 h","Growth rate, defined.","EC",10,"","duplicate","Control growth rate >1 doublings per day. Results of this study define acceptability criteria for future studies (optimisation paper).","0.27 x 10^3 cells/mL in exponential growth","synthetic softwater ","Static","beginning and end","Copper tests done alongside, however, this study will inform acceptability criteria and refotx data for future work","","","95% CLs of 140-205",7.5,"prepared according to USEPA methods to be 100-120 mg CaCO3/L","","<0.5 mg/L","27 ± 2","AR grade used, and controls were analysed for contmaination"]
["Category","Freshwater/metal/plant","Paper and data unique identifier(eg. 1-1,10-150)","4-1"]
["Scores",10,10,5,5,5,5,5,5,5,4,4,0,4,4,4,3,0,0,3,1,3,85,0.876,""]
["Answers","72 h","growth rate calculated via daily cell density","EC","EC10","Control (no Ni added)","triplicate replicates","Method followed OECD standard protocol. Full QA details provided in Supp Data.","4 days old","modified OECD media (composition provided in Supp Data","implied static based on detailed of test method (but not explicitly stated)","Dissolved Ni measured at a minimum of beginning and end of exposure","Not mentioned","plots provided in Supp Data","STATISTICA 7 (StatSoft)","95% (118–148)","8.17 SD=0.03 measured and pH adjusted twice a day","Media composition was provided including Mg and Ca concentrations but detailed provided in Supp Data on media composition contradict the Mg concentrations quoted. Hence data for hardness/Mg is unreliable","Media composition was provided (not clear if these were measured or not)","DOC 32 µg/L (but reported as zero for modelling)","Stated only (25 degrees C)","reagent grade NiCl2"]
["Category","Freshwater/metal/plant","Paper and data unique identifier(eg. 1-1,10-150)","4-2"]
["Scores",10,10,5,5,5,5,5,5,5,4,4,0,4,4,4,3,0,0,3,1,3,85,0.876,""]
["Answers","72 h","growth rate calculated via daily cell density","EC","EC10","Control (no Ni added)","triplicate replicates","Method followed OECD standard protocol. Full QA details provided in Supp Data.","4 days old","modified OECD media (composition provided in Supp Data","implied static based on detailed of test method (but not explicitly stated)","Dissolved Ni measured at a minimum of beginning and end of exposure","Not mentioned","plots provided in Supp Data","STATISTICA 7 (StatSoft)","95% (64–89)","8.65 SD=0.03 measured and pH adjusted twice a day","Media composition was provided including Mg and Ca concentrations but detailed provided in Supp Data on media composition contradict the Mg concentrations quoted. Hence data for hardness/Mg is unreliable","Media composition was provided (not clear if these were measured or not)","DOC 32 µg/L (but reported as zero for modelling)","Stated only (25 degrees C)","reagent grade NiCl2"]
["Category","Freshwater/metal/plant","Paper and data unique identifier(eg. 1-1,10-150)","4-3"]
["Scores",10,10,5,5,5,5,5,5,5,4,4,0,4,4,4,3,0,0,3,1,3,85,0.876,""]
["Answers","7 d","growth rate calculated via number of fronds (day 3, 5 & 7)","EC","EC10","Control (no Ni added)","triplicate replicates","Method followed OECD standard protocol. Full QA details provided in Supp Data.","acclimated for 2 weeks (growth phase not reported)","modified OECD media (composition provided in Supp Data)","Static renewal (days 3 and 5)","Dissolved Ni measured at a minimum of beginning and end of exposure","Not mentioned","plots provided in Supp Data","STATISTICA 7 (StatSoft)","95% (19–57)","8.21 SD=0.15 measured daily and pH adjusted if necessary","Media composition was provided including Mg and Ca concentrations but detailed provided in Supp Data on media composition contradict the Mg concentrations quoted. Hence data for hardness/Mg is unreliable","Media composition was provided (not clear if these were measured or not)","DOC 45 µg/L (but reported as zero for modelling)","Stated only (25 degrees C)","reagent grade NiCl2"]
["Category","Freshwater/metal/plant","Paper and data unique identifier(eg. 1-1,10-150)","4-4"]
["Scores",10,10,5,5,5,5,5,5,5,4,4,0,4,4,4,3,0,0,3,1,3,85,0.876,""]
["Answers","7 d","growth rate calculated via number of fronds (day 3, 5 & 7)","EC","EC10","Control (no Ni added)","triplicate replicates","Method followed OECD standard protocol. Full QA details provided in Supp Data.","acclimated for 2 weeks (growth phase not reported)","modified OECD media (composition provided in Supp Data)","Static renewal (days 3 and 5)","Dissolved Ni measured at a minimum of beginning and end of exposure","Not mentioned","plots provided in Supp Data","STATISTICA 7 (StatSoft)","95% (15–52)","8.68 SD=0.07 measured daily and pH adjusted if necessary","Media composition was provided including Mg and Ca concentrations but detailed provided in Supp Data on media composition contradict the Mg concentrations quoted. Hence data for hardness/Mg is unreliable","Media composition was provided (not clear if these were measured or not)","DOC 45 µg/L (but reported as zero for modelling)","Stated only (25 degrees C)","reagent grade NiCl2"]
["Category","Freshwater/metal/plant","Paper and data unique identifier(eg. 1-1,10-150)","5-1"]
["Scores",10,10,5,5,5,5,5,5,5,4,4,0,4,4,4,3,1,0,3,1,3,86,0.88659793814432986,""]
["Answers","48 h ","growth rate calculated as increase in cell density (day 0, 1, 2)","EC","EC10","Control (no Ni added) and blanks for particle background counts","5 replicates per Ni concentration, 15 reps for control treatment","Method followed OECD (2011) standard protocol. QA details provided in Supp Data.","4 days old ","natural water (Brisy, Belgium) filtered to 0.2 µm (composition provided in Table 1) with added MOPS buffer, enriched with OECD macro- and micro-nutrients (minus Cu, Zn and EDTA)","Static (assumed non renewal) and shaken twice a day","Dissolved (0.45 µm) Ni measured at beginning and end of exposure","Not mentioned","plots provided","log-logistic model 2 parameter (Statistica, Dell)","95% (156–205)","7.2 SD=0.0 measured daily and pH adjusted to 7.2 if necessary","Media composition was provided including Mg and Ca measured concentrations. Hence hardness was calcualted as 203 mg CaCO3/L","Media composition was provided including measured major ions ","DOC 7.1 mg/L (SD = 0.3) ","Stated only (24 degrees C)","reagent grade NiCl2"]
["Category","Freshwater/metal/plant","Paper and data unique identifier(eg. 1-1,10-150)","14-1"]
["Scores",10,10,5,5,0,0,2,0,5,4,0,0,4,0,0,1,1,0,0,1,0,48,0.49484536082474229,"The highest possible grade for this datum is acceptable."]
["Answers","3 days","growth measured as fluorescence (microplate reader)","EC","EC10","Not reported but could assume a control (no Ni)","Not reported (but other experiments in this study used 6 replicates)","Standard method is well known (OECD)","Not reported (but could assume the same as for the other experiments in this study (5 days))","OECD medium x 2 with modifications (includes EDTA, MOPS, silicate)","Static (algal tests not normally reviewed)","not reported","Not mentioned","trens observed with reported EC10, EC30, EC50 and EC70, table 1)","Not reported","Not reported",7,"48 mg CaCO3/L, media compoistion provided in SuppMat; hardness calculated from Mg and Ca","Not reported","Not reported",21,"Not reported"]