{"text_format":"1","workbook":"xlsx","n_sheets":9,"sheets":["Copyright","Cover","Instruction","Sheet1","All Result","FW metal nonplant","FW metal nonplant_WS","FW metal plant","FW metal plant_WS"],"not_rendered":{"charts":0,"images":0,"macros":1,"external_links":1,"defined_names":3,"comments":3,"pivot_tables":0},"unopened":[],"bounds":{"document_bytes":16777216,"sheet_cells":100000,"rows_first":2000,"rows_last":500,"rows_between":2000,"halvings":0,"cell_chars":16384,"cell_head_chars":4096},"cells_cut":0,"cells_raw":0,"read":"whole","date_system":"1900"}

{"sheet":"Copyright","index":0,"n_rows":0,"n_cols":0,"rows_kept":0,"cut":false,"hidden":false,"merged":[]}

{"sheet":"Cover","index":1,"n_rows":20,"n_cols":7,"rows_kept":20,"cut":false,"hidden":false,"merged":[[18,6,18,8],[14,6,14,8],[13,6,13,8],[4,4,4,10],[9,6,9,8],[12,6,12,8],[5,5,6,9]]}
[]
[]
[]
[]
[null,null,null,null,"Ecotoxicity Data Quality Assessment Method V2"]
[null,null,null,null,null,"To be used to assess the quality of data used for the Australian and New Zealand Guidelines for Fresh and Marine Water Quality (including sediment) and the Australian National Environment Protection (Assessment of Site Contamination) Measure"]
[]
[]
[]
[null,null,null,null,null,null,"Developed by "]
{"$rows_left_out":11}
{"sheet":"Instruction","index":2,"n_rows":21,"n_cols":10,"rows_kept":21,"cut":false,"hidden":false,"merged":[[27,6,27,16],[14,6,14,7],[5,4,5,7]]}
[]
[]
[null,"Click here to see \"All Result\" -->","All Result"]
[]
[]
[null,null,null,null,"Freshwater "]
[]
[null,"Tabs contain questionaries -->           ","Freshwater/metal/nonplant",null,"Freshwater/non-metal/non-plant ",null,null,"Freshwater/metal/plant",null,"Freshwater/non-metal/plant"]
[]
[]
{"$rows_left_out":12}
{"sheet":"Sheet1","index":3,"n_rows":70,"n_cols":29,"rows_kept":70,"cut":false,"hidden":true,"merged":[]}
[]
[{"$f":"#REF!","v":{"$error":"#REF!"}},{"$f":"#REF!","v":{"$error":"#REF!"}},{"$f":"#REF!","v":{"$error":"#REF!"}},{"$f":"#REF!","v":{"$error":"#REF!"}},{"$f":"#REF!","v":{"$error":"#REF!"}},{"$f":"#REF!","v":{"$error":"#REF!"}},{"$f":"#REF!","v":{"$error":"#REF!"}},{"$f":"#REF!","v":{"$error":"#REF!"}},{"$f":"#REF!","v":{"$error":"#REF!"}},{"$f":"#REF!","v":{"$error":"#REF!"}},{"$f":"#REF!","v":{"$error":"#REF!"}},{"$f":"#REF!","v":{"$error":"#REF!"}},{"$f":"#REF!","v":{"$error":"#REF!"}},{"$f":"#REF!","v":{"$error":"#REF!"}},{"$f":"#REF!","v":{"$error":"#REF!"}},{"$f":"#REF!","v":{"$error":"#REF!"}},{"$f":"#REF!","v":{"$error":"#REF!"}},{"$f":"#REF!","v":{"$error":"#REF!"}},{"$f":"#REF!","v":{"$error":"#REF!"}},{"$f":"#REF!","v":{"$error":"#REF!"}},{"$f":"#REF!","v":{"$error":"#REF!"}},{"$f":"#REF!","v":{"$error":"#REF!"}},{"$f":"#REF!","v":{"$error":"#REF!"}},{"$f":"#REF!","v":{"$error":"#REF!"}},{"$f":"#REF!","v":{"$error":"#REF!"}},{"$f":"#REF!","v":{"$error":"#REF!"}}]
[{"$f":"#REF!","v":{"$error":"#REF!"}},{"$f":"#REF!","v":{"$error":"#REF!"}},{"$f":"#REF!","v":{"$error":"#REF!"}},{"$f":"#REF!","v":{"$error":"#REF!"}}]
[{"$f":"#REF!","v":{"$error":"#REF!"}},{"$f":"#REF!","v":{"$error":"#REF!"}},{"$f":"#REF!","v":{"$error":"#REF!"}},{"$f":"#REF!","v":{"$error":"#REF!"}},{"$f":"#REF!","v":{"$error":"#REF!"}},{"$f":"#REF!","v":{"$error":"#REF!"}},{"$f":"#REF!","v":{"$error":"#REF!"}},{"$f":"#REF!","v":{"$error":"#REF!"}},{"$f":"#REF!","v":{"$error":"#REF!"}},{"$f":"#REF!","v":{"$error":"#REF!"}},{"$f":"#REF!","v":{"$error":"#REF!"}},{"$f":"#REF!","v":{"$error":"#REF!"}},{"$f":"#REF!","v":{"$error":"#REF!"}},{"$f":"#REF!","v":{"$error":"#REF!"}},{"$f":"#REF!","v":{"$error":"#REF!"}},{"$f":"#REF!","v":{"$error":"#REF!"}},{"$f":"#REF!","v":{"$error":"#REF!"}},{"$f":"#REF!","v":{"$error":"#REF!"}},{"$f":"#REF!","v":{"$error":"#REF!"}},{"$f":"#REF!","v":{"$error":"#REF!"}},{"$f":"#REF!","v":{"$error":"#REF!"}},{"$f":"#REF!","v":{"$error":"#REF!"}},{"$f":"#REF!","v":{"$error":"#REF!"}},{"$f":"#REF!","v":{"$error":"#REF!"}},{"$f":"#REF!","v":{"$error":"#REF!"}},{"$f":"#REF!","v":{"$error":"#REF!"}}]
["Answers",{"$f":"IF(#REF!=0,\"\",#REF!)","v":{"$error":"#REF!"}},{"$f":"IF(#REF!=0,\"\",#REF!)","v":{"$error":"#REF!"}},{"$f":"IF(#REF!=0,\"\",#REF!)","v":{"$error":"#REF!"}},{"$f":"IF(#REF!=0,\"\",#REF!)","v":{"$error":"#REF!"}},{"$f":"IF(#REF!=0,\"\",#REF!)","v":{"$error":"#REF!"}},{"$f":"IF(#REF!=0,\"\",#REF!)","v":{"$error":"#REF!"}},{"$f":"IF(#REF!=0,\"\",#REF!)","v":{"$error":"#REF!"}},{"$f":"IF(#REF!=0,\"\",#REF!)","v":{"$error":"#REF!"}},{"$f":"IF(#REF!=0,\"\",#REF!)","v":{"$error":"#REF!"}},{"$f":"IF(#REF!=0,\"\",#REF!)","v":{"$error":"#REF!"}},{"$f":"IF(#REF!=0,\"\",#REF!)","v":{"$error":"#REF!"}},{"$f":"IF(#REF!=0,\"\",#REF!)","v":{"$error":"#REF!"}},{"$f":"IF(#REF!=0,\"\",#REF!)","v":{"$error":"#REF!"}},{"$f":"IF(#REF!=0,\"\",#REF!)","v":{"$error":"#REF!"}},{"$f":"IF(#REF!=0,\"\",#REF!)","v":{"$error":"#REF!"}},{"$f":"IF(#REF!=0,\"\",#REF!)","v":{"$error":"#REF!"}},{"$f":"IF(#REF!=0,\"\",#REF!)","v":{"$error":"#REF!"}},{"$f":"IF(#REF!=0,\"\",#REF!)","v":{"$error":"#REF!"}},{"$f":"IF(#REF!=0,\"\",#REF!)","v":{"$error":"#REF!"}},{"$f":"IF(#REF!=0,\"\",#REF!)","v":{"$error":"#REF!"}},{"$f":"IF(#REF!=0,\"\",#REF!)","v":{"$error":"#REF!"}},{"$f":"IF(#REF!=0,\"\",#REF!)","v":{"$error":"#REF!"}},{"$f":"IF(#REF!=0,\"\",#REF!)","v":{"$error":"#REF!"}}]
[{"$f":"#REF!","v":{"$error":"#REF!"}},{"$f":"#REF!","v":{"$error":"#REF!"}},{"$f":"#REF!","v":{"$error":"#REF!"}},{"$f":"#REF!","v":{"$error":"#REF!"}},{"$f":"#REF!","v":{"$error":"#REF!"}},{"$f":"#REF!","v":{"$error":"#REF!"}},{"$f":"#REF!","v":{"$error":"#REF!"}},{"$f":"#REF!","v":{"$error":"#REF!"}}]
[{"$f":"#REF!","v":{"$error":"#REF!"}},{"$f":"#REF!","v":{"$error":"#REF!"}},{"$f":"#REF!","v":{"$error":"#REF!"}},{"$f":"#REF!","v":{"$error":"#REF!"}},{"$f":"#REF!","v":{"$error":"#REF!"}},{"$f":"IF(#REF!=0,\"\",#REF!)","v":{"$error":"#REF!"}},{"$f":"IF(#REF!=0,\"\",#REF!)","v":{"$error":"#REF!"}},{"$f":"IF(#REF!=0,\"\",#REF!)","v":{"$error":"#REF!"}}]
[]
[]
[]
{"$rows_left_out":61}
{"sheet":"All Result","index":4,"n_rows":489,"n_cols":22,"rows_kept":489,"cut":false,"hidden":false,"merged":[]}
["Toxicant:","Nickel"]
["Medium:","Freshwater"]
[]
[{"$f":"'[1]FW nonmetal plant'!C2","v":"Category"},{"$f":"'[1]FW nonmetal plant'!C3","v":"Paper and data unique identifier(eg. 1-1,10-150)"},{"$f":"'[1]FW nonmetal plant'!C70","v":"Total score"},{"$f":"'[1]FW nonmetal plant'!C72","v":"Quality Score"},"Comment ",{"$f":"'[1]FW nonmetal plant'!G3","v":"Species (Scientific name)"},{"$f":"'[1]FW nonmetal plant'!G4","v":"Lifestage"},{"$f":"'[1]FW nonmetal plant'!G5","v":"Exposure duration"},{"$f":"'[1]FW nonmetal plant'!G6","v":"Measure of toxicity"},{"$f":"'[1]FW nonmetal plant'!G7","v":"Toxicity endpoint"},{"$f":"'[1]FW nonmetal plant'!G8","v":"Toxicity value"},{"$f":"'[1]FW nonmetal plant'!J2","v":"Taxonomic group"},{"$f":"'[1]FW nonmetal plant'!J3","v":"Phylum"},{"$f":"'[1]FW nonmetal plant'!J4","v":"Class"},{"$f":"'[1]FW nonmetal plant'!J5","v":"Media"},{"$f":"'[1]FW nonmetal plant'!J6","v":"Temperature "},{"$f":"'[1]FW nonmetal plant'!J7","v":"Acute Or Chronic "},{"$f":"'[1]FW nonmetal plant'!J8","v":"PH"},{"$f":"'FW metal plant'!J9","v":"Salinity/Conductivity"},{"$f":"'FW metal plant'!C4","v":"Citation"},{"$f":"'FW metal plant'!G2","v":"Citation No."}]
["Freshwater/metal/plant","152-1",40,0.41237113402061853,"The highest possible grade for this datum is acceptable.","mixed phytoplankton community","N.A.","5 d","NOEC","Biomass (Chl a)","NR","phytoplankton community","N.A.","N.A.","N.A.","N.A.","Chronic",8.15,"N.A.","Chakraborty, P., Babu, P. V. R., Acharyya, T. and Bandyopadhyay, D. (2010). Stress and toxicity of biologically important transition metals (Co, Ni, Cu and Zn) on phytoplankton in a tropical freshwater system: An investigation with pigment analysis by HPLC. Chemosphere 80, 548-553.","152"]
["Freshwater/metal/plant","152-2",40,0.41237113402061853,"The highest possible grade for this datum is acceptable.","mixed phytoplankton community","N.A.","5 d","N.A.","Biomass green algae (lutein)","NR","phytoplankton community","N.A.","N.A.","N.A.","N.A.","Chronic",8.15,"N.A.","Chakraborty, P., Babu, P. V. R., Acharyya, T. and Bandyopadhyay, D. (2010). Stress and toxicity of biologically important transition metals (Co, Ni, Cu and Zn) on phytoplankton in a tropical freshwater system: An investigation with pigment analysis by HPLC. Chemosphere 80, 548-553.","152"]
["Freshwater/metal/plant","152-3",40,0.41237113402061853,"The highest possible grade for this datum is acceptable.","mixed phytoplankton community","N.A.","5 d","N.A.","Biomass cyanobacteria (zeaxanthin)","NR","phytoplankton community","N.A.","N.A.","N.A.","N.A.","Chronic",8.15,"N.A.","Chakraborty, P., Babu, P. V. R., Acharyya, T. and Bandyopadhyay, D. (2010). Stress and toxicity of biologically important transition metals (Co, Ni, Cu and Zn) on phytoplankton in a tropical freshwater system: An investigation with pigment analysis by HPLC. Chemosphere 80, 548-553.","152"]
["Freshwater/metal/non- plant","13-2",70,0.67,"The highest possible grade for this datum is acceptable.","Ceriodaphnia dubia","Neonate (<1 d)","7 d","NOEC","Reproduction (fecundity)",">7.5 and <15","Microinvertebrate - microcrustacean","Arthropoda","Branchiopoda","Freshwater",25,"Chronic",8.5,"N.A.","Kszos, L.A., Stewart, A.J. and Taylor, P.A. (1992) An evaluation of nickel toxicity to Ceriodaphnia dubia and Daphnia magna in a contaminated stream and in laboratory tests. Environmental Toxicology and Chemistry 11:1001–1012","13"]
["Freshwater/metal/non- plant","171-10",78,0.78,"","Daphnia longispina","<48h old neonate","21 d","LC50","Survival",">118","Microinvertebrate","Arthropoda","Branchiopoda","Freshwater","20°C","Chronic",7.18,"N.A.","Deleebeeck, N.M. E, Muyssen, B.T.A, De Laender, F, Janssen, C.R., De Schamphelaere, K.A.C (2007). Comparison of nickel toxicity to cladocerans in soft versus hard surface waters, Aquatic Toxicology 84: 223-235.","171"]
["Freshwater/metal/non- plant","13-5",47,0.47,"DO NO USE - The highest possible grade for this datum is acceptable.","Pimephales promelas","larvae","7 d","NOEC","Survival","=>16 mg/L","Fish","Chordata","Actinopterygii","Freshwater",25,"Chronic",8.1,"N.A.","Kszos, L.A., Stewart, A.J. and Taylor, P.A. (1992) An evaluation of nickel toxicity to Ceriodaphnia dubia and Daphnia magna in a contaminated stream and in laboratory tests. Environmental Toxicology and Chemistry 11:1001–1012","13"]
{"$rows_left_out":480}
{"sheet":"FW metal nonplant","index":5,"n_rows":90,"n_cols":54,"rows_kept":90,"cut":false,"hidden":false,"merged":[[3,4,7,4],[9,2,9,4],[11,2,13,2],[11,7,13,7],[14,2,16,2],[14,7,16,7],[17,2,19,2],[17,7,19,7],[20,2,21,2],[20,7,21,7],[22,2,24,2],[22,7,24,7],[25,2,27,2],[25,7,27,7],[28,2,30,2],[28,7,30,7],[31,2,33,2],[31,7,33,7],[34,2,36,2],[34,7,36,7],[37,2,39,2],[37,7,39,7],[40,2,42,2],[40,7,42,7],[43,2,45,2],[43,7,45,7],[46,2,48,2],[46,7,48,7],[49,2,51,2],[49,7,51,7],[62,7,64,7],[74,2,77,2],[74,7,77,7],[52,2,54,2],[52,7,54,7],[56,7,58,7],[65,7,67,7],[68,7,70,7],[71,2,73,2],[71,7,73,7],[59,7,61,7]]}
[null,1,"Fill in the blank cells below, based on information provided in the paper being assessed. You can either pick an option from the dropdown list or add the appropriate detail using the 'Add to list' button. ",null,null,null,null,null,null,null,null,null,null,null,"* All the text in RED are used for drop down list ,make changes with caution."]
[null,null,"Category",{"$f":"IF(AF3=\"\",0,1)","v":1},"Freshwater/metal/non- plant",{"$f":"IF(E3=\"\",0,1)","v":1},"Citation No.",{"$f":"IF(ISERROR(FIND(\"-\",E3)),E3,LEFT(E3,FIND(\"-\",E3)-1))","v":"177"},null,"Taxonomic group",null,null,null,null,"Species",null,null,"Lifestage",null,null,"Exposure duration",null,null,"Measure of toxicity",null,null,"Toxicity endpoint",null,null,"Taxonomic group",null,null,"Phylum",null,null,"Class",null,null,"Media",null,null,"Temperature ",null,null,"Acute Or Chronic",null,null,"PH",null,null,"Salinity/Comdictivity"]
[null,null,"Paper and data unique identifier(eg. 1-1,10-150)",{"$f":"IF(AI3=\"\",0,1)","v":1},"177-15",{"$f":"IF(E4=\"\",0,1)","v":1},"Species (Scientific name)",null,null,"Phylum",null,null,null,null,"Aedes albopictus",34,{"$f":"IF(P3=0,\"\",INDEX(O3:O111,P3))","v":"Melanotaenia splendida splendida"},"<12h nauplii",18,{"$f":"IF(S3=0,\"\",INDEX(R3:R111,S3))","v":"embryo"},"10 d",25,{"$f":"IF(V3=0,\"\",INDEX(U3:U111,V3))","v":"12-d"},"EC10",12,{"$f":"IF(Y3=0,\"\",INDEX(X3:X111,Y3))","v":"NOEC"},"edema",18,{"$f":"IF(AB3=0,\"\",INDEX(AA3:AA111,AB3))","v":"Embryo hatching success/imbalance"},"Bacteria",2,{"$f":"IF(AE3=0,\"\",INDEX(AD3:AD111,AE3))","v":"Fish"},"Arthropoda",3,{"$f":"IF(AH3=0,\"\",INDEX(AG3:AG111,AH3))","v":"Chordata"},"Actinopterygii",1,{"$f":"IF(AK3=0,\"\",INDEX(AJ3:AJ111,AK3))","v":"Actinopterygii"},"Freshwater",9,{"$f":"IF(AN3=0,\"\",INDEX(AM3:AM111,AN3))","v":"Tea Tree River"},26,7,{"$f":"IF(AQ3=0,\"\",INDEX(AP3:AP111,AQ3))","v":"25 ± 2"},"Acute ",2,{"$f":"IF(AT3=0,\"\",INDEX(AS3:AS111,AT3))","v":"Chronic"},6.9,29,{"$f":"IF(AW3=0,\"\",INDEX(AV3:AV111,AW3))","v":"6.9-7.2"},null,null,"N.A.",1]
[null,null,"Citation",{"$f":"IF(AL3=\"\",0,1)","v":1},"Ecotox Services Australia. 2014. Toxicity of Nickel Under Varying Physico-chemical Conditions. Prepared for Nickel Producers Environmental Research Association (NiPERA). Test Report. May 2014.",{"$f":"IF(H8=\"\",0,1)","v":1},"Lifestage",null,null,"Class",null,null,null,null,"Aeromonas hydrophila",null,null,"<24h old",null,null,"11 d",null,null,"EC20",null,null,"growth",null,null,"Fish",null,null,"Chlorophyta",null,null,"Branchiopoda",null,null,"Marinewater",null,null,"15°C",null,null,"Chronic",null,null,7]
[null,null,null,{"$f":"IF(AO3=\"\",0,1)","v":1},null,{"$f":"IF(AX3=\"\",0,1)","v":1},"Exposure duration",null,null,"Media",null,null,null,null,"Alona affinis",null,null,"<24h old neonate",null,null,"11 hour",null,null,"EC25",null,null,"growth",null,null,"Gastropod",null,null,"Chordata",null,null,"Chlorophyceae",null,null,"N.A.",null,null,"20°C",null,null,"N.A.",null,null,7.1]
[null,null,null,{"$f":"IF(AR3=\"\",0,1)","v":1},null,{"$f":"IF(Q3=\"\",0,1)","v":1},"Measure of toxicity",null,null,"Temperature ",null,null,null,null,"Australian Bass",null,null,"<2d old embryos",null,null,"12 weeks",null,null,"EC50",null,null,"Growth (AFDW)",null,null,"Insect",null,null,"Cnidaria",null,null,"Gammaproteobacteria",null,null,"Synthetic Magela Creek Water (SMCW)",null,null,"23°C",null,null,null,null,null,7.18]
[null,null,null,{"$f":"IF(AU3=\"\",0,1)","v":1},null,{"$f":"IF(T3=\"\",0,1)","v":1},"Toxicity endpoint",null,null,"Acute Or Chronic ",null,null,null,null,"Brachionus calcyflorus",null,null,"<48h old neonate",null,null,"13 days",null,null,"larval development",null,null,"Growth (dry weight)",null,null,"Macroinvertebrate",null,null,"Mollusca",null,null,"Gastropoda",null,null,"Woronora River water",null,null,"23-25",null,null,null,null,null,7.3]
[null,null,null,null,null,{"$f":"IF(W3=\"\",0,1)","v":1},"Toxicity value",52,null,"PH",null,null,null,null,"Brachydanio rerio",null,null,"0-1 week old young",null,null,"14 d",null,null,"larval development ratio",null,null,"Growth (wet weight)",null,null,"Macrophyte",null,null,"N.A.",null,null,"Hexanauplia",null,null,"Magela Creek",null,null,"25 ± 1",null,null,null,null,null,7.4]
[null,2,"Select the appropriate answer option to each question. Comments can be added to the cells in column H.",null,null,{"$f":"IF(Z3=\"\",0,1)","v":1},null,null,null,"Salinity/Conductivity","N.A.",null,null,null,"Camptocerus lilljeborgi",null,null,"1 d old larvae",null,null,"15 d",null,null,"LC20",null,null,"Hatching",null,null,"Microalga",null,null,"Proteobacteria",null,null,"Hydrozoa",null,null,"Peechalba River",null,null,"25 ± 2",null,null,null,null,null,7.61]
[null,"*","If the selected answer option does not work try clicking on any other cell first and then click back on the answer option again.",null,null,{"$f":"IF(AC3=\"\",0,1)","v":1},null,null,null,null,null,null,null,null,"Catla catla",null,null,"1 month",null,null,"15-17d",null,null,"LC25",null,null,"larval development",null,null,"Microinvertebrate",null,null,"Tracheophyta",null,null,"Insecta",null,null,"Wellington River",null,null,"25.3 ± 0.8",null,null,null,null,null,7.66]
{"$rows_left_out":81}
{"sheet":"FW metal nonplant_WS","index":6,"n_rows":911,"n_cols":26,"rows_kept":911,"cut":false,"hidden":false,"merged":[]}
[]
["Question No.",1,2,3,4,5,6,7,8,9,10,11,12,13,14,15,16.100000000000001,16.2,16.3,16.399999999999999,16.600000000000001,17,18,"Total Score","Quality Score"]
["Short Questions","Duration of the exposure ","Biological endpoint","Biological effect stated or not","Biological effect quantified or not","Appropriate controls","Control & contaminant concentration","Test acceptability criteria","Characteristics of the test organism"," Type of test media","Type of exposure","Contaminant concentrations","Parallel reference toxicant toxicity tests","Concentration–response relationship","Determine the toxicity","NOEC/LOEC or LC/EC/BEC","pH","Hardness","Alkalinity","Organic carbon concentration","Dissolved Oxygen","Temperature","Grade or purity"]
["Marks Awarded ","10 or 0","10,5 or 0","5 or 0 ","5 or 0 ","5 or 0 ","5 or 0 ","5 or 0 ","5 or 0 ","5 or 0 ","4 or 0","4 or 2 or 0","4 or 2","4 or 2","4 or 2","4 or 2","3 or 1 or 0","3 or 1 or 0","3 or 1 or 0","3 or 1 or 0","3 or 1 or 0","3 or 0","3 or 0 "]
["Max. Possible Score",10,10,5,5,5,5,5,5,5,4,4,4,4,4,4,3,3,3,3,3,3,3,{"$f":"SUM(B5:W5)","v":100}]
["Category","Freshwater/metal/non- plant","Paper and data unique identifier(eg. 1-1,10-150)","151-1"]
["Scores",10,10,0,5,5,0,0,0,5,0,0,0,4,0,0,1,0,0,0,0,1,0,41,0.41,"The highest possible grade for this datum is acceptable."]
["Answers","20 h","Growth - measured as increase in turbidity","Not stated, but '50% growth' value reported","EC50 of 0.22 µM nickel, converted = 13 mg/L","","NR","","","Broth (1% glucose, 0.5% neopeptone)","","","","","","","pH 7","","","","",28,""]
["Category","Freshwater/metal/non- plant","Paper and data unique identifier(eg. 1-1,10-150)","153-1"]
["Scores",10,10,5,5,5,0,0,5,5,4,0,0,4,0,0,3,1,0,0,3,3,3,66,0.66,"The highest possible grade for this datum is acceptable."]
{"$rows_left_out":902}
{"sheet":"FW metal plant","index":7,"n_rows":87,"n_cols":53,"rows_kept":87,"cut":false,"hidden":false,"merged":[[3,4,7,4],[9,2,9,4],[11,2,13,2],[11,7,13,7],[14,2,16,2],[14,7,16,7],[17,2,19,2],[17,7,19,7],[20,2,21,2],[20,7,21,7],[22,2,24,2],[22,7,24,7],[25,2,27,2],[25,7,27,7],[28,2,30,2],[28,7,30,7],[31,2,33,2],[31,7,33,7],[34,2,36,2],[34,7,36,7],[37,2,39,2],[37,7,39,7],[40,2,42,2],[40,7,42,7],[43,2,45,2],[43,7,45,7],[46,2,48,2],[46,7,48,7],[49,2,51,2],[49,7,51,7],[71,2,74,2],[71,7,74,7],[52,2,54,2],[52,7,54,7],[68,2,70,2],[68,7,70,7],[65,7,67,7],[56,7,58,7],[59,7,61,7],[62,7,64,7]]}
[null,1,"Fill in the blank cells below, based on information provided in the paper being assessed. You can either pick an option from the dropdown list or add the appropriate detail using the 'Add to list' button. ",null,null,null,null,null,null,null,null,null,null,null,"* All the text in RED are used for drop down list ,make changes with caution."]
[null,null,"Category",{"$f":"IF(AF3=\"\",0,1)","v":1},"Freshwater/metal/plant",{"$f":"IF(E3=\"\",0,1)","v":1},"Citation No.",{"$f":"IF(ISERROR(FIND(\"-\",E3)),E3,LEFT(E3,FIND(\"-\",E3)-1))","v":"175"},null,"Taxonomic group",null,null,null,null,"Species",null,null,"Lifestage",null,null,"Exposure duration",null,null,"Measure of toxicity",null,null,"Toxicity endpoint",null,null,"Taxonomic group",null,null,"Phylum",null,null,"Class",null,null,"Media",null,null,"Temperature ",null,null,"Acute Or Chronic",null,null,"PH",null,null,"Salinity/Comdictivity"]
[null,null,"Paper and data unique identifier(eg. 1-1,10-150)",{"$f":"IF(AI3=\"\",0,1)","v":1},"175-5",{"$f":"IF(E4=\"\",0,1)","v":1},"Species (Scientific name)",null,null,"Phylum",null,null,null,null,"Aedes albopictus",26,{"$f":"IF(P3=0,\"\",INDEX(O3:O108,P3))","v":"Pediastrum duplex meyan (in multispecies assay)"},"1 month",6,{"$f":"IF(S3=0,\"\",INDEX(R3:R108,S3))","v":"exponentially growing cells"},"11 hour",7,{"$f":"IF(V3=0,\"\",INDEX(U3:U108,V3))","v":"72 h"},"EC10",1,{"$f":"IF(Y3=0,\"\",INDEX(X3:X108,Y3))","v":"EC10"},"Biomass (Chl a)",10,{"$f":"IF(AB3=0,\"\",INDEX(AA3:AA108,AB3))","v":"Growth rate"},"Fish ",3,{"$f":"IF(AE3=0,\"\",INDEX(AD3:AD108,AE3))","v":"Microalga"},"Angiosperms",2,{"$f":"IF(AH3=0,\"\",INDEX(AG3:AG108,AH3))","v":"Chlorophyta"},"Branchiopoda",3,{"$f":"IF(AK3=0,\"\",INDEX(AJ3:AJ108,AK3))","v":"Chlorophyceae"},"Freshwater",1,{"$f":"IF(AN3=0,\"\",INDEX(AM3:AM108,AN3))","v":"Freshwater"},"15°C",9,{"$f":"IF(AQ3=0,\"\",INDEX(AP3:AP108,AQ3))","v":27},"Acute ",2,{"$f":"IF(AT3=0,\"\",INDEX(AS3:AS108,AT3))","v":"Chronic"},6.4,17,{"$f":"IF(AW3=0,\"\",INDEX(AV3:AV108,AW3))","v":7.5},"Salinity1",null,"N.A."]
[null,null,"Citation",{"$f":"IF(AL3=\"\",0,1)","v":1},"McKnight et al 2018 (unpublished data)",{"$f":"IF(H8=\"\",0,1)","v":1},"Lifestage",null,null,"Class",null,null,null,null,"Ankistrodesmus falcatus",null,null,"1 year old",null,null,"12 d",null,null,"EC20",null,null,"Biomass (Chl b)",null,null,"Macrophyte",null,null,"Chlorophyta",null,null,"Chlorophyceae",null,null,"Marinewater",null,null,"25 ± 1",null,null,"Chronic",null,null,6.8,null,null,"Salinity2"]
[null,null,null,{"$f":"IF(AO3=\"\",0,1)","v":1},null,{"$f":"IF(AX3=\"\",0,1)","v":1},"Exposure duration",null,null,"Media",null,null,null,null,"Australian Bass",null,null,"3- and 4- frond colonies",null,null,"13 days",null,null,"EC25",null,null,"Biomass (dry weight)",null,null,"Microalga",null,null,"N.A.",null,null,"Chlorophyceae",null,null,"N.A.",null,null,"25 ± 2",null,null,"N.A.",null,null,6.9]
[null,null,null,{"$f":"IF(AR3=\"\",0,1)","v":1},null,{"$f":"IF(Q3=\"\",0,1)","v":1},"Measure of toxicity",null,null,"Temperature ",null,null,null,null,"Chlamydomonas sp",null,null,"3-frond colonies",null,null,"14 d",null,null,"EC50",null,null,"Biomass (fresh weight)",null,null,"N.A.",null,null,"Tracheophyta",null,null,"Liliopsida",null,null,null,null,null,"25°C",null,null,null,null,null,7.1]
[null,null,null,{"$f":"IF(AU3=\"\",0,1)","v":1},null,{"$f":"IF(T3=\"\",0,1)","v":1},"Toxicity endpoint",null,null,"Acute Or Chronic ",null,null,null,null,"Chlorella pyrenoidosa",null,null,"6 fronds",null,null,"5 d",null,null,"IC25",null,null,"Biomass cyanobacteria (zeaxanthin)",null,null,"phytoplankton community",null,null,"Tracheophyta",null,null,"N.A.",null,null,null,null,null,"28 ± 1",null,null,null,null,null,7.3]
[null,null,null,null,null,{"$f":"IF(W3=\"\",0,1)","v":1},"Toxicity value",173,null,"PH",null,null,null,null,"Chlorella sp",null,null,"exponentially growing cells",null,null,"7 d",null,null,"LC50",null,null,"Biomass green algae (lutein)",null,null,null,null,null,"Ochrophyta",null,null,"Eustigmatophyceae",null,null,null,null,null,"29 ± 2",null,null,null,null,null,7.8]
[null,2,"Select the appropriate answer option to each question. Comments can be added to the cells in column H.",null,null,{"$f":"IF(Z3=\"\",0,1)","v":1},null,null,null,"Salinity/Conductivity","N.A.",null,null,null,"Chlorella sp.",null,null,"exponentially growing cells",null,null,"72 h",null,null,"N.A.",null,null,"Growth",null,null,null,null,null,null,null,null,null,null,null,null,null,null,"N.A.",null,null,null,null,null,8]
[null,"*","If the selected answer option does not work try clicking on any other cell first and then click back on the answer option again.",null,null,{"$f":"IF(AC3=\"\",0,1)","v":1},null,null,null,null,null,null,null,null,"Coelastrum microporum",null,null,"late log phase growth cells",null,null,"96 h",null,null,"NOEC",null,null,"Growth (absorbance measurement)",null,null,null,null,null,null,null,null,null,null,null,null,null,null,"N.R.",null,null,null,null,null,8.15]
{"$rows_left_out":78}
{"sheet":"FW metal plant_WS","index":8,"n_rows":560,"n_cols":25,"rows_kept":560,"cut":false,"hidden":false,"merged":[]}
[]
["Question No.",1,2,3,4,5,6,7,8,9,10,11,12,13,14,15,16.100000000000001,16.2,16.3,16.399999999999999,17,18,"Total Score","Quality Score"]
["Short Questions","Duration of the exposure ","Biological endpoint","Biological effect stated or not","Biological effect quantified or not","Appropriate controls","Control & contaminant concentration","Test acceptability criteria","Characteristics of the test organism"," Type of test media","Type of exposure","Contaminant concentrations","Parallel reference toxicant toxicity tests","Concentration–response relationship","Determine the toxicity","NOEC/LOEC or LC/EC/BEC","pH","Hardness","Alkalinity ","Organic carbon concentration","Temperature","Grade or purity"]
["Marks Awarded ","10 or 0","10,5 or 0","5 or 0 ","5 or 0 ","5 or 0 ","5 or 0 ","5 or 0 ","5 or 0 ","5 or 0 ","4 or 0","4 or 2 or 0","4 or 2","4 or 2","4 or 2","4 or 2","3 or 1 or 0","3 or 1 or 0","3 or 1 or 0","3 or 1 or 0","3 or 0","3 or 0 "]
["Max. Possible Score",10,10,5,5,5,5,5,5,5,4,4,4,4,4,4,3,3,3,3,3,3,{"$f":"SUM(B5:V5)","v":97}]
["Category","Freshwater/metal/plant","Paper and data unique identifier(eg. 1-1,10-150)","150-1"]
["Scores",10,10,5,5,5,5,5,5,5,0,0,0,4,4,0,0,0,0,0,1,3,67,0.69072164948453607,"The highest possible grade for this datum is acceptable."]
["Answers","7 d","Growth, frond number","EC","EC10","yes","Assumed - followed ISO protcol","Controls response stated as increasing from 10 fronds to more than 100 over 7 days.","3- and 4- frond colonies","modified Steinberg medium","assume static","","","","","Not provided for EC10s. EC10s had to re-determined by calucator. They provided EC50 values, and a ratio of EC50/EC10.","","","","",25,"pro anlaysi' = AR grade chemicals used. Merck."]
["Category","Freshwater/metal/plant","Paper and data unique identifier(eg. 1-1,10-150)","150-2"]
["Scores",10,10,5,5,5,5,5,5,5,0,0,0,4,4,0,0,0,0,0,1,3,67,0.69072164948453607,"The highest possible grade for this datum is acceptable."]
{"$rows_left_out":550}