{"text_format":"1","workbook":"xlsx","n_sheets":7,"sheets":["Copyright","Cover","Instruction","All Result","Fresh Data QA","Sheet1","Fresh Quality"],"not_rendered":{"charts":0,"images":0,"macros":1,"external_links":0,"defined_names":2,"comments":2,"pivot_tables":0},"unopened":[],"bounds":{"document_bytes":16777216,"sheet_cells":100000,"rows_first":2000,"rows_last":500,"rows_between":2000,"halvings":0,"cell_chars":16384,"cell_head_chars":4096},"cells_cut":0,"cells_raw":0,"read":"whole","date_system":"1900"}

{"sheet":"Copyright","index":0,"n_rows":0,"n_cols":0,"rows_kept":0,"cut":false,"hidden":false,"merged":[]}

{"sheet":"Cover","index":1,"n_rows":20,"n_cols":7,"rows_kept":20,"cut":false,"hidden":false,"merged":[[18,6,18,8],[14,6,14,8],[13,6,13,8],[4,4,4,10],[9,6,9,8],[12,6,12,8],[5,5,6,9]]}
[]
[]
[]
[]
[null,null,null,null,"Ecotoxicity Data Quality Assessment Method "]
[null,null,null,null,null,"To be used to assess the quality of data used for the Australian and New Zealand Guidelines for Fresh and Marine Water Quality (including sediment) and the Australian National Environment Protection (Assessment of Site Contamination) Measure"]
[]
[]
[]
[null,null,null,null,null,null,"Developed by "]
[]
[]
[null,null,null,null,null,null,"Zoe Zhang"]
[null,null,null,null,null,null,"   Dr. Michael Warne"]
[null,null,null,null,null,null,"Alison Vieritz "]
{"$rows_left_out":6}
{"sheet":"Instruction","index":2,"n_rows":17,"n_cols":11,"rows_kept":17,"cut":false,"hidden":false,"merged":[[16,6,16,8],[22,4,22,8]]}
[]
[]
[]
[]
[]
[]
[null,"Tabs contain questionaries -->           ",null,null,"Fresh Data QA ",null,"Marine Data QA",null,"Terrestrial Data QA",null,"Sediment Data QA"]
[]
[]
[]
[null,"Tabs contain score of paper and short answers to questions -->",null,null,"Fresh Quality",null,"Marine Quality",null,"Terrestrial Quality",null,"Sediment Quality"]
[]
[]
[]
[]
{"$rows_left_out":3}
{"sheet":"All Result","index":3,"n_rows":163,"n_cols":26,"rows_kept":163,"cut":false,"hidden":false,"merged":[[143,1,143,2]]}
["Chemical:","Metsulfuron-methyl"]
["CAS Number:","74223-64-6"]
[]
[{"$f":"'Fresh Data QA'!C2","v":"Category"},{"$f":"'Fresh Data QA'!C3","v":"Paper and data unique identifier(eg. 1-1,10-150)"},{"$f":"'Fresh Data QA'!C90","v":"Total score"},{"$f":"'Fresh Data QA'!C92","v":"Quality Score"},{"$f":"'Fresh Data QA'!G3","v":"Species (Scientific name)"},{"$f":"'Fresh Data QA'!G4","v":"Lifestage"},{"$f":"'Fresh Data QA'!G5","v":"Exposure duration"},{"$f":"'Fresh Data QA'!G6","v":"Measure of toxicity"},{"$f":"'Fresh Data QA'!G7","v":"Toxicity endpoint"},{"$f":"'Fresh Data QA'!G8","v":"Toxicity value"},{"$f":"'Fresh Data QA'!C4","v":"Citation"},{"$f":"'Fresh Data QA'!G2","v":"Citation No."},null,null,"Checked (10/01/18)","Double check"]
["Freshwater","886-1",75,0.72815533980582525,"Rhinella arenarum","Tadpoles","48 hours","Mortality: Survival","LC50","105.56 mg/L","Lajmanovich,R.C., C.M. Junges, A.M. Attademo, P.M. Peltzer, M.C. Cabagna-Zenklusen, and A. Basso, 2013. Individual and Mixture Toxicity of Commercial Formulations Containing Glyphosate, Metsulfuron-Methyl, Bispyribac-Sodium, and Picloram on Rhinella arenarum Tadpoles, Water Air Soil Pollut.224(3): 1-13. ","886","Do Not Use - Use QAQC Version below",null,"Formulation - 60% active ingredient","Do not use - Formulation - 60% active ingredient"]
["Freshwater","886-2",75,0.72815533980582525,"Rhinella arenarum","Tadpoles","48 hours","Mortality: Survival","NOEC","80 mg/L","Lajmanovich,R.C., C.M. Junges, A.M. Attademo, P.M. Peltzer, M.C. Cabagna-Zenklusen, and A. Basso, 2013. Individual and Mixture Toxicity of Commercial Formulations Containing Glyphosate, Metsulfuron-Methyl, Bispyribac-Sodium, and Picloram on Rhinella arenarum Tadpoles, Water Air Soil Pollut.224(3): 1-13. ","886","Do Not Use - Use QAQC Version below",null,"Formulation - 60% active ingredient","Do not use - Formulation - 60% active ingredient"]
["Freshwater","886-3",75,0.72815533980582525,"Rhinella arenarum","Tadpoles","48 hours","Mortality: Survival","LOEC","160 mg/L","Lajmanovich,R.C., C.M. Junges, A.M. Attademo, P.M. Peltzer, M.C. Cabagna-Zenklusen, and A. Basso, 2013. Individual and Mixture Toxicity of Commercial Formulations Containing Glyphosate, Metsulfuron-Methyl, Bispyribac-Sodium, and Picloram on Rhinella arenarum Tadpoles, Water Air Soil Pollut.224(3): 1-13. ","886","Do Not Use - Use QAQC Version below",null,"Formulation - 60% active ingredient","Do not use - Formulation - 60% active ingredient"]
["Freshwater","886-4",75,0.72815533980582525,"Rhinella arenarum","Tadpoles","48 hours","Mortality: Survival","LC50","13.2 mg/L","Lajmanovich,R.C., C.M. Junges, A.M. Attademo, P.M. Peltzer, M.C. Cabagna-Zenklusen, and A. Basso, 2013. Individual and Mixture Toxicity of Commercial Formulations Containing Glyphosate, Metsulfuron-Methyl, Bispyribac-Sodium, and Picloram on Rhinella arenarum Tadpoles, Water Air Soil Pollut.224(3): 1-13. ","886","GLYPHOSATE",null,"Formulation - 74.7% active ingredient","Formulation do not use as Glyphosate is test chemical"]
["Freshwater","886-5",75,0.72815533980582525,"Rhinella arenarum","Tadpoles","48 hours","Mortality: Survival","NOEC","10 mg/L","Lajmanovich,R.C., C.M. Junges, A.M. Attademo, P.M. Peltzer, M.C. Cabagna-Zenklusen, and A. Basso, 2013. Individual and Mixture Toxicity of Commercial Formulations Containing Glyphosate, Metsulfuron-Methyl, Bispyribac-Sodium, and Picloram on Rhinella arenarum Tadpoles, Water Air Soil Pollut.224(3): 1-13. ","886","GLYPHOSATE",null,"Formulation - 74.7% active ingredient","Formulation do not use as Glyphosate is test chemical"]
["Freshwater","886-6",75,0.72815533980582525,"Rhinella arenarum","Tadpoles","48 hours","Mortality: Survival","LOEC","20 mg/L","Lajmanovich,R.C., C.M. Junges, A.M. Attademo, P.M. Peltzer, M.C. Cabagna-Zenklusen, and A. Basso, 2013. Individual and Mixture Toxicity of Commercial Formulations Containing Glyphosate, Metsulfuron-Methyl, Bispyribac-Sodium, and Picloram on Rhinella arenarum Tadpoles, Water Air Soil Pollut.224(3): 1-13. ","886","GLYPHOSATE",null,"Formulation - 74.7% active ingredient","Formulation do not use as Glyphosate is test chemical"]
["Freshwater","887-1",67,0.65048543689320393,"Lemna minor","1 Frond","7 days","Population: Relative Growth Rate","EC50","0.51 ug/L","Munkegaard,M., M. Abbaspoor, and N. Cedergreen, 2008. Organophosphorous Insecticides as Herbicide Synergists on the Green Algae Pseudokirchneriella subcapitata and the Aquatic Plant Lemna minor, Ecotoxicology17(1): 29-35. ","887","Do Not Use - Use QAQC Version below",null,"Technical grade, 95% purity","Do not use"]
["Freshwater","887-2",67,0.65048543689320393,"Lemna minor","1 Frond","7 days","Population: Relative Growth Rate","EC50","157 ug/L","Munkegaard,M., M. Abbaspoor, and N. Cedergreen, 2008. Organophosphorous Insecticides as Herbicide Synergists on the Green Algae Pseudokirchneriella subcapitata and the Aquatic Plant Lemna minor, Ecotoxicology17(1): 29-35. ","887","TERBUTHYLAZINE",null,"Technical grade, 99% purity","Do not use"]
["Freshwater","887-3",71,0.68932038834951459,"Pseudokircheriella subcapitata","not-stated","48 hours","Population: Relative Growth Rate","EC50","1934 ug/L","Munkegaard,M., M. Abbaspoor, and N. Cedergreen, 2008. Organophosphorous Insecticides as Herbicide Synergists on the Green Algae Pseudokirchneriella subcapitata and the Aquatic Plant Lemna minor, Ecotoxicology17(1): 29-35. ","887","Do Not Use - Use QAQC Version below",null,"Technical grade, 95% purity","Do not use"]
["Freshwater","887-4",71,0.68932038834951459,"Pseudokircheriella subcapitata","not-stated","48 hours","Population: Relative Growth Rate","EC50","595 ug/L","Munkegaard,M., M. Abbaspoor, and N. Cedergreen, 2008. Organophosphorous Insecticides as Herbicide Synergists on the Green Algae Pseudokirchneriella subcapitata and the Aquatic Plant Lemna minor, Ecotoxicology17(1): 29-35. ","887","TERBUTHYLAZINE",null,"Technical grade, 99% purity","Do not use"]
["Freshwater","888-1",65,0.6310679611650486,"Selenastrum capricornutum","24 hr-old culture","72 hours","Population: Growth Inhibition","IC50","611.8 ug/L","Fai,P.B., A. Grant, and B. Reid, 2007. Chlorophyll a Fluorescence as a Biomarker for Rapid Toxicity Assessment,  Environ. Toxicol. Chem.26(7): 1520-1531. ","888","Do Not Use - Use QAQC Version below",null,"Pestanal analytical standards","Do not use"]
{"$rows_left_out":149}
{"sheet":"Fresh Data QA","index":4,"n_rows":98,"n_cols":25,"rows_kept":98,"cut":false,"hidden":false,"merged":[[3,4,7,4],[56,7,59,7],[60,7,63,7],[40,7,42,7],[43,7,45,7],[46,7,48,7],[49,7,51,7],[34,7,36,7],[52,7,54,7],[14,7,16,7],[9,2,9,4],[20,2,21,2],[22,2,24,2],[17,7,19,7],[20,7,21,7],[80,7,82,7],[64,7,67,7],[68,7,71,7],[72,7,75,7],[76,7,79,7],[72,2,75,2],[76,2,79,2],[11,7,13,7],[37,7,39,7],[28,7,30,7],[31,7,33,7],[25,7,27,7],[11,2,13,2],[14,2,16,2],[17,2,19,2],[25,2,27,2],[22,7,24,7],[83,7,86,7],[34,2,36,2],[37,2,39,2],[28,2,30,2],[60,2,63,2],[40,2,42,2],[43,2,45,2],[83,2,86,2],[46,2,48,2],[31,2,33,2],[80,2,82,2],[49,2,51,2],[52,2,54,2],[56,2,59,2],[64,2,67,2],[68,2,71,2]]}
[null,1,"FILL IN BLANKS BELOW,PICK OPTIONS FROM DROPDOWN LIST",null,null,null,null,null,null,null,"* All the text in Blue are used for drop down list ,make changes with caution."]
[null,null,"Category",null,"Freshwater",{"$f":"IF(M3=\"\",0,1)","v":1},"Citation No.",{"$f":"IF(E3=\"\",\"\",LEFT(E3,FIND(\"-\",E3) -1))","v":"1259"},null,null,"Species",null,null,"Lifestage",null,null,"Exposure duration",null,null,"Measure of toxicity",null,null,"Toxicity endpoint"]
[null,null,"Paper and data unique identifier(eg. 1-1,10-150)",null,"1259-4",{"$f":"IF(E3=\"\",0,1)","v":1},"Species (Scientific name)",null,null,null,"Australian Bass",15,{"$f":"IF(L3=0,\"\",INDEX(K3:K50,L3))","v":"Lemna minor"},"1 Frond",10,{"$f":"IF(O3=0,\"\",INDEX(N3:N50,O3))","v":"not stated"},"1 hour ",25,{"$f":"IF(R3=0,\"\",INDEX(Q3:Q50,R3))","v":"15 days"},"Development: Root Growth",3,{"$f":"IF(U3=0,\"\",INDEX(T3:T50,U3))","v":"Growth rate: Dry weight"},0.01,14,{"$f":"IF(X3=0,\"\",INDEX(W3:W50,X3))","v":"EC50"}]
[null,null,"Citation",null,"Cedergreen N and Streibig J (2005). Can the choice of endpoint lead to contradictory results of mixture-toxicity experiments?, Environmental Toxicology and Chemistry, 24(7), 1676-1683.",{"$f":"IF(E4=\"\",0,1)","v":1},"Lifestage",null,null,null,"Bala Shark",null,null,"24 hr-old culture",null,null,"14 days",null,null,"Development: Root Occurence",null,null,0.02]
[null,null,null,null,null,{"$f":"IF(S3=\"\",0,1)","v":1},"Exposure duration",null,null,null,"Basa",null,null,"Apical shoot (19.5 cm)",null,null,"2 days",null,null,"Growth rate: Dry weight",null,null,0.03]
[null,null,null,null,null,{"$f":"IF(V3=\"\",0,1)","v":1},"Measure of toxicity",null,null,null,"Batrachium trichophyllum",null,null,"Apical shoot (3.60g - 3.65g)",null,null,"2 hours",null,null,"Growth rate: Frond area",null,null,0.04]
[null,null,null,null,null,{"$f":"IF(Y3=\"\",0,1)","v":1},"Toxicity endpoint",null,null,null,"Berula erecta",null,null,"Apical shoot (WW 2.30g - 2.35g)",null,null,"24 hours",null,null,"Growth rate: Frond count",null,null,0.05]
[null,null,null,null,null,{"$f":"IF(H8=\"\",0,1)","v":1},"Toxicity value","2.43 ug/L",null,null,"Black Parinha",null,null,"Axillary buds (3cm long)",null,null,"3 hours",null,null,"Growth rate: Theoretical frond area",null,null,0.06]
[null,2,"CHOOSE ANSWER OPTIONS AND FILL IN ANSWERS IN ANSWER COLUMN",null,null,{"$f":"IF(M3=\"\",0,1)","v":1},null,null,null,null,"Catfish",null,null,"Exponential growth culture",null,null,"4 days",null,null,"Growth: Cell density",null,null,7.0000000000000007E-2]
[null,"*","If had problem click on answer options,click on any  other cells first and then click back again.",null,null,{"$f":"IF(P3=\"\",0,1)","v":1},null,null,null,null,"Ceratophyllum demersum",null,null,"Exponential growth phase",null,null,"4 hours",null,null,"Growth: Frond number",null,null,0.08]
[null,"No.","Question","Marks Awarded","Answer Options","Option References","Scores","Answers",null,null,"Ceratophyllum submersum",null,null,"Exponential growth phase (colony with three fronds",null,null,"42 days",null,null,"Growth: Inhibition",null,null,0.09]
[null,null,"Was the duration of the exposure stated (e.g., 48 or 96 h)?",10,null,1,{"$f":"IF(F15=0,0,INDEX($D12:$D13,F12,1))","v":10},"6, 9, 12 and 15 days",null,null,"Chloella pyrenoidosa",null,null,"not stated",null,null,"48 hours",null,null,"Growth: Shoot length",null,null,0.1]
[null,1,null,0,null,null,null,null,null,null,"Eel",null,null,"not-stated",null,null,"48 hours",null,null,"Growth: Specific leaf area",null,null,"EC05"]
[null,null,null,null,null,null,null,null,null,null,"Elodea canadensis",null,null,"not-stated",null,null,"5 hours",null,null,"Method 1",null,null,"EC10"]
[null,null,"Was the biological endpoint (e.g., immobilization or population growth) stated and defined (10 marks)? Award 5 marks if the biological endpoint is only stated.",10,null,1,{"$f":"IF(F15=0,0,INDEX($D15:$D17,F15,1))","v":10},"Relative growth rate: Dry weight",null,null,"Elodea canadensis",null,null,"not-stated",null,null,"6 days",null,null,"Method 10",null,null,"EC20"]
{"$rows_left_out":84}
{"sheet":"Sheet1","index":5,"n_rows":34,"n_cols":29,"rows_kept":34,"cut":false,"hidden":true,"merged":[]}
[]
[{"$f":"'Fresh Data QA'!B11","v":"No."},{"$f":"'Fresh Data QA'!B13","v":1},{"$f":"'Fresh Data QA'!B16","v":2},{"$f":"'Fresh Data QA'!B19","v":3},{"$f":"'Fresh Data QA'!B21","v":4},{"$f":"'Fresh Data QA'!B23","v":5},{"$f":"'Fresh Data QA'!B26","v":6},{"$f":"'Fresh Data QA'!B29","v":7},{"$f":"'Fresh Data QA'!B32","v":8},{"$f":"'Fresh Data QA'!B35","v":9},{"$f":"'Fresh Data QA'!B39","v":10},{"$f":"'Fresh Data QA'!B42","v":11},{"$f":"'Fresh Data QA'!B45","v":12},{"$f":"'Fresh Data QA'!B48","v":13},{"$f":"'Fresh Data QA'!B51","v":14},{"$f":"'Fresh Data QA'!B53","v":15},{"$f":"'Fresh Data QA'!B58","v":16.100000000000001},{"$f":"'Fresh Data QA'!B62","v":16.2},{"$f":"'Fresh Data QA'!B66","v":16.3},{"$f":"'Fresh Data QA'!B70","v":16.399999999999999},{"$f":"'Fresh Data QA'!B74","v":16.5},{"$f":"'Fresh Data QA'!B78","v":16.600000000000001},{"$f":"'Fresh Data QA'!B82","v":17},{"$f":"'Fresh Data QA'!B85","v":18},{"$f":"'Fresh Data QA'!C90","v":"Total score"},{"$f":"'Fresh Data QA'!C92","v":"Quality Score"}]
[{"$f":"'Fresh Data QA'!C2","v":"Category"},{"$f":"'Fresh Data QA'!E2","v":"Freshwater"},{"$f":"'Fresh Data QA'!C3","v":"Paper and data unique identifier(eg. 1-1,10-150)"},{"$f":"'Fresh Data QA'!E3","v":"1259-4"}]
[{"$f":"'Fresh Data QA'!G11","v":"Scores"},{"$f":"'Fresh Data QA'!G12","v":10},{"$f":"'Fresh Data QA'!G15","v":10},{"$f":"'Fresh Data QA'!G18","v":5},{"$f":"'Fresh Data QA'!G21","v":5},{"$f":"'Fresh Data QA'!G23","v":5},{"$f":"'Fresh Data QA'!G26","v":5},{"$f":"'Fresh Data QA'!G29","v":0},{"$f":"'Fresh Data QA'!G32","v":0},{"$f":"'Fresh Data QA'!G35","v":5},{"$f":"'Fresh Data QA'!G38","v":0},{"$f":"'Fresh Data QA'!G41","v":0},{"$f":"'Fresh Data QA'!G44","v":0},{"$f":"'Fresh Data QA'!G47","v":4},{"$f":"'Fresh Data QA'!G50","v":4},{"$f":"'Fresh Data QA'!G53","v":4},{"$f":"'Fresh Data QA'!G57","v":3},{"$f":"'Fresh Data QA'!G61","v":0},{"$f":"'Fresh Data QA'!G65","v":0},{"$f":"'Fresh Data QA'!G69","v":0},{"$f":"'Fresh Data QA'!G73","v":0},{"$f":"'Fresh Data QA'!G77","v":0},{"$f":"'Fresh Data QA'!G81","v":3},{"$f":"'Fresh Data QA'!G84","v":3},{"$f":"'Fresh Data QA'!G90","v":66},{"$f":"'Fresh Data QA'!G92","v":0.64077669902912626}]
["Answers",{"$f":"IF('Fresh Data QA'!H12=0,\"\",'Fresh Data QA'!H12)","v":"6, 9, 12 and 15 days"},{"$f":"IF('Fresh Data QA'!H15=0,\"\",'Fresh Data QA'!H15)","v":"Relative growth rate: Dry weight"},{"$f":"IF('Fresh Data QA'!H18=0,\"\",'Fresh Data QA'!H18)","v":"EC50"},{"$f":"IF('Fresh Data QA'!H21=0,\"\",'Fresh Data QA'!H21)","v":"EC50"},{"$f":"IF('Fresh Data QA'!H23=0,\"\",'Fresh Data QA'!H23)","v":"Six replicates of each herbicide concentration and control were set up."},{"$f":"IF('Fresh Data QA'!H26=0,\"\",'Fresh Data QA'!H26)","v":"Six replicates of each herbicide concentration and control were set up."},{"$f":"IF('Fresh Data QA'!H29=0,\"\",'Fresh Data QA'!H29)","v":""},{"$f":"IF('Fresh Data QA'!H32=0,\"\",'Fresh Data QA'!H32)","v":"Not stated"},{"$f":"IF('Fresh Data QA'!H35=0,\"\",'Fresh Data QA'!H35)","v":"K medium at pH 5, 24 degrees C."},{"$f":"IF('Fresh Data QA'!H38=0,\"\",'Fresh Data QA'!H38)","v":"Not stated"},{"$f":"IF('Fresh Data QA'!H41=0,\"\",'Fresh Data QA'!H41)","v":"All concentrations are given in nominal concentrations. 0.053, 0.15, 0.43, 1.2, 3.5, 10 ug/L of metsulfuron-methyl\n"},{"$f":"IF('Fresh Data QA'!H44=0,\"\",'Fresh Data QA'!H44)","v":""},{"$f":"IF('Fresh Data QA'!H47=0,\"\",'Fresh Data QA'!H47)","v":"Observable and stated"},{"$f":"IF('Fresh Data QA'!H50=0,\"\",'Fresh Data QA'!H50)","v":"Logisitic curve"},{"$f":"IF('Fresh Data QA'!H53=0,\"\",'Fresh Data QA'!H53)","v":"Standard error"},{"$f":"IF('Fresh Data QA'!H57=0,\"\",'Fresh Data QA'!H57)","v":"pH 5"},{"$f":"IF('Fresh Data QA'!H61=0,\"\",'Fresh Data QA'!H65)","v":""},{"$f":"IF('Fresh Data QA'!H65=0,\"\",'Fresh Data QA'!H65)","v":""},{"$f":"IF('Fresh Data QA'!H69=0,\"\",'Fresh Data QA'!H69)","v":""},{"$f":"IF('Fresh Data QA'!H73=0,\"\",'Fresh Data QA'!H73)","v":""},{"$f":"IF('Fresh Data QA'!H77=0,\"\",'Fresh Data QA'!H77)","v":""},{"$f":"IF('Fresh Data QA'!H81=0,\"\",'Fresh Data QA'!H81)","v":"Growth cabinet at 24 degrees C"},{"$f":"IF('Fresh Data QA'!H84=0,\"\",'Fresh Data QA'!H84)","v":"Technical grade, 98.5%"}]
[{"$f":"'Fresh Data QA'!G3","v":"Species (Scientific name)"},{"$f":"'Fresh Data QA'!G4","v":"Lifestage"},{"$f":"'Fresh Data QA'!G5","v":"Exposure duration"},{"$f":"'Fresh Data QA'!G6","v":"Measure of toxicity"},{"$f":"'Fresh Data QA'!G7","v":"Toxicity endpoint"},{"$f":"'Fresh Data QA'!G8","v":"Toxicity value"},{"$f":"'Fresh Data QA'!C4","v":"Citation"},{"$f":"'Fresh Data QA'!G2","v":"Citation No."}]
[{"$f":"'Fresh Data QA'!M3","v":"Lemna minor"},{"$f":"'Fresh Data QA'!P3","v":"not stated"},{"$f":"'Fresh Data QA'!S3","v":"15 days"},{"$f":"'Fresh Data QA'!V3","v":"Growth rate: Dry weight"},{"$f":"'Fresh Data QA'!Y3","v":"EC50"},{"$f":"IF('Fresh Data QA'!H8=0,\"\",'Fresh Data QA'!H8)","v":"2.43 ug/L"},{"$f":"IF('Fresh Data QA'!E4=0,\"\",'Fresh Data QA'!E4)","v":"Cedergreen N and Streibig J (2005). Can the choice of endpoint lead to contradictory results of mixture-toxicity experiments?, Environmental Toxicology and Chemistry, 24(7), 1676-1683."},{"$f":"IF('Fresh Data QA'!H2=0,\"\",'Fresh Data QA'!H2)","v":"1259"}]
[]
[]
[]
[{"$f":"#REF!","v":{"$error":"#REF!"}},{"$f":"#REF!","v":{"$error":"#REF!"}},{"$f":"#REF!","v":{"$error":"#REF!"}},{"$f":"#REF!","v":{"$error":"#REF!"}},{"$f":"#REF!","v":{"$error":"#REF!"}},{"$f":"#REF!","v":{"$error":"#REF!"}},{"$f":"#REF!","v":{"$error":"#REF!"}},{"$f":"#REF!","v":{"$error":"#REF!"}},{"$f":"#REF!","v":{"$error":"#REF!"}},{"$f":"#REF!","v":{"$error":"#REF!"}},{"$f":"#REF!","v":{"$error":"#REF!"}},{"$f":"#REF!","v":{"$error":"#REF!"}},{"$f":"#REF!","v":{"$error":"#REF!"}},{"$f":"#REF!","v":{"$error":"#REF!"}},{"$f":"#REF!","v":{"$error":"#REF!"}},{"$f":"#REF!","v":{"$error":"#REF!"}},{"$f":"#REF!","v":{"$error":"#REF!"}},{"$f":"#REF!","v":{"$error":"#REF!"}},{"$f":"#REF!","v":{"$error":"#REF!"}},{"$f":"#REF!","v":{"$error":"#REF!"}},{"$f":"#REF!","v":{"$error":"#REF!"}},{"$f":"#REF!","v":{"$error":"#REF!"}},{"$f":"#REF!","v":{"$error":"#REF!"}},{"$f":"#REF!","v":{"$error":"#REF!"}},{"$f":"#REF!","v":{"$error":"#REF!"}},{"$f":"#REF!","v":{"$error":"#REF!"}},{"$f":"#REF!","v":{"$error":"#REF!"}}]
[{"$f":"#REF!","v":{"$error":"#REF!"}},{"$f":"#REF!","v":{"$error":"#REF!"}},{"$f":"#REF!","v":{"$error":"#REF!"}},{"$f":"#REF!","v":{"$error":"#REF!"}}]
[{"$f":"#REF!","v":{"$error":"#REF!"}},{"$f":"#REF!","v":{"$error":"#REF!"}},{"$f":"#REF!","v":{"$error":"#REF!"}},{"$f":"#REF!","v":{"$error":"#REF!"}},{"$f":"#REF!","v":{"$error":"#REF!"}},{"$f":"#REF!","v":{"$error":"#REF!"}},{"$f":"#REF!","v":{"$error":"#REF!"}},{"$f":"#REF!","v":{"$error":"#REF!"}},{"$f":"#REF!","v":{"$error":"#REF!"}},{"$f":"#REF!","v":{"$error":"#REF!"}},{"$f":"#REF!","v":{"$error":"#REF!"}},{"$f":"#REF!","v":{"$error":"#REF!"}},{"$f":"#REF!","v":{"$error":"#REF!"}},{"$f":"#REF!","v":{"$error":"#REF!"}},{"$f":"#REF!","v":{"$error":"#REF!"}},{"$f":"#REF!","v":{"$error":"#REF!"}},{"$f":"#REF!","v":{"$error":"#REF!"}},{"$f":"#REF!","v":{"$error":"#REF!"}},{"$f":"#REF!","v":{"$error":"#REF!"}},{"$f":"#REF!","v":{"$error":"#REF!"}},{"$f":"#REF!","v":{"$error":"#REF!"}},{"$f":"#REF!","v":{"$error":"#REF!"}},{"$f":"#REF!","v":{"$error":"#REF!"}},{"$f":"#REF!","v":{"$error":"#REF!"}},{"$f":"#REF!","v":{"$error":"#REF!"}},{"$f":"#REF!","v":{"$error":"#REF!"}},{"$f":"#REF!","v":{"$error":"#REF!"}}]
[{"$f":"#REF!","v":{"$error":"#REF!"}},{"$f":"IF(#REF!=0,\"\",#REF!)","v":{"$error":"#REF!"}},{"$f":"IF(#REF!=0,\"\",#REF!)","v":{"$error":"#REF!"}},{"$f":"IF(#REF!=0,\"\",#REF!)","v":{"$error":"#REF!"}},{"$f":"IF(#REF!=0,\"\",#REF!)","v":{"$error":"#REF!"}},null,{"$f":"IF(#REF!=0,\"\",#REF!)","v":{"$error":"#REF!"}},{"$f":"IF(#REF!=0,\"\",#REF!)","v":{"$error":"#REF!"}},{"$f":"IF(#REF!=0,\"\",#REF!)","v":{"$error":"#REF!"}},{"$f":"IF(#REF!=0,\"\",#REF!)","v":{"$error":"#REF!"}},{"$f":"IF(#REF!=0,\"\",#REF!)","v":{"$error":"#REF!"}},{"$f":"IF(#REF!=0,\"\",#REF!)","v":{"$error":"#REF!"}},{"$f":"IF(#REF!=0,\"\",#REF!)","v":{"$error":"#REF!"}},{"$f":"IF(#REF!=0,\"\",#REF!)","v":{"$error":"#REF!"}},{"$f":"IF(#REF!=0,\"\",#REF!)","v":{"$error":"#REF!"}},{"$f":"IF(#REF!=0,\"\",#REF!)","v":{"$error":"#REF!"}},{"$f":"IF(#REF!=0,\"\",#REF!)","v":{"$error":"#REF!"}},{"$f":"IF(#REF!=0,\"\",#REF!)","v":{"$error":"#REF!"}},{"$f":"IF(#REF!=0,\"\",#REF!)","v":{"$error":"#REF!"}},{"$f":"IF(#REF!=0,\"\",#REF!)","v":{"$error":"#REF!"}},{"$f":"IF(#REF!=0,\"\",#REF!)","v":{"$error":"#REF!"}},{"$f":"IF(#REF!=0,\"\",#REF!)","v":{"$error":"#REF!"}},{"$f":"IF(#REF!=0,\"\",#REF!)","v":{"$error":"#REF!"}},{"$f":"IF(#REF!=0,\"\",#REF!)","v":{"$error":"#REF!"}},{"$f":"IF(#REF!=0,\"\",#REF!)","v":{"$error":"#REF!"}}]
[{"$f":"#REF!","v":{"$error":"#REF!"}},{"$f":"#REF!","v":{"$error":"#REF!"}},{"$f":"#REF!","v":{"$error":"#REF!"}},{"$f":"#REF!","v":{"$error":"#REF!"}},{"$f":"#REF!","v":{"$error":"#REF!"}},{"$f":"#REF!","v":{"$error":"#REF!"}},{"$f":"#REF!","v":{"$error":"#REF!"}},{"$f":"#REF!","v":{"$error":"#REF!"}}]
{"$rows_left_out":20}
{"sheet":"Fresh Quality","index":6,"n_rows":350,"n_cols":26,"rows_kept":350,"cut":false,"hidden":false,"merged":[]}
[]
["Question No.",1,2,3,4,5,6,7,8,9,10,11,12,13,14,15,16.100000000000001,16.2,16.3,16.399999999999999,16.5,16.600000000000001,17,18,"Total Score","Quality Score"]
["Short Questions","Duration of the exposure ","Biological endpoint","Biological effect stated or not","Biological effect quantified or not","Appropriate controls","Control & contaminant concentration","Test acceptability criteria","Characteristics of the test organism"," Type of test media","Type of exposure","Contaminant concentrations","Parallel reference toxicant toxicity tests","Concentration–response relationship","Determine the toxicity","NOEC/LOEC or LC/EC/BEC","pH","POC","Particle size","AVS & 1-M HCl extractable metals","Dissolved contaminants","Dissolved ammonia and sulfide","Temperature","Grade or purity"]
["Marks Awarded","10 or 0","10,5 or 0","5 or 0 ","5 or 0 ","5 or 0 ","5 or 0 ","5 or 0 ","5 or 0 ","5 or 0 ","4 or 0","4 or 0","4 or 0","4 or 0","4 or 0","4 or 0","3,1,or 0","3,1,or 0","3,1,or 0","3,1,or 0","3,1,or 0","3,1,or 0","3 or 0","3 or 0"]
["Max. Possible Score",10,10,5,5,5,5,5,5,5,4,4,4,4,4,4,3,3,3,3,3,3,3,3,{"$f":"SUM(B5:X5)","v":103}]
["Category","Freshwater","Paper and data unique identifier(eg. 1-1,10-150)","1-2"]
["Scores",10,10,5,5,5,5,5,0,5,4,0,0,0,4,4,3,3,3,3,1,1,3,3,82,0.79611650485436891]
["Answers","","","","","","","","","","","","","","","","","","","","","","",""]
["Category","Freshwater","Paper and data unique identifier(eg. 1-1,10-150)","886-1"]
["Scores",10,5,5,5,5,5,0,5,5,4,0,0,0,4,4,3,3,0,0,3,3,3,3,75,0.72815533980582525]
["Answers","48 hours","Survival: Mortality","","","Negative controls","Triplicate","","Tadpoles; age size, weight and gosner stage recorded (GS 29-30)","","Static","","","","","",7.4,0,"","","165 umhos/cm","6.5 mg/L","22 degrees C",""]
["Category","Freshwater","Paper and data unique identifier(eg. 1-1,10-150)","886-2"]
["Scores",10,5,5,5,5,5,0,5,5,4,0,0,0,4,4,3,3,0,0,3,3,3,3,75,0.72815533980582525]
["Answers","48 hours","Survival: Mortality","","","Negative controls","Triplicate","","Tadpoles; age size, weight and gosner stage recorded (GS 29-30)","","Static","","","","","",7.4,0,"","","165 umhos/cm","6.5 mg/L","22 degrees C",""]
["Category","Freshwater","Paper and data unique identifier(eg. 1-1,10-150)","886-3"]
{"$rows_left_out":335}