{"text_format":"1","workbook":"xlsx","n_sheets":9,"sheets":["Copyright","Cover","Instruction","Sheet1","All Result","MEW nonplant","MEW nonplant_WS","MEW plant","MEW plant_WS"],"not_rendered":{"charts":0,"images":0,"macros":1,"external_links":0,"defined_names":3,"comments":3,"pivot_tables":0},"unopened":[],"bounds":{"document_bytes":16777216,"sheet_cells":100000,"rows_first":2000,"rows_last":500,"rows_between":2000,"halvings":0,"cell_chars":16384,"cell_head_chars":4096},"cells_cut":0,"cells_raw":0,"read":"whole","date_system":"1900"}

{"sheet":"Copyright","index":0,"n_rows":0,"n_cols":0,"rows_kept":0,"cut":false,"hidden":false,"merged":[]}

{"sheet":"Cover","index":1,"n_rows":20,"n_cols":7,"rows_kept":20,"cut":false,"hidden":false,"merged":[[18,6,18,8],[14,6,14,8],[13,6,13,8],[4,4,4,10],[9,6,9,8],[12,6,12,8],[5,5,6,9]]}
[]
[]
[]
[]
[null,null,null,null,"Ecotoxicity Data Quality Assessment Method V2"]
[null,null,null,null,null,"To be used to assess the quality of data used for the Australian and New Zealand Guidelines for Fresh and Marine Water Quality (including sediment) and the Australian National Environment Protection (Assessment of Site Contamination) Measure"]
[]
[]
[]
[null,null,null,null,null,null,"Developed by "]
{"$rows_left_out":11}
{"sheet":"Instruction","index":2,"n_rows":21,"n_cols":10,"rows_kept":21,"cut":false,"hidden":false,"merged":[[27,6,27,16],[14,6,14,7],[5,4,5,7]]}
[]
[]
[null,"Click here to see \"All Result\" -->","All Result"]
[]
[]
[null,null,null,null,"Freshwater "]
[]
[null,"Tabs contain questionaries -->           ","Freshwater/metal/nonplant",null,"Freshwater/non-metal/non-plant ",null,null,"Freshwater/metal/plant",null,"Freshwater/non-metal/plant"]
[]
[]
{"$rows_left_out":12}
{"sheet":"Sheet1","index":3,"n_rows":70,"n_cols":29,"rows_kept":70,"cut":false,"hidden":true,"merged":[]}
[]
[{"$f":"#REF!","v":{"$error":"#REF!"}},{"$f":"#REF!","v":{"$error":"#REF!"}},{"$f":"#REF!","v":{"$error":"#REF!"}},{"$f":"#REF!","v":{"$error":"#REF!"}},{"$f":"#REF!","v":{"$error":"#REF!"}},{"$f":"#REF!","v":{"$error":"#REF!"}},{"$f":"#REF!","v":{"$error":"#REF!"}},{"$f":"#REF!","v":{"$error":"#REF!"}},{"$f":"#REF!","v":{"$error":"#REF!"}},{"$f":"#REF!","v":{"$error":"#REF!"}},{"$f":"#REF!","v":{"$error":"#REF!"}},{"$f":"#REF!","v":{"$error":"#REF!"}},{"$f":"#REF!","v":{"$error":"#REF!"}},{"$f":"#REF!","v":{"$error":"#REF!"}},{"$f":"#REF!","v":{"$error":"#REF!"}},{"$f":"#REF!","v":{"$error":"#REF!"}},{"$f":"#REF!","v":{"$error":"#REF!"}},{"$f":"#REF!","v":{"$error":"#REF!"}},{"$f":"#REF!","v":{"$error":"#REF!"}},{"$f":"#REF!","v":{"$error":"#REF!"}},{"$f":"#REF!","v":{"$error":"#REF!"}},{"$f":"#REF!","v":{"$error":"#REF!"}},{"$f":"#REF!","v":{"$error":"#REF!"}},{"$f":"#REF!","v":{"$error":"#REF!"}},{"$f":"#REF!","v":{"$error":"#REF!"}},{"$f":"#REF!","v":{"$error":"#REF!"}}]
[{"$f":"#REF!","v":{"$error":"#REF!"}},{"$f":"#REF!","v":{"$error":"#REF!"}},{"$f":"#REF!","v":{"$error":"#REF!"}},{"$f":"#REF!","v":{"$error":"#REF!"}}]
[{"$f":"#REF!","v":{"$error":"#REF!"}},{"$f":"#REF!","v":{"$error":"#REF!"}},{"$f":"#REF!","v":{"$error":"#REF!"}},{"$f":"#REF!","v":{"$error":"#REF!"}},{"$f":"#REF!","v":{"$error":"#REF!"}},{"$f":"#REF!","v":{"$error":"#REF!"}},{"$f":"#REF!","v":{"$error":"#REF!"}},{"$f":"#REF!","v":{"$error":"#REF!"}},{"$f":"#REF!","v":{"$error":"#REF!"}},{"$f":"#REF!","v":{"$error":"#REF!"}},{"$f":"#REF!","v":{"$error":"#REF!"}},{"$f":"#REF!","v":{"$error":"#REF!"}},{"$f":"#REF!","v":{"$error":"#REF!"}},{"$f":"#REF!","v":{"$error":"#REF!"}},{"$f":"#REF!","v":{"$error":"#REF!"}},{"$f":"#REF!","v":{"$error":"#REF!"}},{"$f":"#REF!","v":{"$error":"#REF!"}},{"$f":"#REF!","v":{"$error":"#REF!"}},{"$f":"#REF!","v":{"$error":"#REF!"}},{"$f":"#REF!","v":{"$error":"#REF!"}},{"$f":"#REF!","v":{"$error":"#REF!"}},{"$f":"#REF!","v":{"$error":"#REF!"}},{"$f":"#REF!","v":{"$error":"#REF!"}},{"$f":"#REF!","v":{"$error":"#REF!"}},{"$f":"#REF!","v":{"$error":"#REF!"}},{"$f":"#REF!","v":{"$error":"#REF!"}}]
["Answers",{"$f":"IF(#REF!=0,\"\",#REF!)","v":{"$error":"#REF!"}},{"$f":"IF(#REF!=0,\"\",#REF!)","v":{"$error":"#REF!"}},{"$f":"IF(#REF!=0,\"\",#REF!)","v":{"$error":"#REF!"}},{"$f":"IF(#REF!=0,\"\",#REF!)","v":{"$error":"#REF!"}},{"$f":"IF(#REF!=0,\"\",#REF!)","v":{"$error":"#REF!"}},{"$f":"IF(#REF!=0,\"\",#REF!)","v":{"$error":"#REF!"}},{"$f":"IF(#REF!=0,\"\",#REF!)","v":{"$error":"#REF!"}},{"$f":"IF(#REF!=0,\"\",#REF!)","v":{"$error":"#REF!"}},{"$f":"IF(#REF!=0,\"\",#REF!)","v":{"$error":"#REF!"}},{"$f":"IF(#REF!=0,\"\",#REF!)","v":{"$error":"#REF!"}},{"$f":"IF(#REF!=0,\"\",#REF!)","v":{"$error":"#REF!"}},{"$f":"IF(#REF!=0,\"\",#REF!)","v":{"$error":"#REF!"}},{"$f":"IF(#REF!=0,\"\",#REF!)","v":{"$error":"#REF!"}},{"$f":"IF(#REF!=0,\"\",#REF!)","v":{"$error":"#REF!"}},{"$f":"IF(#REF!=0,\"\",#REF!)","v":{"$error":"#REF!"}},{"$f":"IF(#REF!=0,\"\",#REF!)","v":{"$error":"#REF!"}},{"$f":"IF(#REF!=0,\"\",#REF!)","v":{"$error":"#REF!"}},{"$f":"IF(#REF!=0,\"\",#REF!)","v":{"$error":"#REF!"}},{"$f":"IF(#REF!=0,\"\",#REF!)","v":{"$error":"#REF!"}},{"$f":"IF(#REF!=0,\"\",#REF!)","v":{"$error":"#REF!"}},{"$f":"IF(#REF!=0,\"\",#REF!)","v":{"$error":"#REF!"}},{"$f":"IF(#REF!=0,\"\",#REF!)","v":{"$error":"#REF!"}},{"$f":"IF(#REF!=0,\"\",#REF!)","v":{"$error":"#REF!"}}]
[{"$f":"#REF!","v":{"$error":"#REF!"}},{"$f":"#REF!","v":{"$error":"#REF!"}},{"$f":"#REF!","v":{"$error":"#REF!"}},{"$f":"#REF!","v":{"$error":"#REF!"}},{"$f":"#REF!","v":{"$error":"#REF!"}},{"$f":"#REF!","v":{"$error":"#REF!"}},{"$f":"#REF!","v":{"$error":"#REF!"}},{"$f":"#REF!","v":{"$error":"#REF!"}}]
[{"$f":"#REF!","v":{"$error":"#REF!"}},{"$f":"#REF!","v":{"$error":"#REF!"}},{"$f":"#REF!","v":{"$error":"#REF!"}},{"$f":"#REF!","v":{"$error":"#REF!"}},{"$f":"#REF!","v":{"$error":"#REF!"}},{"$f":"IF(#REF!=0,\"\",#REF!)","v":{"$error":"#REF!"}},{"$f":"IF(#REF!=0,\"\",#REF!)","v":{"$error":"#REF!"}},{"$f":"IF(#REF!=0,\"\",#REF!)","v":{"$error":"#REF!"}}]
[]
[]
[]
{"$rows_left_out":61}
{"sheet":"All Result","index":4,"n_rows":96,"n_cols":22,"rows_kept":96,"cut":false,"hidden":false,"merged":[]}
["Chemical:","Iron"]
["Medium:","Marine"]
["Category","Paper and data unique identifier(eg. 1-1,10-150)","Total score","Quality Score","Comment ","Species (Scientific name)","Lifestage","Exposure duration","Measure of toxicity","Toxicity endpoint","Toxicity value","Taxonomic group","Phylum","Class","Media","Temperature ","Acute Or Chronic ","PH","Salinity/Conductivity","Citation","Citation No.","Comment"]
["MEW_nonplant","100-1",44,0.46808510638297873,"The highest possible grade for this datum is acceptable.","Perna perna","Adult","12-120 h","N.A.","N.A.","N.A","Mollusca","Mollusca","Bivalvia","Marinewater","19-21 oC","Acute","N.A.","N.A.","Almeida EA, Bainy ACD, Medeiros MHG and Di Mascio P (2003) Effects of trace metal and exposure to air on serotonin and dopamine levels in tissues of the mussel Perna perna. Marine Pollution Bulletin 46(11), 1485-1490. DOI: 10.1016/s0025-326x(03)00256-x.","100","Did not pass QA question 7 therefore is unacceptable and  not useable"]
["MEW_nonplant","101-1",55,0.58510638297872342,"The highest possible grade for this datum is acceptable.","Nitocra spinipes","Adult","96 h","LC50","Survival","21000 µg/L","Crustacea","Crustacea","Copepoda","Estuarine",20,"Acute",8,"7 ppt","Bengtsson BE (1978). Use of a harpacticoid copepod in toxicity tests. Marine Pollution Bulletin, 9(9), 238-241. ","101","Did not pass QA question 7 therefore is unacceptable and  not useable"]
["MEW_nonplant","102-1",49,0.52127659574468088,"The highest possible grade for this datum is acceptable.","Artemia salina","Adult","N.A.","N.A.","Survival","N/A","Crustacea","Crustacea","Branchiopoda","Marinewater","20 oC","Acute","N.A.","N.A.","Brown B and Ahsanullah M (1971). Effect of heavy metals on mortality and growth. Marine Pollution Bulletin, 2(12), 182-187. ","102","no toxicity value"]
["MEW_nonplant","102-2",49,0.52127659574468088,"The highest possible grade for this datum is acceptable.","Ophryotrocha labronica","Adult","N.A.","N.A.","Survival","N/A","Annelida","Annelida","Polychaeta","Marinewater","20 oC","Acute","N.A.","N.A.","Brown B and Ahsanullah M (1971). Effect of heavy metals on mortality and growth. Marine Pollution Bulletin, 2(12), 182-187. ","102","no toxicity value"]
["MEW_nonplant","103-1",56,0.5957446808510638,"","Periophthalmus waltoni","Not stated","96 h","LC5","Survival","2.69 µg/L","Fish ","Chordata","Pisces","Marinewater","22.3 oC","Acute",8.1,"38 ppt","Bu-Olayan AH and Thomas BV (2008). Trace metals toxicity and bioaccumulation in mudskipper Periophthalmus waltoni Koumans 1941 (Gobiidae: Perciformes). Turk. J. Fish. Aquat. Sci., 8(2), 215-218. ","103","Did not pass QA question 7 therefore is unacceptable and  not useable and pseudoreplication"]
["MEW_nonplant","103-2",56,0.5957446808510638,"","Periophthalmus waltoni","Not stated","96 h","LC15","Survival","3.73 µg/L","Fish ","Chordata","Pisces","Marinewater","22.3 oC","Acute",8.1,"38 ppt","Bu-Olayan AH and Thomas BV (2008). Trace metals toxicity and bioaccumulation in mudskipper Periophthalmus waltoni Koumans 1941 (Gobiidae: Perciformes). Turk. J. Fish. Aquat. Sci., 8(2), 215-218. ","103","Did not pass QA question 7 therefore is unacceptable and  not useable and pseudoreplication"]
["MEW_nonplant","103-3",56,0.5957446808510638,"","Periophthalmus waltoni","Not stated","96 h","LC50","Survival","6.48 µg/L","Fish ","Chordata","Pisces","Marinewater","22.3 oC","Acute",8.1,"38 ppt","Bu-Olayan AH and Thomas BV (2008). Trace metals toxicity and bioaccumulation in mudskipper Periophthalmus waltoni Koumans 1941 (Gobiidae: Perciformes). Turk. J. Fish. Aquat. Sci., 8(2), 215-218. ","103","Did not pass QA question 7 therefore is unacceptable and  not useable and pseudoreplication"]
{"$rows_left_out":87}
{"sheet":"MEW nonplant","index":5,"n_rows":84,"n_cols":53,"rows_kept":84,"cut":false,"hidden":false,"merged":[[68,2,71,2],[68,7,71,7],[56,7,58,7],[65,7,67,7],[52,2,54,2],[52,7,54,7],[59,7,61,7],[65,2,67,2],[62,2,64,2],[62,7,64,7],[43,2,45,2],[43,7,45,7],[46,2,48,2],[46,7,48,7],[49,2,51,2],[49,7,51,7],[34,2,36,2],[34,7,36,7],[37,2,39,2],[37,7,39,7],[40,2,42,2],[40,7,42,7],[25,2,27,2],[25,7,27,7],[28,2,30,2],[28,7,30,7],[31,2,33,2],[31,7,33,7],[17,2,19,2],[17,7,19,7],[20,2,21,2],[20,7,21,7],[22,2,24,2],[22,7,24,7],[3,4,7,4],[9,2,9,4],[11,2,13,2],[11,7,13,7],[14,2,16,2],[14,7,16,7]]}
[null,1,"Fill in the blank cells below, based on information provided in the paper being assessed. You can either pick an option from the dropdown list or add the appropriate detail using the 'Add to list' button. ",null,null,{"$f":"IF(BA3=\"\",0,1)","v":1},null,null,null,null,null,null,null,null,"* All the text in RED are used for drop down list ,make changes with caution."]
[null,null,"Category",{"$f":"IF(AF3=\"\",0,1)","v":1},"MEW_nonplant",{"$f":"IF(E3=\"\",0,1)","v":1},"Citation No.",{"$f":"IF(ISERROR(FIND(\"-\",E3)),E3,LEFT(E3,FIND(\"-\",E3)-1))","v":"126"},null,"Taxonomic group",null,null,null,null,"Species",null,null,"Lifestage",null,null,"Exposure duration",null,null,"Measure of toxicity",null,null,"Toxicity endpoint",null,null,"Taxonomic group",null,null,"Phylum",null,null,"Class",null,null,"Media",null,null,"Temperature ",null,null,"Acute Or Chronic",null,null,"PH",null,null,"Salinity/Comdictivity"]
[null,null,"Paper and data unique identifier(eg. 1-1,10-150)",{"$f":"IF(AI3=\"\",0,1)","v":1},"126-25",{"$f":"IF(E4=\"\",0,1)","v":1},"Species (Scientific name)",null,null,"Phylum",null,null,null,null,"Aedes albopictus",28,{"$f":"IF(P3=0,\"\",INDEX(O3:O105,P3))","v":"Platygyra daedalea"},"1 month",14,{"$f":"IF(S3=0,\"\",INDEX(R3:R105,S3))","v":"larvae"},"10 min",12,{"$f":"IF(V3=0,\"\",INDEX(U3:U105,V3))","v":"72 h"},"EC10",9,{"$f":"IF(Y3=0,\"\",INDEX(X3:X105,Y3))","v":"LOEC"},"Changes in biomarkers",9,{"$f":"IF(AB3=0,\"\",INDEX(AA3:AA105,AB3))","v":"Survival"},"Annelida",9,{"$f":"IF(AE3=0,\"\",INDEX(AD3:AD105,AE3))","v":"Coral"},"Annelida",10,{"$f":"IF(AH3=0,\"\",INDEX(AG3:AG105,AH3))","v":"Cnidaria"},"Bivalvia",13,{"$f":"IF(AK3=0,\"\",INDEX(AJ3:AJ105,AK3))","v":"Anthozoa"},"Estuarine",6,{"$f":"IF(AN3=0,\"\",INDEX(AM3:AM105,AN3))","v":"Unfiltered natural seawater"},20,16,{"$f":"IF(AQ3=0,\"\",INDEX(AP3:AP105,AQ3))","v":"23.5-26 oC"},"Acute",1,{"$f":"IF(AT3=0,\"\",INDEX(AS3:AS105,AT3))","v":"Acute"},7.3,12,{"$f":"IF(AW3=0,\"\",INDEX(AV3:AV105,AW3))","v":"7.81-8.37"},7,15,{"$f":"IF(AZ3=0,\"\",INDEX(AY3:AY105,AZ3))","v":"37-39 ppt"}]
[null,null,"Citation",{"$f":"IF(AL3=\"\",0,1)","v":1},"Leigh-Smith J, Reichelt-Brushett A, Rose AL. 2018. The characterization of iron (III) in seawater and related toxicity to early life stages of scleractinian corals. Environmental Toxicology and Chemistry 37:1104-1114.",{"$f":"IF(H8=\"\",0,1)","v":1},"Lifestage",null,null,"Class",null,null,null,null,"Anthocidaris crassipina",null,null,"1 year old",null,null,"11 hour",null,null,"EC50",null,null,"Fertilisation rate",null,null,"Bacteria",null,null,"Chlorophyta",null,null,"Branchiopoda",null,null,"Freshwater",null,null,"15°C",null,null,"Chronic",null,null,7.8,null,null,"150 uS/cm"]
[null,null,null,{"$f":"IF(AO3=\"\",0,1)","v":1},null,{"$f":"IF(AX3=\"\",0,1)","v":1},"Exposure duration",null,null,"Media",null,null,null,null,"Anthocidaris crassispina",null,null,"Adult",null,null,"12-120 h",null,null,"LC15",null,null,"Hatching",null,null,"Crustacea",null,null,"Chordata",null,null,"Branchiopoda",null,null,"Marinewater",null,null,"16 oC",null,null,"N.A.",null,null,8,null,null,"30 ppt"]
[null,null,null,{"$f":"IF(AR3=\"\",0,1)","v":1},null,{"$f":"IF(Q3=\"\",0,1)","v":1},"Measure of toxicity",null,null,"Temperature ",null,null,null,null,"Arbacia punctulata",null,null,"blastula",null,null,"13 days",null,null,"LC5",null,null,"Mortality",null,null,"Echinodermata",null,null,"Crustacea",null,null,"Chlorophyceae",null,null,"N.A.",null,null,"18 oC",null,null,null,null,null,8.1,null,null,"32 ppt"]
[null,null,null,{"$f":"IF(AU3=\"\",0,1)","v":1},null,{"$f":"IF(T3=\"\",0,1)","v":1},"Toxicity endpoint",null,null,"Acute Or Chronic ",null,null,null,null,"Artemia salina",null,null,"Egg",null,null,"168 h",null,null,"LC50",null,null,"N.A.",null,null,"Fish ",null,null,"Echinodermata",null,null,"Copepoda",null,null,"Not stated",null,null,"19-21 oC",null,null,null,null,null,"7.5 - 8.4",null,null,"32.94 - 33.53 ppt"]
[null,null,null,null,null,{"$f":"IF(W3=\"\",0,1)","v":1},"Toxicity value","27,200 µg/L total iron",null,"PH",null,null,null,null,"Australian Bass",null,null,"embryo",null,null,"20 d",null,null,"LC50",null,null,"Normal development",null,null,"Microalga",null,null,"Mollusca",null,null,"Echinoidea",null,null,"Unfiltered natural seawater",null,null,"20 oC",null,null,null,null,null,"8.0 - 8.1",null,null,"34 ppt"]
[null,2,"Select the appropriate answer option to each question. Comments can be added to the cells in column H.",null,null,{"$f":"IF(Z3=\"\",0,1)","v":1},null,null,null,"Salinity/Conductivity",null,null,null,null,"Cancer anthonyi",null,null,"embryo 1 h post fert.",null,null,"24 h",null,null,"LC90",null,null,"Not stated",null,null,"Mollusca",null,null,"N.A.",null,null,"Gammaproteobacteria",null,null,null,null,null,"21 oC",null,null,null,null,null,"N.A.",null,null,"35 ppt"]
[null,"*","If the selected answer option does not work try clicking on any other cell first and then click back on the answer option again.",null,null,{"$f":"IF(AC3=\"\",0,1)","v":1},null,null,null,null,null,null,null,null,"Cardium edule",null,null,"N.A.",null,null,"24, 48, 72, 96 h",null,null,"LC99",null,null,"Reproduction",null,null,"N.A.",null,null,"Proteobacteria",null,null,"Gastropoda",null,null,null,null,null,"22.3 oC",null,null,null,null,null,"Not stated",null,null,"37.5 ppt"]
{"$rows_left_out":75}
{"sheet":"MEW nonplant_WS","index":6,"n_rows":221,"n_cols":24,"rows_kept":221,"cut":false,"hidden":false,"merged":[]}
[]
["Question No.",1,2,3,4,5,6,7,8,9,10,11,12,13,14,15,16.100000000000001,16.2,16.3,17,18,"Total Score","Quality Score"]
["Short Questions","Duration of the exposure ","Biological endpoint","Biological effect stated or not","Biological effect quantified or not","Appropriate controls","Control & contaminant concentration","Test acceptability criteria","Characteristics of the test organism"," Type of test media","Type of exposure","Contaminant concentrations","Parallel reference toxicant toxicity tests","Concentration–response relationship","Determine the toxicity","NOEC/LOEC or LC/EC/BEC","Conductivity/Salinity","Dissolved Oxygen","PH","Temperature","Grade or purity"]
["Marks Awarded ","10 or 0","10,5 or 0","5 or 0 ","5 or 0 ","5 or 0 ","5 or 0 ","5 or 0 ","5 or 0 ","5 or 0 ","4 or 0","4 or 2 or 0","4 or 2","4 or 2","4 or 2","4 or 2","3 or 1 or 0","3 or 1 or 0","3 or 1 or 0","3 or 0","3 or 0 "]
["Max. Possible Score",10,10,5,5,5,5,5,5,5,4,4,4,4,4,4,3,3,3,3,3,{"$f":"SUM(B5:U5)","v":94}]
["Category","MEW_nonplant","Paper and data unique identifier(eg. 1-1,10-150)","100-1"]
["Scores",10,5,0,0,5,5,0,5,5,4,0,0,4,0,0,0,0,0,1,0,44,0.46808510638297873,"The highest possible grade for this datum is acceptable."]
["Answers","multiple time points at 12, 24, 72 and 120 h","Measurement of Serotonin and Dopamine in various tissues","","","","","","8-12 cm length","seawater - no other details given","Static renewal inferred by water changes","one concentration used","","Dopamin or seratonin measured over time","N.A. no toxicity endpoint was calculated","","","","","",""]
["Category","MEW_nonplant","Paper and data unique identifier(eg. 1-1,10-150)","101-1"]
["Scores",10,10,5,5,0,0,0,5,5,4,0,0,0,0,4,3,0,3,1,0,55,0.58510638297872342,"The highest possible grade for this datum is acceptable."]
{"$rows_left_out":212}
{"sheet":"MEW plant","index":7,"n_rows":81,"n_cols":53,"rows_kept":81,"cut":false,"hidden":false,"merged":[[52,2,54,2],[52,7,54,7],[59,7,61,7],[62,2,64,2],[62,7,64,7],[56,1,58,1],[56,2,58,2],[56,7,58,7],[65,2,68,2],[65,7,68,7],[43,2,45,2],[43,7,45,7],[46,2,48,2],[46,7,48,7],[49,2,51,2],[49,7,51,7],[34,2,36,2],[34,7,36,7],[37,2,39,2],[37,7,39,7],[40,2,42,2],[40,7,42,7],[25,2,27,2],[25,7,27,7],[28,2,30,2],[28,7,30,7],[31,2,33,2],[31,7,33,7],[17,2,19,2],[17,7,19,7],[20,2,21,2],[20,7,21,7],[22,2,24,2],[22,7,24,7],[3,4,7,4],[9,2,9,4],[11,2,13,2],[11,7,13,7],[14,2,16,2],[14,7,16,7]]}
[null,1,"Fill in the blank cells below, based on information provided in the paper being assessed. You can either pick an option from the dropdown list or add the appropriate detail using the 'Add to list' button. ",null,null,{"$f":"IF(BA3=\"\",0,1)","v":1},null,null,null,null,null,null,null,null,"* All the text in RED are used for drop down list ,make changes with caution."]
[null,null,"Category",{"$f":"IF(AF3=\"\",0,1)","v":1},"MEW_plant",{"$f":"IF(E3=\"\",0,1)","v":1},"Citation No.",{"$f":"IF(ISERROR(FIND(\"-\",E3)),E3,LEFT(E3,FIND(\"-\",E3)-1))","v":"124.6"},null,"Taxonomic group",null,null,null,null,"Species",null,null,"Lifestage",null,null,"Exposure duration",null,null,"Measure of toxicity",null,null,"Toxicity endpoint",null,null,"Taxonomic group",null,null,"Phylum",null,null,"Class",null,null,"Media",null,null,"Temperature ",null,null,"Acute Or Chronic",null,null,"PH",null,null,"Salinity/Comdictivity"]
[null,null,"Paper and data unique identifier(eg. 1-1,10-150)",{"$f":"IF(AI3=\"\",0,1)","v":1},"124.6",{"$f":"IF(E4=\"\",0,1)","v":1},"Species (Scientific name)",null,null,"Phylum",null,null,null,null,"Aedes albopictus",12,{"$f":"IF(P3=0,\"\",INDEX(O3:O102,P3))","v":"Pavlova viridis"},"1 month",4,{"$f":"IF(S3=0,\"\",INDEX(R3:R102,S3))","v":"Not stated"},"11 hour",7,{"$f":"IF(V3=0,\"\",INDEX(U3:U102,V3))","v":"10 d"},"Cell yield - chlorophyll a",3,{"$f":"IF(Y3=0,\"\",INDEX(X3:X102,Y3))","v":"growth rate inhibition"},"Fish ",3,{"$f":"IF(AB3=0,\"\",INDEX(AA3:AA102,AB3))","v":"LOEC"},"Fish ",2,{"$f":"IF(AE3=0,\"\",INDEX(AD3:AD102,AE3))","v":"Microalga"},"Chlorophyta",3,{"$f":"IF(AH3=0,\"\",INDEX(AG3:AG102,AH3))","v":"Haptophyta"},"Bacillariophyceae",9,{"$f":"IF(AK3=0,\"\",INDEX(AJ3:AJ102,AK3))","v":"Pavlovophyceae"},"Artificial seawater",7,{"$f":"IF(AN3=0,\"\",INDEX(AM3:AM102,AN3))","v":"F/2 media"},"15°C",2,{"$f":"IF(AQ3=0,\"\",INDEX(AP3:AP102,AQ3))","v":"20 oC"},"Acute",2,{"$f":"IF(AT3=0,\"\",INDEX(AS3:AS102,AT3))","v":"Chronic"},"8 - 8.2",4,{"$f":"IF(AW3=0,\"\",INDEX(AV3:AV102,AW3))","v":"Not stated"},"150 uS/cm",6,{"$f":"IF(AZ3=0,\"\",INDEX(AY3:AY102,AZ3))","v":"20 ppt"}]
[null,null,"Citation",{"$f":"IF(AL3=\"\",0,1)","v":1},"Huang X, Wei L, Huang Z and Yan J (2014). Effect of high ferric ion concentrations on total lipids and lipid characteristics of Tetraselmis subcordiformis, Nannochloropsis oculata and Pavlova viridis. Journal of Applied Phycology, 26(1), 105-114. ",{"$f":"IF(H8=\"\",0,1)","v":1},"Lifestage",null,null,"Class",null,null,null,null,"Australian Bass",null,null,"1 year old",null,null,"13 days",null,null,"chlorophyll",null,null,"IC50",null,null,"Microalga",null,null,"Diatom",null,null,"Branchiopoda",null,null,"F/2 media without trace metals and without EDTA",null,null,"20 oC",null,null,"Chronic",null,null,"8.1 - 8.3",null,null,"28 ppt"]
[null,null,null,{"$f":"IF(AO3=\"\",0,1)","v":1},null,{"$f":"IF(AX3=\"\",0,1)","v":1},"Exposure duration",null,null,"Media",null,null,null,null,"Glenodinium halli",null,null,"N.A.",null,null,"4 d",null,null,"growth rate inhibition",null,null,"LOEC",null,null,"N.A.",null,null,"Haptophyta",null,null,"Chlorophyceae",null,null,"Freshwater",null,null,"25°C",null,null,"N.A.",null,null,"N.A.",null,null,"30 ppt"]
[null,null,null,{"$f":"IF(AR3=\"\",0,1)","v":1},null,{"$f":"IF(Q3=\"\",0,1)","v":1},"Measure of toxicity",null,null,"Temperature ",null,null,null,null,"Glenodinium splendens",null,null,"Not stated",null,null,"48 h",null,null,"LC50",null,null,"Maximum non-toxic level  (NTL)",null,null,null,null,null,"Harosa",null,null,"Dinophyceae",null,null,"Marinewater",null,null,"N.A.",null,null,null,null,null,"Not stated",null,null,"34 ppt"]
[null,null,null,{"$f":"IF(AU3=\"\",0,1)","v":1},null,{"$f":"IF(T3=\"\",0,1)","v":1},"Toxicity endpoint",null,null,"Acute Or Chronic ",null,null,null,null,"Gymnodinium splendens",null,null,null,null,null,"96 h",null,null,"N.A.",null,null,"Microalga",null,null,null,null,null,"Myzozoa",null,null,"N.A.",null,null,"N.A.",null,null,null,null,null,null,null,null,"PH11",null,null,"N.A."]
[null,null,null,null,null,{"$f":"IF(W3=\"\",0,1)","v":1},"Toxicity value","67000 ug/L",null,"PH",null,null,null,null,"Isochrysis galbana",null,null,null,null,null,"N.A.",null,null,"NOEC",null,null,"N.A.",null,null,null,null,null,"N.A.",null,null,"Prymnesiophyceae",null,null,"F/3 media",null,null,null,null,null,null,null,null,"PH7.0",null,null,"20 ppt"]
[null,2,"Select the appropriate answer option to each question. Comments can be added to the cells in column H.",null,null,{"$f":"IF(Z3=\"\",0,1)","v":1},null,null,null,"Salinity/Conductivity",null,null,null,null,"N.A.",null,null,null,null,null,"10 d",null,null,null,null,null,"NOEC",null,null,null,null,null,"Ochrophyta",null,null,"Prasinophyceae",null,null,"F/2 media"]
[null,"*","If the selected answer option does not work try clicking on any other cell first and then click back on the answer option again.",null,null,{"$f":"IF(AC3=\"\",0,1)","v":1},null,null,null,null,null,null,null,null,"Phytoplankton community",null,null,null,null,null,null,null,null,null,null,null,null,null,null,null,null,null,"Tracheophyta",null,null,"Ochrophyta"]
{"$rows_left_out":72}
{"sheet":"MEW plant_WS","index":8,"n_rows":68,"n_cols":23,"rows_kept":68,"cut":false,"hidden":false,"merged":[]}
[]
["Question No.",1,2,3,4,5,6,7,8,9,10,11,12,13,14,15,16.100000000000001,16.3,17,18,"Total Score","Quality Score","Comment "]
["Short Questions","Duration of the exposure ","Biological endpoint","Biological effect stated or not","Biological effect quantified or not","Appropriate controls","Control & contaminant concentration","Test acceptability criteria","Characteristics of the test organism"," Type of test media","Type of exposure","Contaminant concentrations","Parallel reference toxicant toxicity tests","Concentration–response relationship","Determine the toxicity","NOEC/LOEC or LC/EC/BEC","Conductivity/Salinity","PH","Temperature","Grade or purity"]
["Marks Awarded ","10 or 0","10,5 or 0","5 or 0 ","5 or 0 ","5 or 0 ","5 or 0 ","5 or 0 ","5 or 0 ","5 or 0 ","4 or 0","4 or 2 or 0","4 or 2","4 or 2","4 or 2","4 or 2","3 or 1 or 0","3 or 1 or 0","3 or 0","3 or 0 "]
["Max. Possible Score",10,10,5,5,5,5,5,5,5,4,4,4,4,4,4,3,3,3,3,{"$f":"SUM(B5:T5)","v":91}]
["Category","MEW_plant","Paper and data unique identifier(eg. 1-1,10-150)","105-1"]
["Scores",10,5,0,0,5,5,0,0,5,0,2,0,4,0,0,0,0,0,0,39,0.42857142857142855,""]
["Answers","","","","","","","","","","","","","Only one Fe concentration of 0.1 ugL","","","","","",""]
["Category","MEW_plant","Paper and data unique identifier(eg. 1-1,10-150)","121-1"]
["Scores",10,5,5,5,0,0,0,0,5,4,0,0,0,0,0,1,0,0,0,37,0.40659340659340659,"The highest possible grade for this datum is acceptable."]
{"$rows_left_out":58}