{"text_format":"1","workbook":"xlsx","n_sheets":13,"sheets":["Copyright","Cover","Instruction","Fresh Data QA","Sheet1","Fresh Quality","Marine Data QA","Marine Quality","Terrestrial Data QA","Terrestrial Quality","Sediment Data QA","Sediment Quality","All Result"],"not_rendered":{"charts":0,"images":0,"macros":1,"external_links":0,"defined_names":5,"comments":8,"pivot_tables":0},"unopened":[],"bounds":{"document_bytes":16777216,"sheet_cells":100000,"rows_first":2000,"rows_last":500,"rows_between":2000,"halvings":0,"cell_chars":16384,"cell_head_chars":4096},"cells_cut":0,"cells_raw":0,"read":"whole","date_system":"1900"}

{"sheet":"Copyright","index":0,"n_rows":0,"n_cols":0,"rows_kept":0,"cut":false,"hidden":false,"merged":[]}

{"sheet":"Cover","index":1,"n_rows":20,"n_cols":7,"rows_kept":20,"cut":false,"hidden":false,"merged":[[18,6,18,8],[14,6,14,8],[13,6,13,8],[4,4,4,10],[9,6,9,8],[12,6,12,8],[5,5,6,9]]}
[]
[]
[]
[]
[null,null,null,null,"Ecotoxicity Data Quality Assessment Method "]
[null,null,null,null,null,"To be used to assess the quality of data used for the Australian and New Zealand Guidelines for Fresh and Marine Water Quality (including sediment) and the Australian National Environment Protection (Assessment of Site Contamination) Measure"]
{"$rows_left_out":15}
{"sheet":"Instruction","index":2,"n_rows":17,"n_cols":11,"rows_kept":17,"cut":false,"hidden":false,"merged":[[16,6,16,8],[22,4,22,8]]}
[]
[]
[]
[]
[]
[]
{"$rows_left_out":12}
{"sheet":"Fresh Data QA","index":3,"n_rows":98,"n_cols":25,"rows_kept":98,"cut":false,"hidden":false,"merged":[[3,4,7,4],[56,7,59,7],[60,7,63,7],[40,7,42,7],[43,7,45,7],[46,7,48,7],[49,7,51,7],[34,7,36,7],[52,7,54,7],[14,7,16,7],[9,2,9,4],[20,2,21,2],[22,2,24,2],[17,7,19,7],[20,7,21,7],[22,7,24,7],[80,7,82,7],[64,7,67,7],[68,7,71,7],[72,7,75,7],[76,7,79,7],[76,2,79,2],[11,7,13,7],[37,7,39,7],[28,7,30,7],[31,7,33,7],[25,7,27,7],[11,2,13,2],[14,2,16,2],[17,2,19,2],[25,2,27,2],[64,2,67,2],[83,7,86,7],[34,2,36,2],[37,2,39,2],[28,2,30,2],[60,2,63,2],[40,2,42,2],[43,2,45,2],[83,2,86,2],[46,2,48,2],[31,2,33,2],[80,2,82,2],[49,2,51,2],[52,2,54,2],[56,2,59,2],[68,2,71,2],[72,2,75,2]]}
[null,1,"FILL IN BLANKS BELOW,PICK OPTIONS FROM DROPDOWN LIST",null,null,null,null,null,null,null,"* All the text in Blue are used for drop down list ,make changes with caution."]
[null,null,"Category",null,"Freshwater",{"$f":"IF(M3=\"\",0,1)","v":1},"Citation No.",{"$f":"IF(E3=\"\",\"\",LEFT(E3,FIND(\"-\",E3) -1))","v":{"$error":"#VALUE!"}},null,null,"Species",null,null,"Lifestage",null,null,"Exposure duration",null,null,"Measure of toxicity",null,null,"Toxicity endpoint"]
[null,null,"Paper and data unique identifier(eg. 1-1,10-150)",null,"Canadian Summit Report, 2007_17",{"$f":"IF(E3=\"\",0,1)","v":1},"Species (Scientific name)",null,null,null,"Anabaena catenula",64,{"$f":"IF(L3=0,\"\",INDEX(K3:K200,L3))","v":"Hyalella azteca"},"<24-hour old",17,{"$f":"IF(O3=0,\"\",INDEX(N3:N200,O3))","v":"Juveniles"},"1 day",8,{"$f":"IF(R3=0,\"\",INDEX(Q3:Q200,R3))","v":"14 days"},"Development: Eggs embryonated",66,{"$f":"IF(U3=0,\"\",INDEX(T3:T100,U3))","v":"Growth: Dry weight"},0.01,33,{"$f":"IF(X3=0,\"\",INDEX(W3:W200,X3))","v":"LC50"}]
[null,null,"Citation",null,"SEC (2007). Toxicity of glyphosate and thiram to aquatic invertebrates, Final Report 551-04.01, Prepared for Environment Canada, Summit Environmental Consultants, British Columbia.",{"$f":"IF(E4=\"\",0,1)","v":1},"Lifestage",null,null,null,"Arthrospira fusiformis",null,null,"3cm apical segments",null,null,"1 hour ",null,null,"Development: Eggs hatched",null,null,0.02]
[null,null,null,null,null,{"$f":"IF(S3=\"\",0,1)","v":1},"Exposure duration",null,null,null,"Aulacoseira sp. ",null,null,"6 fronds",null,null,"10 days",null,null,"Development: Embryos hatched",null,null,0.03]
[null,null,null,null,null,{"$f":"IF(V3=\"\",0,1)","v":1},"Measure of toxicity",null,null,null,"Australian Bass",null,null,"Adult",null,null,"10 days",null,null,"Development: Mass",null,null,0.04]
{"$rows_left_out":93}
{"sheet":"Sheet1","index":4,"n_rows":34,"n_cols":29,"rows_kept":34,"cut":false,"hidden":true,"merged":[]}
[]
[{"$f":"'Fresh Data QA'!B11","v":"No."},{"$f":"'Fresh Data QA'!B13","v":1},{"$f":"'Fresh Data QA'!B16","v":2},{"$f":"'Fresh Data QA'!B19","v":3},{"$f":"'Fresh Data QA'!B21","v":4},{"$f":"'Fresh Data QA'!B23","v":5},{"$f":"'Fresh Data QA'!B26","v":6},{"$f":"'Fresh Data QA'!B29","v":7},{"$f":"'Fresh Data QA'!B32","v":8},{"$f":"'Fresh Data QA'!B35","v":9},{"$f":"'Fresh Data QA'!B39","v":10},{"$f":"'Fresh Data QA'!B42","v":11},{"$f":"'Fresh Data QA'!B45","v":12},{"$f":"'Fresh Data QA'!B48","v":13},{"$f":"'Fresh Data QA'!B51","v":14},{"$f":"'Fresh Data QA'!B53","v":15},{"$f":"'Fresh Data QA'!B58","v":16.100000000000001},{"$f":"'Fresh Data QA'!B62","v":16.2},{"$f":"'Fresh Data QA'!B66","v":16.3},{"$f":"'Fresh Data QA'!B70","v":16.399999999999999},{"$f":"'Fresh Data QA'!B74","v":16.5},{"$f":"'Fresh Data QA'!B78","v":16.600000000000001},{"$f":"'Fresh Data QA'!B82","v":17},{"$f":"'Fresh Data QA'!B85","v":18},{"$f":"'Fresh Data QA'!C90","v":"Total score"},{"$f":"'Fresh Data QA'!C92","v":"Quality Score"}]
[{"$f":"'Fresh Data QA'!C2","v":"Category"},{"$f":"'Fresh Data QA'!E2","v":"Freshwater"},{"$f":"'Fresh Data QA'!C3","v":"Paper and data unique identifier(eg. 1-1,10-150)"},{"$f":"'Fresh Data QA'!E3","v":"Canadian Summit Report, 2007_17"}]
[{"$f":"'Fresh Data QA'!G11","v":"Scores"},{"$f":"'Fresh Data QA'!G12","v":10},{"$f":"'Fresh Data QA'!G15","v":5},{"$f":"'Fresh Data QA'!G18","v":5},{"$f":"'Fresh Data QA'!G21","v":5},{"$f":"'Fresh Data QA'!G23","v":5},{"$f":"'Fresh Data QA'!G26","v":5},{"$f":"'Fresh Data QA'!G29","v":5},{"$f":"'Fresh Data QA'!G32","v":5},{"$f":"'Fresh Data QA'!G35","v":5},{"$f":"'Fresh Data QA'!G38","v":4},{"$f":"'Fresh Data QA'!G41","v":4},{"$f":"'Fresh Data QA'!G44","v":4},{"$f":"'Fresh Data QA'!G47","v":4},{"$f":"'Fresh Data QA'!G50","v":4},{"$f":"'Fresh Data QA'!G53","v":4},{"$f":"'Fresh Data QA'!G57","v":1},{"$f":"'Fresh Data QA'!G61","v":1},{"$f":"'Fresh Data QA'!G65","v":0},{"$f":"'Fresh Data QA'!G69","v":1},{"$f":"'Fresh Data QA'!G73","v":1},{"$f":"'Fresh Data QA'!G77","v":1},{"$f":"'Fresh Data QA'!G81","v":3},{"$f":"'Fresh Data QA'!G84","v":3},{"$f":"'Fresh Data QA'!G90","v":85},{"$f":"'Fresh Data QA'!G92","v":0.82524271844660191}]
["Answers",{"$f":"IF('Fresh Data QA'!H12=0,\"\",'Fresh Data QA'!H12)","v":"14-day - survival and dry weight (chronic)\n96-hour - survival (acute)"},{"$f":"IF('Fresh Data QA'!H15=0,\"\",'Fresh Data QA'!H15)","v":"Survival and growth (measured as dry weight)"},{"$f":"IF('Fresh Data QA'!H18=0,\"\",'Fresh Data QA'!H18)","v":""},{"$f":"IF('Fresh Data QA'!H21=0,\"\",'Fresh Data QA'!H21)","v":""},{"$f":"IF('Fresh Data QA'!H23=0,\"\",'Fresh Data QA'!H23)","v":"Laboratory control"},{"$f":"IF('Fresh Data QA'!H26=0,\"\",'Fresh Data QA'!H26)","v":"Six glyphosate concentrations and a\nlaboratory control, with four replicates per concentration"},{"$f":"IF('Fresh Data QA'!H29=0,\"\",'Fresh Data QA'!H29)","v":"Amphipod survival must be ≥90% in the control"},{"$f":"IF('Fresh Data QA'!H32=0,\"\",'Fresh Data QA'!H32)","v":"Juvenile"},{"$f":"IF('Fresh Data QA'!H35=0,\"\",'Fresh Data QA'!H35)","v":"Dechlorinated and activated carbon treated\nmunicipal tapwater"},{"$f":"IF('Fresh Data QA'!H38=0,\"\",'Fresh Data QA'!H38)","v":"Renewed daily by removing approximately 80% of the overlying solution and replacing it with freshly prepared test solution"},{"$f":"IF('Fresh Data QA'!H41=0,\"\",'Fresh Data QA'!H41)","v":"Measured daily in old and new solutions"},{"$f":"IF('Fresh Data QA'!H44=0,\"\",'Fresh Data QA'!H44)","v":"A 96-hr acute toxicity test using sodium chloride"},{"$f":"IF('Fresh Data QA'!H47=0,\"\",'Fresh Data QA'!H47)","v":"Table 3.6"},{"$f":"IF('Fresh Data QA'!H50=0,\"\",'Fresh Data QA'!H50)","v":""},{"$f":"IF('Fresh Data QA'!H53=0,\"\",'Fresh Data QA'!H53)","v":"(95% CL, 150.3-171.6)."},{"$f":"IF('Fresh Data QA'!H57=0,\"\",'Fresh Data QA'!H57)","v":""},{"$f":"IF('Fresh Data QA'!H61=0,\"\",'Fresh Data QA'!H65)","v":0},{"$f":"IF('Fresh Data QA'!H65=0,\"\",'Fresh Data QA'!H65)","v":""},{"$f":"IF('Fresh Data QA'!H69=0,\"\",'Fresh Data QA'!H69)","v":"Measured for controls only"},{"$f":"IF('Fresh Data QA'!H73=0,\"\",'Fresh Data QA'!H73)","v":""},{"$f":"IF('Fresh Data QA'!H77=0,\"\",'Fresh Data QA'!H77)","v":""},{"$f":"IF('Fresh Data QA'!H81=0,\"\",'Fresh Data QA'!H81)","v":"23±1°C"},{"$f":"IF('Fresh Data QA'!H84=0,\"\",'Fresh Data QA'!H84)","v":"98% purity"}]
[{"$f":"'Fresh Data QA'!G3","v":"Species (Scientific name)"},{"$f":"'Fresh Data QA'!G4","v":"Lifestage"},{"$f":"'Fresh Data QA'!G5","v":"Exposure duration"},{"$f":"'Fresh Data QA'!G6","v":"Measure of toxicity"},{"$f":"'Fresh Data QA'!G7","v":"Toxicity endpoint"},{"$f":"'Fresh Data QA'!G8","v":"Toxicity value"},{"$f":"'Fresh Data QA'!C4","v":"Citation"},{"$f":"'Fresh Data QA'!G2","v":"Citation No."}]
{"$rows_left_out":29}
{"sheet":"Fresh Quality","index":5,"n_rows":966,"n_cols":26,"rows_kept":966,"cut":false,"hidden":false,"merged":[]}
[]
["Question No.",1,2,3,4,5,6,7,8,9,10,11,12,13,14,15,16.100000000000001,16.2,16.3,16.399999999999999,16.5,16.600000000000001,17,18,"Total Score","Quality Score"]
["Short Questions","Duration of the exposure ","Biological endpoint","Biological effect stated or not","Biological effect quantified or not","Appropriate controls","Control & contaminant concentration","Test acceptability criteria","Characteristics of the test organism"," Type of test media","Type of exposure","Contaminant concentrations","Parallel reference toxicant toxicity tests","Concentration–response relationship","Determine the toxicity","NOEC/LOEC or LC/EC/BEC","pH","POC","Particle size","AVS & 1-M HCl extractable metals","Dissolved contaminants","Dissolved ammonia and sulfide","Temperature","Grade or purity"]
["Marks Awarded","10 or 0","10,5 or 0","5 or 0 ","5 or 0 ","5 or 0 ","5 or 0 ","5 or 0 ","5 or 0 ","5 or 0 ","4 or 0","4 or 0","4 or 0","4 or 0","4 or 0","4 or 0","3,1,or 0","3,1,or 0","3,1,or 0","3,1,or 0","3,1,or 0","3,1,or 0","3 or 0","3 or 0"]
["Max. Possible Score",10,10,5,5,5,5,5,5,5,4,4,4,4,4,4,3,3,3,3,3,3,3,3,{"$f":"SUM(B5:X5)","v":103}]
["Category","Freshwater","Paper and data unique identifier(eg. 1-1,10-150)","1-2"]
{"$rows_left_out":961}
{"sheet":"Marine Data QA","index":6,"n_rows":98,"n_cols":25,"rows_kept":98,"cut":false,"hidden":false,"merged":[[87,7,88,7],[46,2,48,2],[31,2,33,2],[37,7,39,7],[83,7,86,7],[34,2,36,2],[37,2,39,2],[83,2,86,2],[64,2,67,2],[68,2,71,2],[72,2,75,2],[76,2,79,2],[80,2,82,2],[49,2,51,2],[52,2,54,2],[56,2,59,2],[28,7,30,7],[31,7,33,7],[11,2,13,2],[20,2,21,2],[22,2,24,2],[14,2,16,2],[60,2,63,2],[40,2,42,2],[17,2,19,2],[28,2,30,2],[43,2,45,2],[25,2,27,2],[80,7,82,7],[64,7,67,7],[68,7,71,7],[72,7,75,7],[76,7,79,7],[3,4,7,4],[56,7,59,7],[60,7,63,7],[40,7,42,7],[43,7,45,7],[46,7,48,7],[49,7,51,7],[34,7,36,7],[52,7,54,7],[14,7,16,7],[11,7,13,7],[17,7,19,7],[20,7,21,7],[22,7,24,7],[25,7,27,7],[9,2,9,4]]}
[null,1,"FILL IN BLANKS BELOW,PICK OPTIONS FROM DROPDOWN LIST",null,null,null,null,null,null,null,"* All the text in Blue are used for drop down list ,make changes with caution."]
[null,null,"Category",null,"Marine ",{"$f":"IF(M3=\"\",0,1)","v":1},"Citation No.",{"$f":"IF(E3=\"\",\"\",LEFT(E3,FIND(\"-\",E3) -1))","v":"971"},null,null,"Species",null,null,"Lifestage",null,null,"Exposure duration",null,null,"Measure of toxicity",null,null,"Toxicity endpoint"]
[null,null,"Paper and data unique identifier(eg. 1-1,10-150)",null,"971-3",{"$f":"IF(E3=\"\",0,1)","v":1},"Species (Scientific name)",null,null,null,"Australian Bass",15,{"$f":"IF(L3=0,\"\",INDEX(K3:K50,L3))","v":"Zostera marina"},"Log growth phase: Trophozoites",13,{"$f":"IF(O3=0,\"\",INDEX(N3:N50,O3))","v":"Not stated"},"1 hour ",11,{"$f":"IF(R3=0,\"\",INDEX(Q3:Q50,R3))","v":"3 Days"},"Growth inhibition: Cell proliferation",17,{"$f":"IF(U3=0,\"\",INDEX(T3:T50,U3))","v":"Chlorophyll-(a/b)"},0.01,12,{"$f":"IF(X3=0,\"\",INDEX(W3:W50,X3))","v":"NOEC"}]
[null,null,"Citation",null,"Nielsen, L. W. & Dahllof, I. 2007. Direct and indirect effects of the herbicides Glyphosate, Bentazone and MCPA on eelgrass (Zostera marina), vol. 82, pp. 47 - 54. ",{"$f":"IF(E4=\"\",0,1)","v":1},"Lifestage",null,null,null,"Bala Shark",null,null,"Ovigerous female adults",null,null,"2 hours",null,null,"Growth: Body weight",null,null,0.02]
[null,null,null,null,null,{"$f":"IF(S3=\"\",0,1)","v":1},"Exposure duration",null,null,null,"Basa",null,null,"Phase 1",null,null,"3 hours",null,null,"Method 1",null,null,0.03]
[null,null,null,null,null,{"$f":"IF(V3=\"\",0,1)","v":1},"Measure of toxicity",null,null,null,"Black Parinha",null,null,"phase 14",null,null,"4 hours",null,null,"Method 10",null,null,0.04]
{"$rows_left_out":93}
{"sheet":"Marine Quality","index":7,"n_rows":29,"n_cols":27,"rows_kept":29,"cut":false,"hidden":false,"merged":[]}
[]
["Question No.",1,2,3,4,5,6,7,8,9,10,11,12,13,14,15,16.100000000000001,16.2,16.3,16.399999999999999,16.5,16.600000000000001,17,18,19,"Total Score","Quality Score"]
["Short Questions","duration of the exposure ","biological endpoint","biological effect stated or not","biological effect qualified or not","Appropriate controls","control and contaminant concentration","test acceptability criteria","characteristics of the test organism"," type of test media","type of exposure","contaminant concentrations","parallel reference toxicant toxicity tests","concentration–response relationship"," statistical method or model to determine the toxicity","LC/EC/BEC data values ","pH","POC","Particle size","AVS & 1-M HCl extractable metals","Dissolved contaminants","Dissolved ammonia and sulfide","Temperature","Grade or purity","salinity/conductivity measured and stated"]
["Marks Awarded","10 or 0","10,5 or 0","5 or 0 ","5 or 0 ","5 or 0 ","5 or 0 ","5 or 0 ","5 or 0 ","5 or 0 ","4 or 0","4 or 0","4 or 0","4 or 0","4 or 0","4 or 0","3,1,or 0","3,1,or 0","3,1,or 0","3,1,or 0","3,1,or 0","3,1,or 0","3 or 0","3 or 0","3 or 0"]
["Max. Possible Score",10,10,5,5,5,5,5,5,5,4,4,4,4,4,4,3,3,3,3,3,3,3,3,3,{"$f":"SUM(B5:Y5)","v":106}]
["Category","Marine ","Paper and data unique identifier(eg. 1-1,10-150)","2-2"]
{"$rows_left_out":24}
{"sheet":"Terrestrial Data QA","index":8,"n_rows":98,"n_cols":25,"rows_kept":98,"cut":false,"hidden":false,"merged":[[72,7,75,7],[34,2,36,2],[28,2,30,2],[57,2,60,2],[37,2,39,2],[40,2,42,2],[72,2,75,2],[43,2,45,2],[31,2,33,2],[69,2,71,2],[46,2,48,2],[49,2,51,2],[53,2,56,2],[61,2,64,2],[65,2,68,2],[69,7,71,7],[11,2,13,2],[20,2,21,2],[22,2,24,2],[25,2,27,2],[14,2,16,2],[17,2,19,2],[61,7,64,7],[65,7,68,7],[11,7,13,7],[49,7,51,7],[14,7,16,7],[22,7,24,7],[25,7,27,7],[17,7,19,7],[20,7,21,7],[3,4,7,4],[53,7,56,7],[57,7,60,7],[37,7,39,7],[40,7,42,7],[43,7,45,7],[46,7,48,7],[34,7,36,7],[28,7,30,7],[31,7,33,7],[80,2,82,2],[80,7,82,7],[83,2,86,2],[83,7,86,7],[76,2,79,2],[76,7,79,7]]}
[null,1,"FILL IN BLANKS BELOW,PICK OPTIONS FROM DROPDOWN LIST",null,null,null,null,null,null,null,"* All the text in Blue are used for drop down list ,make changes with caution."]
[null,null,"Category",null,"Terrestrial Quality",{"$f":"IF(M3=\"\",0,1)","v":0},"Citation No.",{"$f":"IF(E3=\"\",\"\",LEFT(E3,FIND(\"-\",E3) -1))","v":""},null,null,"Species",null,null,"Lifestage",null,null,"Exposure duration",null,null,"Measure of toxicity",null,null,"Toxicity endpoint"]
[null,null,"Paper and data unique identifier(eg. 1-1,10-150)",null,null,{"$f":"IF(E3=\"\",0,1)","v":0},"Species (Scientific name)",null,null,null,"Australian Bass",0,{"$f":"IF(L3=0,\"\",INDEX(K3:K47,L3))","v":""},"Phase 1",0,{"$f":"IF(O3=0,\"\",INDEX(N3:N47,O3))","v":""},"1 hour ",0,{"$f":"IF(R3=0,\"\",INDEX(Q3:Q47,R3))","v":""},"Method 1",0,{"$f":"IF(U3=0,\"\",INDEX(T3:T47,U3))","v":""},0.01,0,{"$f":"IF(X3=0,\"\",INDEX(W3:W47,X3))","v":""}]
[null,null,"Citation",null,null,{"$f":"IF(E4=\"\",0,1)","v":0},"Lifestage",null,null,null,"Bala Shark",null,null,"Phase 2",null,null,"2 hours",null,null,"Method 2",null,null,0.02]
[null,null,null,null,null,{"$f":"IF(S3=\"\",0,1)","v":0},"Exposure duration",null,null,null,"Basa",null,null,"Phase 3",null,null,"3 hours",null,null,"Method 3",null,null,0.03]
[null,null,null,null,null,{"$f":"IF(V3=\"\",0,1)","v":0},"Measure of toxicity",null,null,null,"Black Parinha",null,null,"Phase 4",null,null,"4 hours",null,null,"Method 4",null,null,0.04]
{"$rows_left_out":93}
{"sheet":"Terrestrial Quality","index":9,"n_rows":11,"n_cols":26,"rows_kept":11,"cut":false,"hidden":false,"merged":[]}
[]
["Question No.",1,2,3,4,5,6,7,8,9,10,11,12,13,14,15.1,15.2,15.3,15.4,16,17,18,19,20,"Total Score","Quality Score"]
["Short Questions","duration of the exposure  ","biological endpoint","biological effect stated or not","biological effect qualified or not","appropriate controls","control & contaminant concentration","test acceptability criteria ","characteristics of the test organism"," type of test media"," contaminant concentrations "," parallel reference toxicant toxicity","concentration–response relationship"," statistical method or model to determine the toxicity","LC/EC/BEC data","pH","OM or OC content","Clay content","CEC","Temperature","Grade or purity","cations and or major soil elements measured or  interacting elements on bioavailability measured ","soils leached after spiking","incubation conditions and duration"]
["Marks Awarded","10 or 0","10,5 or 0","5 or 0 ","5 or 0 ","5 or 0 ","5 or 0 ","5 ,2 or 0 ","5 or 0 ","5 or 0 ","4 or 0","4 or 0","4 or 0","4 or 0","4 or 0","3,1,or 0","3,1,or 0","3,1,or 0","3,1,or 0","3 or 0","3 or 0","3 or 0","3 or 0","3 or 0"]
["Max. Possible Score",10,10,5,5,5,5,5,5,5,4,4,4,4,4,3,3,3,3,3,3,3,3,3,{"$f":"SUM(B5:X5)","v":102}]
["Category","Terrestrial Quality","Paper and data unique identifier(eg. 1-1,10-150)","3-1"]
{"$rows_left_out":6}
{"sheet":"Sediment Data QA","index":10,"n_rows":103,"n_cols":25,"rows_kept":103,"cut":false,"hidden":false,"merged":[[3,4,7,4],[56,7,59,7],[60,7,63,7],[40,7,42,7],[43,7,45,7],[46,7,48,7],[11,7,13,7],[17,7,19,7],[49,7,51,7],[34,7,36,7],[14,7,16,7],[20,7,21,7],[28,7,30,7],[31,7,33,7],[11,2,13,2],[20,2,21,2],[22,2,24,2],[25,2,27,2],[14,2,16,2],[17,2,19,2],[28,2,30,2],[22,7,24,7],[25,7,27,7],[31,2,33,2],[37,7,39,7],[34,2,36,2],[37,2,39,2],[40,2,42,2],[46,2,48,2],[49,2,51,2],[52,2,54,2],[43,2,45,2],[91,2,92,2],[89,7,90,7],[91,7,92,7],[87,7,88,7],[83,7,86,7],[83,2,86,2],[72,7,75,7],[76,7,79,7],[52,7,54,7],[89,2,90,2],[68,2,71,2],[80,2,82,2],[72,2,75,2],[76,2,79,2],[80,7,82,7],[64,2,67,2],[64,7,67,7],[68,7,71,7],[60,2,63,2],[56,2,59,2]]}
[null,1,"FILL IN BLANKS BELOW,PICK OPTIONS FROM DROPDOWN LIST",null,null,null,null,null,null,null,"* All the text in Blue are used for drop down list ,make changes with caution."]
[null,null,"Category",null,"Sediment ",{"$f":"IF(M3=\"\",0,1)","v":0},"Citation No.",{"$f":"IF(E3=\"\",\"\",LEFT(E3,FIND(\"-\",E3) -1))","v":""},null,null,"Species",null,null,"Lifestage",null,null,"Exposure duration",null,null,"Measure of toxicity",null,null,"Toxicity endpoint"]
[null,null,"Paper and data unique identifier(eg. 1-1,10-150)",null,null,{"$f":"IF(E3=\"\",0,1)","v":0},"Species (Scientific name)",null,null,null,"Australian Bass",0,{"$f":"IF(L3=0,\"\",INDEX(K3:K50,L3))","v":""},"Phase 1",0,{"$f":"IF(O3=0,\"\",INDEX(N3:N50,O3))","v":""},"1 hour ",0,{"$f":"IF(R3=0,\"\",INDEX(Q3:Q50,R3))","v":""},"Method 1",0,{"$f":"IF(U3=0,\"\",INDEX(T3:T50,U3))","v":""},0.01,0,{"$f":"IF(X3=0,\"\",INDEX(W3:W50,X3))","v":""}]
[null,null,"Citation",null,null,{"$f":"IF(E4=\"\",0,1)","v":0},"Lifestage",null,null,null,"Bala Shark",null,null,"Phase 10",null,null,"2 hours",null,null,"Method 10",null,null,0.02]
[null,null,null,null,null,{"$f":"IF(S3=\"\",0,1)","v":0},"Exposure duration",null,null,null,"Basa",null,null,"phase 14",null,null,"3 hours",null,null,"Method 2",null,null,0.03]
[null,null,null,null,null,{"$f":"IF(V3=\"\",0,1)","v":0},"Measure of toxicity",null,null,null,"Black Parinha",null,null,"Phase 2",null,null,"4 hours",null,null,"Method 3",null,null,0.04]
{"$rows_left_out":98}
{"sheet":"Sediment Quality","index":11,"n_rows":8,"n_cols":29,"rows_kept":8,"cut":false,"hidden":false,"merged":[]}
[]
["Question No.",1,2,3,4,5,6,7,8,9,10,11,12,13,14,15,16.100000000000001,16.2,16.3,16.399999999999999,16.5,16.600000000000001,17,18,19,20,21,"Total Score","Quality Score"]
["Short Questions","duration of the exposure ","biological endpoint","biological effect stated ornot","biological effect quantified or not","appropriate controls","control & contaminant concentration","test acceptability criteria","characteristics of the test organism"," type of test media","type of exposure","contaminant concentrations","parallel reference toxicant toxicity tests","concentration–response relationship","determine the toxicity","LC/EC/BEC ","pH","POC","Particle size","AVS & 1-M HCl extractable metals","Dissolved contaminants","Dissolved ammonia and sulfide","Temperature","Grade or purity"," salinity/conductivity","alkalinity, hardness, or concentrations of Ca and Mg","equilibration conditions "]
["Marks Awarded","10 or 0","10,5 or 0","5 or 0 ","5 or 0 ","5 or 0 ","5 or 0 ","5 or 0 ","5 or 0 ","5 or 0 ","4 or 0","4 or 0","4 or 0","4 or 0","4 or 0","4 or 0","3,1,or 0","3,1,or 0","3,1,or 0","3,1,or 0","3,1,or 0","3,1,or 0","3 or 0","3 or 0","3 or 0","3 or 0"]
["Max. Possible Score",10,10,5,5,5,5,5,5,5,4,4,4,4,4,4,3,3,3,3,3,3,3,3,3,3,3,{"$f":"SUM(B5:AA5)","v":112}]
["Category","Sediment ","Paper and data unique identifier(eg. 1-1,10-150)","4-1"]
{"$rows_left_out":3}
{"sheet":"All Result","index":12,"n_rows":487,"n_cols":29,"rows_kept":487,"cut":false,"hidden":false,"merged":[[327,0,327,11]]}
[{"$f":"'Fresh Data QA'!C2","v":"Category"},{"$f":"'Fresh Data QA'!C3","v":"Paper and data unique identifier(eg. 1-1,10-150)"},{"$f":"'Fresh Data QA'!C90","v":"Total score"},{"$f":"'Fresh Data QA'!C92","v":"Quality Score"},{"$f":"'Fresh Data QA'!G3","v":"Species (Scientific name)"},{"$f":"'Fresh Data QA'!G4","v":"Lifestage"},{"$f":"'Fresh Data QA'!G5","v":"Exposure duration"},{"$f":"'Fresh Data QA'!G6","v":"Measure of toxicity"},{"$f":"'Fresh Data QA'!G7","v":"Toxicity endpoint"},{"$f":"'Fresh Data QA'!G8","v":"Toxicity value"},{"$f":"'Fresh Data QA'!C4","v":"Citation"},{"$f":"'Fresh Data QA'!G2","v":"Citation No."},"Formulation / Data Check"]
["Freshwater","869-1",62,0.60194174757281549,"Scenedesmus subspicatus","Exponential Growth Phase","72 hours","Population: Abundance","EC50","26 mg/L","Vendrell,E., D.G.B. Ferraz, C. Sabater, and J.M. Carrasco, 2009. Effect of Glyphosate on Growth of Four Freshwater Species of Phytoplankton: A Microplate Bioassay, Bull. Environ. Contam. Toxicol.82(5): 538-542. ","869","Phosphonomethyl "]
["Freshwater","869-2",62,0.60194174757281549,"Scenedesmus subspicatus","Exponential Growth Phase","72 hours","Population: Abundance","EC10","1.6 mg/L","Vendrell,E., D.G.B. Ferraz, C. Sabater, and J.M. Carrasco, 2009. Effect of Glyphosate on Growth of Four Freshwater Species of Phytoplankton: A Microplate Bioassay, Bull. Environ. Contam. Toxicol.82(5): 538-542. ","869","Phosphonomethyl "]
["Freshwater","869-3",62,0.60194174757281549,"Scenedesmus subspicatus","Exponential Growth Phase","72 hours","Population: Abundance","NOEC","0.1 mg/L","Vendrell,E., D.G.B. Ferraz, C. Sabater, and J.M. Carrasco, 2009. Effect of Glyphosate on Growth of Four Freshwater Species of Phytoplankton: A Microplate Bioassay, Bull. Environ. Contam. Toxicol.82(5): 538-542. ","869","Phosphonomethyl "]
["Freshwater","869-4",62,0.60194174757281549,"Scenedesmus subspicatus","Exponential Growth Phase","72 hours","Population: Abundance","LOEC","0.39 mg/L","Vendrell,E., D.G.B. Ferraz, C. Sabater, and J.M. Carrasco, 2009. Effect of Glyphosate on Growth of Four Freshwater Species of Phytoplankton: A Microplate Bioassay, Bull. Environ. Contam. Toxicol.82(5): 538-542. ","869","Phosphonomethyl "]
["Freshwater","869-5",62,0.60194174757281549,"Scenedesmus acutus","Exponential Growth Phase","72 hours","Population: Abundance","EC50","24.5 mg/L","Vendrell,E., D.G.B. Ferraz, C. Sabater, and J.M. Carrasco, 2009. Effect of Glyphosate on Growth of Four Freshwater Species of Phytoplankton: A Microplate Bioassay, Bull. Environ. Contam. Toxicol.82(5): 538-542. ","869","Phosphonomethyl "]
{"$rows_left_out":481}