{"text_format":"1","workbook":"xlsx","n_sheets":23,"sheets":["Copyright","Cover","All Result","Instruction","Sheet1","FW metal nonplant","FW metal nonplant_WS","FW nonmetal nonplant","FW nonmetal nonplant_WS","FW metal plant","FW metal plant_WS","FW nonmetal plant","FW nonmetal plant_WS","MEW nonplant","MEW nonplant_WS","MEW plant","MEW plant_WS","Terrestrial Data QA","Terrestrial Quality","Sediment Data QA","Sediment Quality","Sheet2","Sheet3"],"not_rendered":{"charts":0,"images":0,"macros":1,"external_links":0,"defined_names":9,"comments":10,"pivot_tables":0},"unopened":[],"bounds":{"document_bytes":16777216,"sheet_cells":100000,"rows_first":2000,"rows_last":500,"rows_between":2000,"halvings":0,"cell_chars":16384,"cell_head_chars":4096},"cells_cut":0,"cells_raw":0,"read":"whole","date_system":"1900"}

{"sheet":"Copyright","index":0,"n_rows":0,"n_cols":0,"rows_kept":0,"cut":false,"hidden":false,"merged":[]}

{"sheet":"Cover","index":1,"n_rows":20,"n_cols":7,"rows_kept":20,"cut":false,"hidden":false,"merged":[[18,6,18,8],[14,6,14,8],[13,6,13,8],[4,4,4,10],[9,6,9,8],[12,6,12,8],[5,5,6,9]]}
[]
[]
[]
[]
[null,null,null,null,"Ecotoxicity Data Quality Assessment Method V2.4"]
[null,null,null,null,null,"To be used to assess the quality of data used for the Australian and New Zealand Guidelines for Fresh and Marine Water Quality (including sediment) and the Australian National Environment Protection (Assessment of Site Contamination) Measure"]
[]
[]
[]
[null,null,null,null,null,null,"Developed by "]
[]
[]
[null,null,null,null,null,null,"Zoe Zhang"]
[null,null,null,null,null,null,"   Dr. Michael Warne"]
[null,null,null,null,null,null,"Alison Vieritz "]
[]
[]
[]
[null,null,null,null,null,null,"Water Quality & Investigations "]
[null,null,null,null,null,"                 Department of Science, Information Technology and Innovation"]

{"sheet":"All Result","index":2,"n_rows":367,"n_cols":25,"rows_kept":367,"cut":false,"hidden":false,"merged":[]}
[{"$f":"'FW nonmetal plant'!C2","v":"Category"},{"$f":"'FW nonmetal plant'!C3","v":"Paper and data unique identifier(eg. 1-1,10-150)"},{"$f":"'FW nonmetal plant'!C70","v":"Total score"},{"$f":"'FW nonmetal plant'!C72","v":"Quality Score"},"Comment ",{"$f":"'FW nonmetal plant'!G3","v":"Species (Scientific name)"},{"$f":"'FW nonmetal plant'!G4","v":"Lifestage"},{"$f":"'FW nonmetal plant'!G5","v":"Exposure duration"},{"$f":"'FW nonmetal plant'!G6","v":"Measure of toxicity"},{"$f":"'FW nonmetal plant'!G7","v":"Toxicity endpoint"},{"$f":"'FW nonmetal plant'!G8","v":"Toxicity value"},{"$f":"'FW nonmetal plant'!J2","v":"Taxonomic group"},{"$f":"'FW nonmetal plant'!J3","v":"Phylum"},{"$f":"'FW nonmetal plant'!J4","v":"Class"},{"$f":"'FW nonmetal plant'!J5","v":"Media"},{"$f":"'FW nonmetal plant'!J6","v":"Temperature "},{"$f":"'FW nonmetal plant'!J7","v":"Acute Or Chronic "},{"$f":"'FW nonmetal plant'!J8","v":"PH"},{"$f":"'FW metal plant'!J9","v":"Salinity/Conductivity"},{"$f":"'FW metal plant'!C4","v":"Citation"},{"$f":"'FW metal plant'!G2","v":"Citation No."},"Paper comments","QAQC Check #1","QAQC Check #2"]
["Freshwater/non-metal/non- plant","1056-1",65,0.7142857142857143,"","Aedes aegypti","4th instar larvae","48 hr","LC50","Mortality","0.00154ppm","Macroinvertebrate","Arthropoda","Insecta","Tap water","26 ± 2","Acute ","Not stated","N.A.","Ali,A., J.K. Nayar, and W.D. Gu (1998) Toxicity of a Phenyl Pyrazole Insecticide, Fipronil, to Mosquito and Chironomid Midge Larvae in the Laboratory Am. Mosq. Control Assoc. J.14(2): 216-218 1998","1056",null,"Technical grade fipronil (97.1%)","OK to use"]
["Freshwater/non-metal/non- plant","1056-2",65,0.7142857142857143,"","Aedes albopictus","4th instar larvae","48 hr","LC50","Mortality","0.023ppm","Macroinvertebrate","Arthropoda","Insecta","Tap water","26 ± 2","Acute ","Not stated","N.A.","Ali,A., J.K. Nayar, and W.D. Gu (1998) Toxicity of a Phenyl Pyrazole Insecticide, Fipronil, to Mosquito and Chironomid Midge Larvae in the Laboratory Am. Mosq. Control Assoc. J.14(2): 216-218 1998","1056",null,"Technical grade fipronil (97.1%)","OK to use"]
["Freshwater/non-metal/non- plant","1056-3",65,0.7142857142857143,"","Aedes taeniorhynchus","4th instar larvae","48 hr","LC50","Mortality","0.00043ppm","Macroinvertebrate","Arthropoda","Insecta","Tap water","26 ± 2","Acute ","Not stated","N.A.","Ali,A., J.K. Nayar, and W.D. Gu (1998) Toxicity of a Phenyl Pyrazole Insecticide, Fipronil, to Mosquito and Chironomid Midge Larvae in the Laboratory Am. Mosq. Control Assoc. J.14(2): 216-218 1998","1056",null,"Technical grade fipronil (97.1%)","OK to use"]
["Freshwater/non-metal/non- plant","1056-4",65,0.7142857142857143,"","Aedes taeniorhynchus","4th instar larvae","24 hrs","LC50","Mortality","0.0014ppm","Macroinvertebrate","Arthropoda","Insecta","Tap water","26 ± 2","Acute ","Not stated","N.A.","Ali,A., J.K. Nayar, and W.D. Gu (1998) Toxicity of a Phenyl Pyrazole Insecticide, Fipronil, to Mosquito and Chironomid Midge Larvae in the Laboratory Am. Mosq. Control Assoc. J.14(2): 216-218 1998","1056",null,"Technical grade fipronil (97.1%)","OK to use"]
["Freshwater/non-metal/non- plant","1056-5",65,0.7142857142857143,"","AnopheIes quadrimaculatus","4th instar larvae","48 hr","LC50","Mortality","0.00043ppm","Macroinvertebrate","Arthropoda","Insecta","Tap water","26 ± 2","Acute ","Not stated","N.A.","Ali,A., J.K. Nayar, and W.D. Gu (1998) Toxicity of a Phenyl Pyrazole Insecticide, Fipronil, to Mosquito and Chironomid Midge Larvae in the Laboratory Am. Mosq. Control Assoc. J.14(2): 216-218 1998","1056",null,"Technical grade fipronil (97.1%)","OK to use"]
["Freshwater/non-metal/non- plant","1056-6",65,0.7142857142857143,"","Culex nigripalpus","4th instar larvae","48 hr","LC50","Mortality","0.00087ppm","Macroinvertebrate","Arthropoda","Insecta","Tap water","26 ± 2","Acute ","Not stated","N.A.","Ali,A., J.K. Nayar, and W.D. Gu (1998) Toxicity of a Phenyl Pyrazole Insecticide, Fipronil, to Mosquito and Chironomid Midge Larvae in the Laboratory Am. Mosq. Control Assoc. J.14(2): 216-218 1998","1056",null,"Technical grade fipronil (97.1%)","OK to use"]
["Freshwater/non-metal/non- plant","1056-7",65,0.7142857142857143,"","Culex nigripalpus","4th instar larvae","24 hrs","LC50","Mortality","0.0014ppm","Macroinvertebrate","Arthropoda","Insecta","Tap water","26 ± 2","Acute ","Not stated","N.A.","Ali,A., J.K. Nayar, and W.D. Gu (1998) Toxicity of a Phenyl Pyrazole Insecticide, Fipronil, to Mosquito and Chironomid Midge Larvae in the Laboratory Am. Mosq. Control Assoc. J.14(2): 216-218 1998","1056",null,"Technical grade fipronil (97.1%)","OK to use"]
["Freshwater/non-metal/non- plant","1056-8",65,0.7142857142857143,"","Culex quinqefasciatus","4th instar larvae","48 hr","LC50","Mortality","0.0073ppm","Macroinvertebrate","Arthropoda","Insecta","Tap water","26 ± 2","Acute ","Not stated","N.A.","Ali,A., J.K. Nayar, and W.D. Gu (1998) Toxicity of a Phenyl Pyrazole Insecticide, Fipronil, to Mosquito and Chironomid Midge Larvae in the Laboratory Am. Mosq. Control Assoc. J.14(2): 216-218 1998","1056",null,"Technical grade fipronil (97.1%)","OK to use"]
["Freshwater/non-metal/non- plant","1056-9",65,0.7142857142857143,"","Culex quinqefasciatus","1st instar larvae","48 hr","LC50","Mortality","0.0046ppm","Macroinvertebrate","Arthropoda","Insecta","Tap water","26 ± 2","Acute ","Not stated","N.A.","Ali,A., J.K. Nayar, and W.D. Gu (1998) Toxicity of a Phenyl Pyrazole Insecticide, Fipronil, to Mosquito and Chironomid Midge Larvae in the Laboratory Am. Mosq. Control Assoc. J.14(2): 216-218 1998","1056",null,"Technical grade fipronil (97.1%)","OK to use"]
["Freshwater/non-metal/non- plant","1056-10",65,0.7142857142857143,null,"Aedes albopictus","1st instar larvae","48 hr","LC50","Mortality","0.0081ppm","Macroinvertebrate","Arthropoda","Insecta","Tap water","26 ± 2","Acute ","Not stated","N.A.","Ali,A., J.K. Nayar, and W.D. Gu (1998) Toxicity of a Phenyl Pyrazole Insecticide, Fipronil, to Mosquito and Chironomid Midge Larvae in the Laboratory Am. Mosq. Control Assoc. J.14(2): 216-218 1998","1056",null,"Technical grade fipronil (97.1%)","OK to use"]
["Freshwater/non-metal/non- plant","1056-11",65,0.7142857142857143,"","Chironomus crassicaudatus","4th instar larvae","48 hr","LC50","Mortality","0.00042ppm","Macroinvertebrate","Arthropoda","Insecta","Tap water","26 ± 2","Acute ","Not stated","N.A.","Ali,A., J.K. Nayar, and W.D. Gu (1998) Toxicity of a Phenyl Pyrazole Insecticide, Fipronil, to Mosquito and Chironomid Midge Larvae in the Laboratory Am. Mosq. Control Assoc. J.14(2): 216-218 1998","1056",null,"Technical grade fipronil (97.1%)","OK to use"]
["Freshwater/non-metal/non- plant","1056-12",65,0.7142857142857143,"","Glyptotendipes paripes","4th instar larvae","48 hr","LC50","Mortality","0.00042ppm","Macroinvertebrate","Arthropoda","Insecta","Tap water","26 ± 2","Acute ","Not stated","N.A.","Ali,A., J.K. Nayar, and W.D. Gu (1998) Toxicity of a Phenyl Pyrazole Insecticide, Fipronil, to Mosquito and Chironomid Midge Larvae in the Laboratory Am. Mosq. Control Assoc. J.14(2): 216-218 1998","1056",null,"Technical grade fipronil (97.1%)","OK to use"]
["Freshwater/non-metal/non- plant","1056-13",65,0.7142857142857143,"","Glyptotendipes paripes","4th instar larvae","24 hrs","LC50","Mortality","0.00091ppm","Macroinvertebrate","Arthropoda","Insecta","Tap water","26 ± 2","Acute ","Not stated","N.A.","Ali,A., J.K. Nayar, and W.D. Gu (1998) Toxicity of a Phenyl Pyrazole Insecticide, Fipronil, to Mosquito and Chironomid Midge Larvae in the Laboratory Am. Mosq. Control Assoc. J.14(2): 216-218 1998","1056",null,"Technical grade fipronil (97.1%)","OK to use"]
["Freshwater/non-metal/non- plant","1057-1",65,0.7142857142857143,"","Culex quinqefasciatus","4th instar larvae","24 hrs","LC50","Mortality","0.00035ppm","Macroinvertebrate","Arthropoda","Insecta","Tap water","28 + 3","Acute ","Not stated","N.A.","Ali,A., M.A. Chowdhury, M.I. Hossain, M. Ameen, D.B. Habiba, and A.F.M. Aslam (1999) Laboratory Evaluation of Selected Larvicides and Insect Growth Regulators Against Field-Collected Culex quinquefasciatus Larvae from Urban Dhaka, Bangladesh Am. Mosq. Control Assoc. J.15(1): 43-47","1057",null,"Technical grade fipronil (97.1%)","OK to use"]
["Freshwater/non-metal/non- plant","1057-2",65,0.7142857142857143,"","Culex quinqefasciatus","4th instar larvae","24 hrs","LC90","Mortality","0.000896ppm","Macroinvertebrate","Arthropoda","Insecta","Tap water","28 + 3","Acute ","Not stated","N.A.","Ali,A., M.A. Chowdhury, M.I. Hossain, M. Ameen, D.B. Habiba, and A.F.M. Aslam (1999) Laboratory Evaluation of Selected Larvicides and Insect Growth Regulators Against Field-Collected Culex quinquefasciatus Larvae from Urban Dhaka, Bangladesh Am. Mosq. Control Assoc. J.15(1): 43-47","1057","Do Not Use - LC90 too high.","Not using","Do not use"]
["Freshwater/non-metal/non- plant","1058-1",75,0.82417582417582413,null,"Pimephales promelas","Larval","96 hour","LC50","Mortality","448.49ug/L","Fish","Chordata","Actinopterygii","Moderately hard water","25±1","Acute ","7.3-8.0","N.A.","Baird,S., A. Garrison, J. Jones, J. Avants, R. Bringolf, and M. Black (2013) Enantioselective Toxicity and Bioaccumulation of Fipronil in Fathead Minnows (Pimephales promelas) Following Water and Sediment Exposures Environ. Toxicol. Chem.32(1): 222-227","1058","Racemate","Fipronil 97.8%","OK to use"]
["Freshwater/non-metal/non- plant","1058-2",75,0.82417582417582413,null,"Pimephales promelas","Larval","7 day","LC50","Mortality","208ug/L","Fish","Chordata","Actinopterygii","Moderately hard water","25±1","Acute ","7.3-8.0","N.A.","Baird,S., A. Garrison, J. Jones, J. Avants, R. Bringolf, and M. Black (2013) Enantioselective Toxicity and Bioaccumulation of Fipronil in Fathead Minnows (Pimephales promelas) Following Water and Sediment Exposures Environ. Toxicol. Chem.32(1): 222-227","1058","Racemate","Fipronil 97.8%","OK to use"]
["Freshwater/non-metal/non- plant","1058-2",75,0.82417582417582413,null,"Pimephales promelas","Larval","7 day","LC50","Mortality","227ug/L","Fish","Chordata","Actinopterygii","Moderately hard water","25±1","Acute ","7.3-8.0","N.A.","Baird,S., A. Garrison, J. Jones, J. Avants, R. Bringolf, and M. Black (2013) Enantioselective Toxicity and Bioaccumulation of Fipronil in Fathead Minnows (Pimephales promelas) Following Water and Sediment Exposures Environ. Toxicol. Chem.32(1): 222-227","1058","S+ enantiomer","Fipronil 97.8%","OK to use"]
["Freshwater/non-metal/non- plant","1058-2",75,0.82417582417582413,null,"Pimephales promelas","Larval","7 day","LC50","Mortality","365ug/L","Fish","Chordata","Actinopterygii","Moderately hard water","25±1","Acute ","7.3-8.0","N.A.","Baird,S., A. Garrison, J. Jones, J. Avants, R. Bringolf, and M. Black (2013) Enantioselective Toxicity and Bioaccumulation of Fipronil in Fathead Minnows (Pimephales promelas) Following Water and Sediment Exposures Environ. Toxicol. Chem.32(1): 222-227","1058","R- enantiomer","Fipronil 97.8%","OK to use"]
["Freshwater/non-metal/non- plant","1058-3",75,0.82417582417582413,"Spiked sediment, highest conc. of waterborne fipronil detected at 7 days","Pimephales promelas","Juvenile (101-120d)","42 day","NOEL","Mortality","<20ug/L","Fish","Chordata","Actinopterygii","Moderately hard water","19.6-23.1","Chronic","6.6-7.2","N.A.","Baird,S., A. Garrison, J. Jones, J. Avants, R. Bringolf, and M. Black (2013) Enantioselective Toxicity and Bioaccumulation of Fipronil in Fathead Minnows (Pimephales promelas) Following Water and Sediment Exposures Environ. Toxicol. Chem.32(1): 222-227","1058","Do Not Use - Sediment Spiked tests. Water concentrations were measured, however exposure could have been from fipronil in water column and sediment. ","Not using","Do not use"]
["Freshwater/non-metal/non- plant","1059-1",77,0.84615384615384615,"","Pimephales promelas","larval (7-d post hatch)","24hr","LC50","Mortality","398.29 ug/L","Fish","Chordata","Actinopterygii","Deionised water with added salts","23.1 ± 0.3","Acute ","7.51 ± 0.19","N.A.","Beggel,S., I. Werner, R.E. Connon, and J.P. Geist (2010) Sublethal Toxicity of Commercial Insecticide Formulations and Their Active Ingredients to Larval Fathead Minnow (Pimephales promelas) Sci. Total Environ.408(16): 3169-3175","1059",null,"Fipronil 98.5% purity","OK to use"]
["Freshwater/non-metal/non- plant","1059-2",77,0.84615384615384615,"","Pimephales promelas","larval (7-d post hatch)","24hr","LC10","Mortality","305.57 ug/L","Fish","Chordata","Actinopterygii","Deionised water with added salts","23.1 ± 0.3","Acute ","7.51 ± 0.19","N.A.","Beggel,S., I. Werner, R.E. Connon, and J.P. Geist (2010) Sublethal Toxicity of Commercial Insecticide Formulations and Their Active Ingredients to Larval Fathead Minnow (Pimephales promelas) Sci. Total Environ.408(16): 3169-3175","1059",null,"Fipronil 98.5% purity","OK to use"]
["Freshwater/non-metal/non- plant","1059-3",77,0.84615384615384615,"","Pimephales promelas","larval (7-d post hatch)","24hr","LOEC","Mortality","350 ug/L","Fish","Chordata","Actinopterygii","Deionised water with added salts","23.1 ± 0.3","Acute ","7.51 ± 0.19","N.A.","Beggel,S., I. Werner, R.E. Connon, and J.P. Geist (2010) Sublethal Toxicity of Commercial Insecticide Formulations and Their Active Ingredients to Larval Fathead Minnow (Pimephales promelas) Sci. Total Environ.408(16): 3169-3175","1059",null,"Fipronil 98.5% purity","OK to use"]
["Freshwater/non-metal/non- plant","1059-4",77,0.84615384615384615,"","Pimephales promelas","larval (7-d post hatch)","24hr","NOEC","Mortality","300 ug/L","Fish","Chordata","Actinopterygii","Deionised water with added salts","23.1 ± 0.3","Acute ","7.51 ± 0.19","N.A.","Beggel,S., I. Werner, R.E. Connon, and J.P. Geist (2010) Sublethal Toxicity of Commercial Insecticide Formulations and Their Active Ingredients to Larval Fathead Minnow (Pimephales promelas) Sci. Total Environ.408(16): 3169-3175","1059",null,"Fipronil 98.5% purity","OK to use"]
["Freshwater/non-metal/non- plant","1059-5",77,0.84615384615384615,"","Pimephales promelas","larval (7-d post hatch)","24hr","LOEC","Mobility: swim performance","≥142ug/L","Fish","Chordata","Actinopterygii","Deionised water with added salts","23.1 ± 0.3","Acute ","7.51 ± 0.19","N.A.","Beggel,S., I. Werner, R.E. Connon, and J.P. Geist (2010) Sublethal Toxicity of Commercial Insecticide Formulations and Their Active Ingredients to Larval Fathead Minnow (Pimephales promelas) Sci. Total Environ.408(16): 3169-3175","1059","Do Not Use - Non-viable endpoint","Not using","Do not use"]
["MEW_nonplant","1025-1",74,0.78723404255319152,"","Amphiascus tenuiremis","female stage 1 juvenile","96hr","LC50","Mortality","6.07ug/L","Microinvertebrate","Arthropoda","Maxillopoda","DOM-free seawater","20 ± 1","Acute","8.16 ± 0.07","30.14±0.35","Bejarano,A.C., G.T. Chandler, and A.W. Decho (2005) Influence of Natural Dissolved Organic Matter (DOM) on Acute and Chronic Toxicity of the Pesticides Chlorothalonil, Chlorpyrifos and Fipronil on the Meiobenthic Estuarine Copepod Amphiascus tenuiremis J. Exp. Mar. Biol. Ecol.321(1): 43-57","1025",null,"98 ± 0.5% purity","OK to use"]
["MEW_nonplant","1025-2",74,0.78723404255319152,"","Amphiascus tenuiremis","male stage 1 juvenile","96hr","LC50","Mortality","3.86 ug/L","Microinvertebrate","Arthropoda","Maxillopoda","DOM-free seawater","20 ± 1","Acute","8.16 ± 0.07","30.14±0.35","Bejarano,A.C., G.T. Chandler, and A.W. Decho (2005) Influence of Natural Dissolved Organic Matter (DOM) on Acute and Chronic Toxicity of the Pesticides Chlorothalonil, Chlorpyrifos and Fipronil on the Meiobenthic Estuarine Copepod Amphiascus tenuiremis J. Exp. Mar. Biol. Ecol.321(1): 43-57","1025",null,"98 ± 0.5% purity","OK to use"]
["MEW_nonplant","1025-6",74,0.78723404255319152,"Only one concentration tested.","Amphiascus tenuiremis","Life cycle","16 day","LOEL","Reproductive success: viable embryos","1.41ug/L","Microinvertebrate","Arthropoda","Maxillopoda","Seawater with added DOM","25 ± 1","Chronic","7.9 ± 0.3","30 ± 1","Bejarano,A.C., G.T. Chandler, and A.W. Decho (2005) Influence of Natural Dissolved Organic Matter (DOM) on Acute and Chronic Toxicity of the Pesticides Chlorothalonil, Chlorpyrifos and Fipronil on the Meiobenthic Estuarine Copepod Amphiascus tenuiremis J. Exp. Mar. Biol. Ecol.321(1): 43-57","1025",null,"98 ± 0.5% purity","OK to use"]
["MEW_nonplant","1025-7",74,0.78723404255319152,"Only one concentration tested.","Amphiascus tenuiremis","Life cycle","16 day","LOEL","Mortality","1.41ug/L","microinvertebrate","Arthropoda","Maxillopoda","DOM-free seawater","25 ± 1","Chronic","7.9 ± 0.3","30 ± 1","Bejarano,A.C., G.T. Chandler, and A.W. Decho (2005) Influence of Natural Dissolved Organic Matter (DOM) on Acute and Chronic Toxicity of the Pesticides Chlorothalonil, Chlorpyrifos and Fipronil on the Meiobenthic Estuarine Copepod Amphiascus tenuiremis J. Exp. Mar. Biol. Ecol.321(1): 43-57","1025",null,"98 ± 0.5% purity","OK to use"]
["Freshwater/non-metal/non- plant","1060-1",61,0.67032967032967028,"Highest concentration tested","Pimephales promelas",">6 month ","21 day","NOEC","Fecundity: egg production",">5.0ug/L","Fish","Chordata","Actinopterygii","Filtered and sterilised natural lake water",25,"Chronic","Not stated","N.A.","Bencic,D.C., D.L. Villeneuve, A.D. Biales, L. Blake, E.J. Durhan, K.M. Jensen, M.D. Kahl, E.A. Makynen, D. Martinovic-We (2013) Effects of the Insecticide Fipronil on Reproductive Endocrinology in the Fathead Minnow Environ. Toxicol. Chem.32(8): 1828-1834","1060","Do Not Use - NOEC value not obtained and these values are way too low in comparison to other data for this species. Concentration range was not high enough.","Not using","Do not use"]
["Freshwater/non-metal/non- plant","1060-2",61,0.67032967032967028,"Highest concentration tested","Pimephales promelas",">6 month ","21 day","NOEC","Mortality",">5.0ug/L","Fish","Chordata","Actinopterygii","Filtered and sterilised natural lake water",25,"Chronic","Not stated","N.A.","Bencic,D.C., D.L. Villeneuve, A.D. Biales, L. Blake, E.J. Durhan, K.M. Jensen, M.D. Kahl, E.A. Makynen, D. Martinovic-We (2013) Effects of the Insecticide Fipronil on Reproductive Endocrinology in the Fathead Minnow Environ. Toxicol. Chem.32(8): 1828-1834","1060","Do Not Use - NOEC value not obtained and these values are way too low in comparison to other data for this species. Concentration range was not high enough.","Not using","Do not use"]
["Freshwater/non-metal/non- plant","1060-JF",61,0.67032967032967028,"Highest concentration tested","Pimephales promelas",">6 month ","21 day","NOEC","Fecundity: Number of spawns per pair",">5.0ug/L","Fish","Chordata","Actinopterygii","Filtered and sterilised natural lake water",25,"Chronic","Not stated","N.A.","Bencic,D.C., D.L. Villeneuve, A.D. Biales, L. Blake, E.J. Durhan, K.M. Jensen, M.D. Kahl, E.A. Makynen, D. Martinovic-We (2013) Effects of the Insecticide Fipronil on Reproductive Endocrinology in the Fathead Minnow Environ. Toxicol. Chem.32(8): 1828-1834","1060","Do Not Use - NOEC value not obtained and these values are way too low in comparison to other data for this species. Concentration range was not high enough.","Not using","Do not use"]
["Freshwater/non-metal/non- plant","1060-JF",61,0.67032967032967028,"Highest concentration tested","Pimephales promelas",">6 month ","21 day","NOEC","Fecundity: Number of eggs produced per spawn",">5.0ug/L","Fish","Chordata","Actinopterygii","Filtered and sterilised natural lake water",25,"Chronic","Not stated","N.A.","Bencic,D.C., D.L. Villeneuve, A.D. Biales, L. Blake, E.J. Durhan, K.M. Jensen, M.D. Kahl, E.A. Makynen, D. Martinovic-We (2013) Effects of the Insecticide Fipronil on Reproductive Endocrinology in the Fathead Minnow Environ. Toxicol. Chem.32(8): 1828-1834","1060","Do Not Use - NOEC value not obtained and these values are way too low in comparison to other data for this species. Concentration range was not high enough.","Not using","Do not use"]
["Freshwater/non-metal/non- plant","1060-2",61,0.67032967032967028,"Highest concentration tested","Pimephales promelas",">6 month ","21 day","NOEC","Body mass",">5.0ug/L","Fish","Chordata","Actinopterygii","Filtered and sterilised natural lake water",25,"Chronic","Not stated","N.A.","Bencic,D.C., D.L. Villeneuve, A.D. Biales, L. Blake, E.J. Durhan, K.M. Jensen, M.D. Kahl, E.A. Makynen, D. Martinovic-We (2013) Effects of the Insecticide Fipronil on Reproductive Endocrinology in the Fathead Minnow Environ. Toxicol. Chem.32(8): 1828-1834","1060","Do Not Use - NOEC value not obtained and these values are way too low in comparison to other data for this species. Concentration range was not high enough.","Not using","Do not use"]
["Freshwater/non-metal/non- plant","1060-3",61,0.67032967032967028,"","Pimephales promelas",">6 month male","21 day","NOEC","Gonad mass",">5.0ug/L","Fish","Chordata","Actinopterygii","Filtered and sterilised natural lake water",25,"Chronic","Not stated","N.A.","Bencic,D.C., D.L. Villeneuve, A.D. Biales, L. Blake, E.J. Durhan, K.M. Jensen, M.D. Kahl, E.A. Makynen, D. Martinovic-We (2013) Effects of the Insecticide Fipronil on Reproductive Endocrinology in the Fathead Minnow Environ. Toxicol. Chem.32(8): 1828-1834","1060","Do Not Use - Non-viable endpoint","Not using","Do not use"]
["Freshwater/non-metal/non- plant","1060-4",61,0.67032967032967028,"","Pimephales promelas",">6 month male","21 day","NOEC","Secondary sexual characteristics",">5.0ug/L","Fish","Chordata","Actinopterygii","Filtered and sterilised natural lake water",25,"Chronic","Not stated","N.A.","Bencic,D.C., D.L. Villeneuve, A.D. Biales, L. Blake, E.J. Durhan, K.M. Jensen, M.D. Kahl, E.A. Makynen, D. Martinovic-We (2013) Effects of the Insecticide Fipronil on Reproductive Endocrinology in the Fathead Minnow Environ. Toxicol. Chem.32(8): 1828-1834","1060","Do Not Use - Non-viable endpoint","Not using","Do not use"]
["Freshwater/non-metal/non- plant","1060-5",61,0.67032967032967028,"","Pimephales promelas",">6 month ","21 day","NOEC","Gonadosomatic index",">5.0ug/L","Fish","Chordata","Actinopterygii","Filtered and sterilised natural lake water",25,"Chronic","Not stated","N.A.","Bencic,D.C., D.L. Villeneuve, A.D. Biales, L. Blake, E.J. Durhan, K.M. Jensen, M.D. Kahl, E.A. Makynen, D. Martinovic-We (2013) Effects of the Insecticide Fipronil on Reproductive Endocrinology in the Fathead Minnow Environ. Toxicol. Chem.32(8): 1828-1834","1060","Do Not Use - Non-viable endpoint","Not using","Do not use"]
["Freshwater/non-metal/non- plant","1029-4",83,0.91208791208791207,"Highest concentration tested","Lampsilis siliquoidea","Glochidia","24hr","EC50","Viability: ability to attach to host",">2.0mg/L","Macroinvertebrate","Mollusca","Bivalvia","Reconstituted hard water","20.1-21.9","Acute ","8.32-8.61","N.A.","Bringolf,R.B., W.G. Cope, C.B. Eads, P.R. Lazaro, M.C. Barnhart, and D. Shea (2007), Acute and Chronic Toxicity of Technical-Grade Pesticides to Glochidia and Juveniles of Freshwater Mussels (Unionidae) Environ. Toxicol. Chem.26(10): 2086-2093","1029","Do Not Use - No EC50 value obtained","Not using","Do not use"]
["Freshwater/non-metal/non- plant","1029-5",83,0.91208791208791207,"Highest concentration tested","Lampsilis siliquoidea","Glochidia","48hr","EC50","Viability: ability to attach to host",">2.0mg/L","Macroinvertebrate","Mollusca","Bivalvia","Reconstituted hard water","20.1-21.9","Acute ","8.32-8.61","N.A.","Bringolf,R.B., W.G. Cope, C.B. Eads, P.R. Lazaro, M.C. Barnhart, and D. Shea (2007), Acute and Chronic Toxicity of Technical-Grade Pesticides to Glochidia and Juveniles of Freshwater Mussels (Unionidae) Environ. Toxicol. Chem.26(10): 2086-2093","1029","Do Not Use - No EC50 value obtained","Not using","Do not use"]
["Freshwater/non-metal/non- plant","1029-6",83,0.91208791208791207,"","Lampsilis siliquoidea","<2 month old Juvenile","96hr","EC50","Survival: movement inside/outside shell",">2.0mg/L","Macroinvertebrate","Mollusca","Bivalvia","Reconstituted hard water","20.1-21.9","Acute ","8.32-8.61","N.A.","Bringolf,R.B., W.G. Cope, C.B. Eads, P.R. Lazaro, M.C. Barnhart, and D. Shea (2007), Acute and Chronic Toxicity of Technical-Grade Pesticides to Glochidia and Juveniles of Freshwater Mussels (Unionidae) Environ. Toxicol. Chem.26(10): 2086-2093","1029","Do Not Use - Non-viable endpoint","Not using","Do not use"]
["Freshwater/non-metal/non- plant","1029-7",83,0.91208791208791207,"Highest concentration tested","Lampsilis fasciola","Glochidia","24hr","EC50","Viability: ability to attach to host",">2.0mg/L","Macroinvertebrate","Mollusca","Bivalvia","Reconstituted hard water","20.1-21.9","Acute ","8.32-8.61","N.A.","Bringolf,R.B., W.G. Cope, C.B. Eads, P.R. Lazaro, M.C. Barnhart, and D. Shea (2007), Acute and Chronic Toxicity of Technical-Grade Pesticides to Glochidia and Juveniles of Freshwater Mussels (Unionidae) Environ. Toxicol. Chem.26(10): 2086-2093","1029","Do Not Use - No EC50 value obtained","Not using","Do not use"]
["Freshwater/non-metal/non- plant","1029-8",83,0.91208791208791207,"Highest concentration tested","Lampsilis fasciola","Glochidia","48hr","EC50","Viability: ability to attach to host",">2.0mg/L","Macroinvertebrate","Mollusca","Bivalvia","Reconstituted hard water","20.1-21.9","Acute ","8.32-8.61","N.A.","Bringolf,R.B., W.G. Cope, C.B. Eads, P.R. Lazaro, M.C. Barnhart, and D. Shea (2007), Acute and Chronic Toxicity of Technical-Grade Pesticides to Glochidia and Juveniles of Freshwater Mussels (Unionidae) Environ. Toxicol. Chem.26(10): 2086-2093","1029","Do Not Use - No EC50 value obtained","Not using","Do not use"]
["Freshwater/non-metal/non- plant","1029-9",83,0.91208791208791207,"","Lampsilis fasciola","<2 month old Juvenile","96hr","EC50","Survival: movement inside/outside shell",">2.0mg/L","Macroinvertebrate","Mollusca","Bivalvia","Reconstituted hard water","20.1-21.9","Acute ","8.32-8.61","N.A.","Bringolf,R.B., W.G. Cope, C.B. Eads, P.R. Lazaro, M.C. Barnhart, and D. Shea (2007), Acute and Chronic Toxicity of Technical-Grade Pesticides to Glochidia and Juveniles of Freshwater Mussels (Unionidae) Environ. Toxicol. Chem.26(10): 2086-2093","1029","Do Not Use - Non-viable endpoint","Not using","Do not use"]
["Freshwater/non-metal/non- plant","1029-10",83,0.91208791208791207,"Highest concentration tested","Elliptio complanata","Glochidia","24hr","EC50","Viability: ability to attach to host",">2.0mg/L","Macroinvertebrate","Mollusca","Bivalvia","Reconstituted hard water","20.1-21.9","Acute ","8.32-8.61","N.A.","Bringolf,R.B., W.G. Cope, C.B. Eads, P.R. Lazaro, M.C. Barnhart, and D. Shea (2007), Acute and Chronic Toxicity of Technical-Grade Pesticides to Glochidia and Juveniles of Freshwater Mussels (Unionidae) Environ. Toxicol. Chem.26(10): 2086-2093","1029","Do Not Use - No EC50 value obtained","Not using","Do not use"]
["Freshwater/non-metal/non- plant","1029-11",83,0.91208791208791207,"Highest concentration tested","Villosa constricta","Glochidia","24hr","EC50","Viability: ability to attach to host",">2.0mg/L","Macroinvertebrate","Mollusca","Bivalvia","Reconstituted hard water","20.1-21.9","Acute ","8.32-8.61","N.A.","Bringolf,R.B., W.G. Cope, C.B. Eads, P.R. Lazaro, M.C. Barnhart, and D. Shea (2007), Acute and Chronic Toxicity of Technical-Grade Pesticides to Glochidia and Juveniles of Freshwater Mussels (Unionidae) Environ. Toxicol. Chem.26(10): 2086-2093","1029","Do Not Use - No EC50 value obtained","Not using","Do not use"]
["Freshwater/non-metal/non- plant","1029-12",83,0.91208791208791207,"Highest concentration tested","Villosa constricta","Glochidia","48hr","EC50","Viability: ability to attach to host",">2.0mg/L","Macroinvertebrate","Mollusca","Bivalvia","Reconstituted hard water","20.1-21.9","Acute ","8.32-8.61","N.A.","Bringolf,R.B., W.G. Cope, C.B. Eads, P.R. Lazaro, M.C. Barnhart, and D. Shea (2007), Acute and Chronic Toxicity of Technical-Grade Pesticides to Glochidia and Juveniles of Freshwater Mussels (Unionidae) Environ. Toxicol. Chem.26(10): 2086-2093","1029","Do Not Use - No EC50 value obtained","Not using","Do not use"]
["MEW_nonplant","1062-1",59,0.62765957446808507,null,"Amphiascus tenuiremis","Life cycle","24 day","NOEL","Mortality","0.63ug/L","microinvertebrate","Arthropoda","Maxillopoda","seawater",25,"Chronic","Not stated","not stated","Cary,T.L., G.T. Chandler, D.C. Volz, S.S. Walse, and J.L. Ferry (2004) Phenylpyrazole Insecticide Fipronil Induces Male Infertility in the Estuarine Meiobenthic Crustacean Amphiascus tenuiremis Environ. Sci. Technol.38(2): 522-528 ","1062","Do Not Use - Use the QCQC'd version of this entry below","Not using","Do not use"]
["MEW_nonplant","1062-2",59,0.62765957446808507,"","Amphiascus tenuiremis","Life cycle","24 day","NOEL","Sex ratio","0.63ug/L","microinvertebrate","Arthropoda","Maxillopoda","seawater",25,"Chronic","Not stated","not stated","Cary,T.L., G.T. Chandler, D.C. Volz, S.S. Walse, and J.L. Ferry (2004) Phenylpyrazole Insecticide Fipronil Induces Male Infertility in the Estuarine Meiobenthic Crustacean Amphiascus tenuiremis Environ. Sci. Technol.38(2): 522-528 ","1062","Do Not Use - Use the QCQC'd version of this entry below","Not using","Do not use"]
["MEW_nonplant","1062-3",59,0.62765957446808507,"","Amphiascus tenuiremis","Life cycle","24 day","LOEL","Male development","0.63ug/L","microinvertebrate","Arthropoda","Maxillopoda","seawater",25,"Chronic","Not stated","not stated","Cary,T.L., G.T. Chandler, D.C. Volz, S.S. Walse, and J.L. Ferry (2004) Phenylpyrazole Insecticide Fipronil Induces Male Infertility in the Estuarine Meiobenthic Crustacean Amphiascus tenuiremis Environ. Sci. Technol.38(2): 522-528 ","1062","Do Not Use - Use the QCQC'd version of this entry below","Not using","Do not use"]
["MEW_nonplant","1063-1",54,0.57446808510638303,"","Amphiascus tenuiremis ","Life cycle","32d (3 brood)","LOEL","Mortality","0.5ug/L","microinvertebrate","Arthropoda","Maxillopoda","seawater",25,"Chronic","Not stated","not stated","Chandler,G.T., T.L. Cary, A.C. Bejarano, J. Pender, and J.L. Ferry (2004) Population Consequences of Fipronil and Degradates to Copepods at Field Concentrations: An Integration of Life Cycle Testing with Leslie Matrix Population Modeling Environ. Sci. Technol.38(23): 6407-6414","1063","Do Not Use - Use the QCQC'd version of this entry below","Not using","Do not use"]
["MEW_nonplant","1063-2",54,0.57446808510638303,"","Amphiascus tenuiremis ","Life cycle","32d (3 brood)","LOEL","Viable offspring","0.25ug/L","microinvertebrate","Arthropoda","Maxillopoda","seawater",25,"Chronic","Not stated","not stated","Chandler,G.T., T.L. Cary, A.C. Bejarano, J. Pender, and J.L. Ferry (2004) Population Consequences of Fipronil and Degradates to Copepods at Field Concentrations: An Integration of Life Cycle Testing with Leslie Matrix Population Modeling Environ. Sci. Technol.38(23): 6407-6414","1063","Do Not Use - Use the QCQC'd version of this entry below","Not using","Do not use"]
["MEW_nonplant","1063-3",54,0.57446808510638303,null,"Amphiascus tenuiremis ","Life cycle","32d (3 brood)","NOEL","Mortality","0.25ug/L","microinvertebrate","Arthropoda","Maxillopoda","seawater",25,"Chronic","Not stated","not stated","Chandler,G.T., T.L. Cary, A.C. Bejarano, J. Pender, and J.L. Ferry (2004) Population Consequences of Fipronil and Degradates to Copepods at Field Concentrations: An Integration of Life Cycle Testing with Leslie Matrix Population Modeling Environ. Sci. Technol.38(23): 6407-6414","1063","Do Not Use - Use the QCQC'd version of this entry below","Not using","Do not use"]
["MEW_nonplant","1064-1",76,0.80851063829787229,"","Amphiascus tenuiremis ","Adult","96hr","LC50","Male mortality","3.5ug/L","Microinvertebrate","Arthropoda","Maxillopoda","Artificial seawater",20,"Acute",8.3000000000000007,30,"Chandler,G.T., T.L. Cary, D.C. Volz, S.S. Walse, J.L. Ferry, and S.L. Klosterhaus (2004) Fipronil Effects on Estuarine Copepod (Amphiascus tenuiremis) Development, Fertility, and Reproduction: A Rapid Life-Cycle Assay in 96-Well Microplate Format Environ. Toxicol. Chem.23(1): 117-124 ","1064",null,"Technical grade fipronil (98.0% pure)","OK to use"]
["MEW_nonplant","1064-2",76,0.80851063829787229,"","Amphiascus tenuiremis ","Adult","96hr","LC50","Female mortality","13.0ug/L","Microinvertebrate","Arthropoda","Maxillopoda","Artificial seawater",20,"Acute",8.3000000000000007,30,"Chandler,G.T., T.L. Cary, D.C. Volz, S.S. Walse, J.L. Ferry, and S.L. Klosterhaus (2004) Fipronil Effects on Estuarine Copepod (Amphiascus tenuiremis) Development, Fertility, and Reproduction: A Rapid Life-Cycle Assay in 96-Well Microplate Format Environ. Toxicol. Chem.23(1): 117-124 ","1064",null,"Technical grade fipronil (98.0% pure)","OK to use"]
["MEW_nonplant","1064-3",76,0.80851063829787229,"Highest concentration tested","Amphiascus tenuiremis ","Adult","96hr","LC50","Mortality","6.8ug/L","Microinvertebrate","Arthropoda","Maxillopoda","Artificial seawater",20,"Acute",8.3000000000000007,30,"Chandler,G.T., T.L. Cary, D.C. Volz, S.S. Walse, J.L. Ferry, and S.L. Klosterhaus (2004) Fipronil Effects on Estuarine Copepod (Amphiascus tenuiremis) Development, Fertility, and Reproduction: A Rapid Life-Cycle Assay in 96-Well Microplate Format Environ. Toxicol. Chem.23(1): 117-124 ","1064",null,"Technical grade fipronil (98.0% pure)","OK to use"]
["MEW_nonplant","1064-JF",76,0.80851063829787229,"Highest concentration tested","Amphiascus tenuiremis ","Life cycle","12 day","NOEL","Mortality","0.42ug/L","Microinvertebrate","Arthropoda","Maxillopoda","Artificial seawater",25,"Chronic",8.3000000000000007,30,"Chandler,G.T., T.L. Cary, D.C. Volz, S.S. Walse, J.L. Ferry, and S.L. Klosterhaus (2004) Fipronil Effects on Estuarine Copepod (Amphiascus tenuiremis) Development, Fertility, and Reproduction: A Rapid Life-Cycle Assay in 96-Well Microplate Format Environ. Toxicol. Chem.23(1): 117-124 ","1064",null,"Technical grade fipronil (98.0% pure)","OK to use"]
["MEW_nonplant","1064-4",76,0.80851063829787229,"","Amphiascus tenuiremis ","Life cycle","21 day","NOEL","Mortality","0.42ug/L","Microinvertebrate","Arthropoda","Maxillopoda","Artificial seawater",25,"Chronic",8.3000000000000007,30,"Chandler,G.T., T.L. Cary, D.C. Volz, S.S. Walse, J.L. Ferry, and S.L. Klosterhaus (2004) Fipronil Effects on Estuarine Copepod (Amphiascus tenuiremis) Development, Fertility, and Reproduction: A Rapid Life-Cycle Assay in 96-Well Microplate Format Environ. Toxicol. Chem.23(1): 117-124 ","1064",null,"Technical grade fipronil (98.0% pure)","OK to use"]
["MEW_nonplant","1064-JF",76,0.80851063829787229,"","Amphiascus tenuiremis ","Life cycle","12 day","NOEL","Development: stage 1 to adult","0.16ug/L","Microinvertebrate","Arthropoda","Maxillopoda","Artificial seawater",25,"Chronic",8.3000000000000007,30,"Chandler,G.T., T.L. Cary, D.C. Volz, S.S. Walse, J.L. Ferry, and S.L. Klosterhaus (2004) Fipronil Effects on Estuarine Copepod (Amphiascus tenuiremis) Development, Fertility, and Reproduction: A Rapid Life-Cycle Assay in 96-Well Microplate Format Environ. Toxicol. Chem.23(1): 117-124 ","1064",null,"Technical grade fipronil (98.0% pure)","OK to use"]
["MEW_nonplant","1064-5",76,0.80851063829787229,"","Amphiascus tenuiremis ","Life cycle","12 day","LOEL","Development: stage 1 to adult","0.22ug/L","Microinvertebrate","Arthropoda","Maxillopoda","Artificial seawater",25,"Chronic",8.3000000000000007,30,"Chandler,G.T., T.L. Cary, D.C. Volz, S.S. Walse, J.L. Ferry, and S.L. Klosterhaus (2004) Fipronil Effects on Estuarine Copepod (Amphiascus tenuiremis) Development, Fertility, and Reproduction: A Rapid Life-Cycle Assay in 96-Well Microplate Format Environ. Toxicol. Chem.23(1): 117-124 ","1064",null,"Technical grade fipronil (98.0% pure)","OK to use"]
["MEW_nonplant","1064-6",76,0.80851063829787229,"","Amphiascus tenuiremis ","Life cycle","17 day","NOEL","Fecundity: egg production","0.16ug/L","microinvertebrate","Arthropoda","Maxillopoda","Artificial seawater",25,"Chronic",8.3000000000000007,30,"Chandler,G.T., T.L. Cary, D.C. Volz, S.S. Walse, J.L. Ferry, and S.L. Klosterhaus (2004) Fipronil Effects on Estuarine Copepod (Amphiascus tenuiremis) Development, Fertility, and Reproduction: A Rapid Life-Cycle Assay in 96-Well Microplate Format Environ. Toxicol. Chem.23(1): 117-124 ","1064",null,"Technical grade fipronil (98.0% pure)","OK to use"]
["MEW_nonplant","1064-6",76,0.80851063829787229,"","Amphiascus tenuiremis ","Life cycle","17 day","LOEL","Fecundity: egg production","0.22ug/L","microinvertebrate","Arthropoda","Maxillopoda","Artificial seawater",25,"Chronic",8.3000000000000007,30,"Chandler,G.T., T.L. Cary, D.C. Volz, S.S. Walse, J.L. Ferry, and S.L. Klosterhaus (2004) Fipronil Effects on Estuarine Copepod (Amphiascus tenuiremis) Development, Fertility, and Reproduction: A Rapid Life-Cycle Assay in 96-Well Microplate Format Environ. Toxicol. Chem.23(1): 117-124 ","1064",null,"Technical grade fipronil (98.0% pure)","OK to use"]
["MEW_nonplant","1064-6",76,0.80851063829787229,"","Amphiascus tenuiremis ","Life cycle","17 day","LOEL","Egg extrusion time","0.16ug/L","Microinvertebrate","Arthropoda","Maxillopoda","Artificial seawater",25,"Chronic",8.3000000000000007,30,"Chandler,G.T., T.L. Cary, D.C. Volz, S.S. Walse, J.L. Ferry, and S.L. Klosterhaus (2004) Fipronil Effects on Estuarine Copepod (Amphiascus tenuiremis) Development, Fertility, and Reproduction: A Rapid Life-Cycle Assay in 96-Well Microplate Format Environ. Toxicol. Chem.23(1): 117-124 ","1064",null,"Technical grade fipronil (98.0% pure)","OK to use"]
["Freshwater/non-metal/non- plant","1065-1",68,0.74725274725274726,"","Aedes aegypti","4th instar larvae","24h","LC50","Mortality","24.8nM","Macroinvertebrate","Arthropoda","Insecta","Tap water","26 ± 1","Acute ","Not stated","N.A.","Chaton,P.F., P. Ravanel, J.C. Meyran, and M. Tissut (2001) The Toxicological Effects and Bioaccumulation of Fipronil in Larvae of the Mosquito Aedes aegypti in Aqueous Medium Pestic. Biochem. Physiol.69(3): 183-188","1065",null,"Fipronil 99.9% purity","OK to use"]
["Freshwater/non-metal/non- plant","1065-2",68,0.74725274725274726,"","Aedes aegypti","4th instar larvae","48 hr","LC50","Mortality","15.1nM","Macroinvertebrate","Arthropoda","Insecta","Tap water","26 ± 1","Acute ","Not stated","N.A.","Chaton,P.F., P. Ravanel, J.C. Meyran, and M. Tissut (2001) The Toxicological Effects and Bioaccumulation of Fipronil in Larvae of the Mosquito Aedes aegypti in Aqueous Medium Pestic. Biochem. Physiol.69(3): 183-188","1065",null,"Fipronil 99.9% purity","OK to use"]
["Freshwater/non-metal/non- plant","1065-3",68,0.74725274725274726,"\"Threshold\" value","Aedes aegypti","4th instar larvae","48 hr","LOEC","Mortality","5nM","Macroinvertebrate","Arthropoda","Insecta","Tap water","26 ± 1","Acute ","Not stated","N.A.","Chaton,P.F., P. Ravanel, J.C. Meyran, and M. Tissut (2001) The Toxicological Effects and Bioaccumulation of Fipronil in Larvae of the Mosquito Aedes aegypti in Aqueous Medium Pestic. Biochem. Physiol.69(3): 183-188","1065",null,"Fipronil 99.9% purity","OK to use"]
["Freshwater/non-metal/non- plant","1066-1",61,0.67032967032967028,"Highest concentration tested","Daphnia pulex","Not stated","48 hr","NOEC","Mortality",">2000nM","Microinvertebrate","Arthropoda","Branchiopoda","Dechlorinated tap water",25,"Acute ",7.5,"N.A.","Chaton,P.F., P. Ravanel, M. Tissut, and J.C. Meyran (2002) Toxicity and Bioaccumulation of Fipronil in the Nontarget Arthropodan Fauna Associated with Subalpine Mosquito Breeding Sites Ecotoxicol. Environ. Saf.52(1): 8-12 ","1066","NOEC >2000 nM (the concentration range may not have been high enough in this study). Therefore might be excluded.","Fipronil 99.9% purity","OK to use"]
["Freshwater/non-metal/non- plant","1066-2",61,0.67032967032967028,"","Acanthocyclops robustus","Not stated","48 hr","LC50","Mortality","194.2nM","Microinvertebrate","Arthropoda","Maxillopoda","Dechlorinated tap water",25,"Acute ",7.5,"N.A.","Chaton,P.F., P. Ravanel, M. Tissut, and J.C. Meyran (2002) Toxicity and Bioaccumulation of Fipronil in the Nontarget Arthropodan Fauna Associated with Subalpine Mosquito Breeding Sites Ecotoxicol. Environ. Saf.52(1): 8-12 ","1066",null,"Fipronil 99.9% purity","OK to use"]
["Freshwater/non-metal/non- plant","1066-3",61,0.67032967032967028,"","Diaptomus castor","Not stated","48 hr","LC50","Mortality","7.9nM","Microinvertebrate","Arthropoda","Branchiopoda","Dechlorinated tap water",25,"Acute ",7.5,"N.A.","Chaton,P.F., P. Ravanel, M. Tissut, and J.C. Meyran (2002) Toxicity and Bioaccumulation of Fipronil in the Nontarget Arthropodan Fauna Associated with Subalpine Mosquito Breeding Sites Ecotoxicol. Environ. Saf.52(1): 8-12 ","1066",null,"Fipronil 99.9% purity","OK to use"]
["Freshwater/non-metal/non- plant","1066-4",61,0.67032967032967028,"Highest concentration tested","Eucypris virens","Not stated","48 hr","NOEC","Mortality",">2000nM","Microinvertebrate","Arthropoda","\tOstracoda","Dechlorinated tap water",25,"Acute ",7.5,"N.A.","Chaton,P.F., P. Ravanel, M. Tissut, and J.C. Meyran (2002) Toxicity and Bioaccumulation of Fipronil in the Nontarget Arthropodan Fauna Associated with Subalpine Mosquito Breeding Sites Ecotoxicol. Environ. Saf.52(1): 8-12 ","1066","NOEC >2000 nM (the concentration range may not have been high enough in this study). Therefore might be excluded.","Fipronil 99.9% purity","OK to use"]
["Freshwater/non-metal/non- plant","1066-5",61,0.67032967032967028,"","Chaoborus crystallinus","Larvae","48 hr","LC50","Mortality","1478.5nM","Macroinvertebrate","Arthropoda","Insecta","Dechlorinated tap water",25,"Acute ",7.5,"N.A.","Chaton,P.F., P. Ravanel, M. Tissut, and J.C. Meyran (2002) Toxicity and Bioaccumulation of Fipronil in the Nontarget Arthropodan Fauna Associated with Subalpine Mosquito Breeding Sites Ecotoxicol. Environ. Saf.52(1): 8-12 ","1066",null,"Fipronil 99.9% purity","OK to use"]
["Freshwater/non-metal/non- plant","1066-6",61,0.67032967032967028,"","Chironomus annularius","Larvae","48 hr","LC50","Mortality","5.6nM","Macroinvertebrate","Arthropoda","Insecta","Dechlorinated tap water",25,"Acute ",7.5,"N.A.","Chaton,P.F., P. Ravanel, M. Tissut, and J.C. Meyran (2002) Toxicity and Bioaccumulation of Fipronil in the Nontarget Arthropodan Fauna Associated with Subalpine Mosquito Breeding Sites Ecotoxicol. Environ. Saf.52(1): 8-12 ","1066",null,"Fipronil 99.9% purity","OK to use"]
["Freshwater/non-metal/non- plant","1067-1",69,0.75824175824175821,"","Cyprinus carpio","fry","96hr","LC50","Mortality","0.428mg/L","Fish","Chordata","Actinopterygii","tap water","25.8–28.2","Acute ","7.35-7.6","N.A.","Gupta,S.K., A.K. Pal, N.P. Sahu, A.K. Jha, M.S. Akhtar, S.C. Mandal, P. Das, and A.K. Prusty (2013) Supplementation of Microbial Levan in the Diet of Cyprinus carpio Fry (Linnaeus, 1758) Exposed to Sublethal Toxicity of Fipronil: Effect on Growth and Metabolic Responses Fish Physiol. Biochem.39:1513-1524 2013","1067",null,"Technical grade fipronil (99.1% purity)","OK to use"]
["Freshwater/non-metal/non- plant","1067-2",69,0.75824175824175821,"Lowest conc. Tested, single concnetration tested","Cyprinus carpio","fry","60 day","LOEC","Growth inhibition: specific growth rate","0.0428mg/L","Fish","Chordata","Actinopterygii","tap water","25.8–28.2","Chronic","7.35-7.6","N.A.","Gupta,S.K., A.K. Pal, N.P. Sahu, A.K. Jha, M.S. Akhtar, S.C. Mandal, P. Das, and A.K. Prusty (2013) Supplementation of Microbial Levan in the Diet of Cyprinus carpio Fry (Linnaeus, 1758) Exposed to Sublethal Toxicity of Fipronil: Effect on Growth and Metabolic Responses Fish Physiol. Biochem.39:1513-1524 2013","1067",null,"Technical grade fipronil (99.1% purity)","OK to use"]
["Freshwater/non-metal/non- plant","1067-3",69,0.75824175824175821,"Lowest conc. Tested, single concnetration tested","Cyprinus carpio","fry","60 day","LOEC","Survival ","0.0428mg/L","Fish","Chordata","Actinopterygii","tap water","25.8–28.2","Chronic","7.35-7.6","N.A.","Gupta,S.K., A.K. Pal, N.P. Sahu, A.K. Jha, M.S. Akhtar, S.C. Mandal, P. Das, and A.K. Prusty (2013) Supplementation of Microbial Levan in the Diet of Cyprinus carpio Fry (Linnaeus, 1758) Exposed to Sublethal Toxicity of Fipronil: Effect on Growth and Metabolic Responses Fish Physiol. Biochem.39:1513-1524 2013","1067",null,"Technical grade fipronil (99.1% purity)","OK to use"]
["Freshwater/non-metal/non- plant","1067-JF",69,0.75824175824175821,"Lowest conc. Tested, single concnetration tested","Cyprinus carpio","fry","60 day","LOEC","Growth inhibition: weight gain","0.0428mg/L","Fish","Chordata","Actinopterygii","tap water","25.8–28.2","Chronic","7.35-7.6","N.A.","Gupta,S.K., A.K. Pal, N.P. Sahu, A.K. Jha, M.S. Akhtar, S.C. Mandal, P. Das, and A.K. Prusty (2013) Supplementation of Microbial Levan in the Diet of Cyprinus carpio Fry (Linnaeus, 1758) Exposed to Sublethal Toxicity of Fipronil: Effect on Growth and Metabolic Responses Fish Physiol. Biochem.39:1513-1524 2013","1067",null,"Technical grade fipronil (99.1% purity)","OK to use"]
["MEW_nonplant","1068-1",63,0.67021276595744683,"","Palaemonetes pugio","Larvae","96hr","LC50","Mortality","0.68ug/L","macroinvertebrate","Arthropoda","Malacostraca","Not stated",25,"Acute","Not stated",20,"Key,P.B., K.W. Chung, A.D. Opatkiewicz, E.F. Wirth, and M.H. Fulton (2003) Toxicity of the Insecticides Fipronil and Endosulfan to Selected Life Stages of the Grass Shrimp (Palaemonetes pugio) Bull. Environ. Contam. Toxicol.70(3): 533-540.","1068",null,"Purity not stated","Do not use"]
["MEW_nonplant","1068-2",63,0.67021276595744683,"","Palaemonetes pugio","Larvae","96hr","LOEC","Mortality","0.5ug/L","macroinvertebrate","Arthropoda","Malacostraca","Not stated",25,"Acute","Not stated",20,"Key,P.B., K.W. Chung, A.D. Opatkiewicz, E.F. Wirth, and M.H. Fulton (2003) Toxicity of the Insecticides Fipronil and Endosulfan to Selected Life Stages of the Grass Shrimp (Palaemonetes pugio) Bull. Environ. Contam. Toxicol.70(3): 533-540.","1068",null,"Purity not stated","Do not use"]
["MEW_nonplant","1068-3",63,0.67021276595744683,"","Palaemonetes pugio","Larvae","96hr","NOEC","Mortality","0.25ug/L","macroinvertebrate","Arthropoda","Malacostraca","Not stated",25,"Acute","Not stated",20,"Key,P.B., K.W. Chung, A.D. Opatkiewicz, E.F. Wirth, and M.H. Fulton (2003) Toxicity of the Insecticides Fipronil and Endosulfan to Selected Life Stages of the Grass Shrimp (Palaemonetes pugio) Bull. Environ. Contam. Toxicol.70(3): 533-540.","1068",null,"Purity not stated","Do not use"]
["MEW_nonplant","1068-4",63,0.67021276595744683,"Estimated on lowest conc which caused mortality","Palaemonetes pugio","Adult","96hr","NOEC","Mortality","<0.13ug/L","macroinvertebrate","Arthropoda","Malacostraca","Not stated",25,"Acute","Not stated",20,"Key,P.B., K.W. Chung, A.D. Opatkiewicz, E.F. Wirth, and M.H. Fulton (2003) Toxicity of the Insecticides Fipronil and Endosulfan to Selected Life Stages of the Grass Shrimp (Palaemonetes pugio) Bull. Environ. Contam. Toxicol.70(3): 533-540.","1068","Do Not Use - NOEC value not obtained, and this value is used as a LOEC already.","Not using","Do not use"]
["MEW_nonplant","1068-5",63,0.67021276595744683,"","Palaemonetes pugio","Adult","96hr","LOEC","Mortality","0.13ug/L","macroinvertebrate","Arthropoda","Malacostraca","Not stated",25,"Acute","Not stated",20,"Key,P.B., K.W. Chung, A.D. Opatkiewicz, E.F. Wirth, and M.H. Fulton (2003) Toxicity of the Insecticides Fipronil and Endosulfan to Selected Life Stages of the Grass Shrimp (Palaemonetes pugio) Bull. Environ. Contam. Toxicol.70(3): 533-540.","1068",null,"Purity not stated","Do not use"]
["MEW_nonplant","1068-6",63,0.67021276595744683,"","Palaemonetes pugio","Adult","96hr","LC50","Mortality","0.32ug/L","macroinvertebrate","Arthropoda","Malacostraca","Not stated",25,"Acute","Not stated",20,"Key,P.B., K.W. Chung, A.D. Opatkiewicz, E.F. Wirth, and M.H. Fulton (2003) Toxicity of the Insecticides Fipronil and Endosulfan to Selected Life Stages of the Grass Shrimp (Palaemonetes pugio) Bull. Environ. Contam. Toxicol.70(3): 533-540.","1068",null,"Purity not stated","Do not use"]
["MEW_nonplant","1068-7",63,0.67021276595744683,"","Palaemonetes pugio","stage VI embryo","96hr","LC50","Mortality",">512.0ug/L","macroinvertebrate","Arthropoda","Malacostraca","Not stated",27,"Acute","Not stated",20,"Key,P.B., K.W. Chung, A.D. Opatkiewicz, E.F. Wirth, and M.H. Fulton (2003) Toxicity of the Insecticides Fipronil and Endosulfan to Selected Life Stages of the Grass Shrimp (Palaemonetes pugio) Bull. Environ. Contam. Toxicol.70(3): 533-540.","1068","Do Not Use - LC50 value not obtained","Not using","Do not use"]
["MEW_nonplant","1068-8",63,0.67021276595744683,"","Palaemonetes pugio","stage VI embryo","96hr","LOEC","Mortality","32.0ug/L","macroinvertebrate","Arthropoda","Malacostraca","Not stated",27,"Acute","Not stated",20,"Key,P.B., K.W. Chung, A.D. Opatkiewicz, E.F. Wirth, and M.H. Fulton (2003) Toxicity of the Insecticides Fipronil and Endosulfan to Selected Life Stages of the Grass Shrimp (Palaemonetes pugio) Bull. Environ. Contam. Toxicol.70(3): 533-540.","1068",null,"Purity not stated","Do not use"]
["MEW_nonplant","1068-10",63,0.67021276595744683,"","Palaemonetes pugio","stage VI embryo","96hr","LOEC","Hatch time","32.0ug/L","macroinvertebrate","Arthropoda","Malacostraca","Not stated",27,"Acute","Not stated",20,"Key,P.B., K.W. Chung, A.D. Opatkiewicz, E.F. Wirth, and M.H. Fulton (2003) Toxicity of the Insecticides Fipronil and Endosulfan to Selected Life Stages of the Grass Shrimp (Palaemonetes pugio) Bull. Environ. Contam. Toxicol.70(3): 533-540.","1068",null,"Purity not stated","Do not use"]
["Freshwater/non-metal/non- plant","1069-1",75,0.82417582417582413,"","Ceriodaphnia dubia","3rd brood neonate <24hr","48 hrs","LC50","Mortality","17.7 ug/L","Microinvertebrate","Arthropoda","Branchiopoda","moderately hard water","24-26","Acute ","8.16-8.36","N.A.","Konwick,B.J., A.T. Fisk, A.W. Garrison, J.K. Avants, and M.C. Black (2005) Acute Enantioselective Toxicity of Fipronil and Its Desulfinyl Photoproduct to Ceriodaphnia dubia Environ. Toxicol. Chem.24(9): 2350-2355","1069",null,"Fipronil 98% pure","OK to use"]
["Freshwater/non-metal/non- plant","1069-JF",75,0.82417582417582413,"","Ceriodaphnia dubia","3rd brood neonate <24hr","48 hrs","LC50","Mortality","31.9ug/L","Microinvertebrate","Arthropoda","Branchiopoda","moderately hard water","24-26","Acute ","8.16-8.36","N.A.","Konwick,B.J., A.T. Fisk, A.W. Garrison, J.K. Avants, and M.C. Black (2005) Acute Enantioselective Toxicity of Fipronil and Its Desulfinyl Photoproduct to Ceriodaphnia dubia Environ. Toxicol. Chem.24(9): 2350-2355","1069","R- enantiomer","Fipronil 98% pure","OK to use"]
["Freshwater/non-metal/non- plant","1069-JF",75,0.82417582417582413,"","Ceriodaphnia dubia","3rd brood neonate <24hr","48 hrs","LC50","Mortality","10.3ug/L","Microinvertebrate","Arthropoda","Branchiopoda","moderately hard water","24-26","Acute ","8.16-8.36","N.A.","Konwick,B.J., A.T. Fisk, A.W. Garrison, J.K. Avants, and M.C. Black (2005) Acute Enantioselective Toxicity of Fipronil and Its Desulfinyl Photoproduct to Ceriodaphnia dubia Environ. Toxicol. Chem.24(9): 2350-2355","1069","S+ enantiomer","Fipronil 98% pure","OK to use"]
["Freshwater/non-metal/non- plant","1071-1",65,0.7142857142857143,"","Aedes albopictus MAmAal strain","4th instar larvae","24 hrs","LC50","Mortality","0.05 ppm ","Macroinvertebrate","Arthropoda","Insecta","Tap water",25,"Acute ","Not stated","N.A.","Liu,H., E.W. Cupp, A. Guo, and N. Liu (2004) Insecticide Resistance in Alabama and Florida Mosquito Strains of Aedes albopictus J. Med. Entomol.41(5): 946-952 ","1071",null,0.98,"OK to use"]
["Freshwater/non-metal/non- plant","1071-2",65,0.7142857142857143,"","Aedes albopictus MAmAal strain","4th instar larvae","24 hrs","LC90","Mortality","0.1 ppm ","Macroinvertebrate","Arthropoda","Insecta","Tap water",25,"Acute ","Not stated","N.A.","Liu,H., E.W. Cupp, A. Guo, and N. Liu (2004) Insecticide Resistance in Alabama and Florida Mosquito Strains of Aedes albopictus J. Med. Entomol.41(5): 946-952 ","1071","Do Not Use - LC90 too high.","Not using","Do not use"]
["Freshwater/non-metal/non- plant","1071-3",65,0.7142857142857143,"","Aedes albopictus HAmAal strain","4th instar larvae","24 hrs","LC50","Mortality","0.09 ppm ","Macroinvertebrate","Arthropoda","Insecta","Tap water",25,"Acute ","Not stated","N.A.","Liu,H., E.W. Cupp, A. Guo, and N. Liu (2004) Insecticide Resistance in Alabama and Florida Mosquito Strains of Aedes albopictus J. Med. Entomol.41(5): 946-952 ","1071",null,0.98,"OK to use"]
["Freshwater/non-metal/non- plant","1071-4",65,0.7142857142857143,"","Aedes albopictus HAmAal strain","4th instar larvae","24 hrs","LC90","Mortality","0.3ppm ","Macroinvertebrate","Arthropoda","Insecta","Tap water",25,"Acute ","Not stated","N.A.","Liu,H., E.W. Cupp, A. Guo, and N. Liu (2004) Insecticide Resistance in Alabama and Florida Mosquito Strains of Aedes albopictus J. Med. Entomol.41(5): 946-952 ","1071","Do Not Use - LC90 too high.","Not using","Do not use"]
["Freshwater/non-metal/non- plant","1071-5",65,0.7142857142857143,"","Aedes albopictus VBFmAal strain","4th instar larvae","24 hrs","LC50","Mortality","0.1ppm ","Macroinvertebrate","Arthropoda","Insecta","Tap water",25,"Acute ","Not stated","N.A.","Liu,H., E.W. Cupp, A. Guo, and N. Liu (2004) Insecticide Resistance in Alabama and Florida Mosquito Strains of Aedes albopictus J. Med. Entomol.41(5): 946-952 ","1071",null,0.98,"OK to use"]
["Freshwater/non-metal/non- plant","1071-6",65,0.7142857142857143,"","Aedes albopictus VBFmAal strain","4th instar larvae","24 hrs","LC90","Mortality","0.4ppm ","Macroinvertebrate","Arthropoda","Insecta","Tap water",25,"Acute ","Not stated","N.A.","Liu,H., E.W. Cupp, A. Guo, and N. Liu (2004) Insecticide Resistance in Alabama and Florida Mosquito Strains of Aedes albopictus J. Med. Entomol.41(5): 946-952 ","1071","Do Not Use - LC90 too high.","Not using","Do not use"]
["Freshwater/non-metal/non- plant","1071-7",65,0.7142857142857143,"","Aedes albopictus SFmAal strain","4th instar larvae","24 hrs","LC50","Mortality","0.1ppm ","Macroinvertebrate","Arthropoda","Insecta","Tap water",25,"Acute ","Not stated","N.A.","Liu,H., E.W. Cupp, A. Guo, and N. Liu (2004) Insecticide Resistance in Alabama and Florida Mosquito Strains of Aedes albopictus J. Med. Entomol.41(5): 946-952 ","1071",null,0.98,"OK to use"]
["Freshwater/non-metal/non- plant","1071-8",65,0.7142857142857143,"","Aedes albopictus SFmAal strain","4th instar larvae","24 hrs","LC90","Mortality","0.3ppm ","Macroinvertebrate","Arthropoda","Insecta","Tap water",25,"Acute ","Not stated","N.A.","Liu,H., E.W. Cupp, A. Guo, and N. Liu (2004) Insecticide Resistance in Alabama and Florida Mosquito Strains of Aedes albopictus J. Med. Entomol.41(5): 946-952 ","1071","Do Not Use - LC90 too high.","Not using","Do not use"]
["Freshwater/non-metal/non- plant","1071-9",65,0.7142857142857143,"","Aedes albopictus Ikaken strain","4th instar larvae","24 hrs","LC50","Mortality","0.03ppm ","Macroinvertebrate","Arthropoda","Insecta","Tap water",25,"Acute ","Not stated","N.A.","Liu,H., E.W. Cupp, A. Guo, and N. Liu (2004) Insecticide Resistance in Alabama and Florida Mosquito Strains of Aedes albopictus J. Med. Entomol.41(5): 946-952 ","1071",null,0.98,"OK to use"]
["Freshwater/non-metal/non- plant","1071-10",65,0.7142857142857143,"","Aedes albopictus Ikaken strain","4th instar larvae","24 hrs","LC90","Mortality","0.1ppm ","Macroinvertebrate","Arthropoda","Insecta","Tap water",25,"Acute ","Not stated","N.A.","Liu,H., E.W. Cupp, A. Guo, and N. Liu (2004) Insecticide Resistance in Alabama and Florida Mosquito Strains of Aedes albopictus J. Med. Entomol.41(5): 946-952 ","1071","Do Not Use - LC90 too high.","Not using","Do not use"]
["Freshwater/non-metal/non- plant","1072-1",65,0.7142857142857143,"","Culex quinqefasciatus VBFmCq strain","4th instar larvae","24 hrs","LC50","Mortality","0.04ppm ","Macroinvertebrate","Arthropoda","Insecta","Tap water",25,"Acute ","Not stated","N.A.","Liu,H., E.W. Cupp, K.M. Micher, A. Guo, and N. Liu (2004) Insecticide Resistance and Cross-Resistance in Alabama and Florida Strains of Culex quinquefaciatus J. Med. Entomol.41(3): 408-413 ","1072",null,0.98,"OK to use"]
["Freshwater/non-metal/non- plant","1072-2",65,0.7142857142857143,"","Culex quinqefasciatus VBFmCq strain","4th instar larvae","24 hrs","LC90","Mortality","0.2ppm ","Macroinvertebrate","Arthropoda","Insecta","Tap water",25,"Acute ","Not stated","N.A.","Liu,H., E.W. Cupp, K.M. Micher, A. Guo, and N. Liu (2004) Insecticide Resistance and Cross-Resistance in Alabama and Florida Strains of Culex quinquefaciatus J. Med. Entomol.41(3): 408-413 ","1072","Do Not Use - LC90 too high.","Not using","Do not use"]
["Freshwater/non-metal/non- plant","1072-3",65,0.7142857142857143,"","Culex quinqefasciatus HAmCq strain","4th instar larvae","24 hrs","LC50","Mortality","0.02ppm ","Macroinvertebrate","Arthropoda","Insecta","Tap water",25,"Acute ","Not stated","N.A.","Liu,H., E.W. Cupp, K.M. Micher, A. Guo, and N. Liu (2004) Insecticide Resistance and Cross-Resistance in Alabama and Florida Strains of Culex quinquefaciatus J. Med. Entomol.41(3): 408-413 ","1072",null,0.98,"OK to use"]
["Freshwater/non-metal/non- plant","1072-4",65,0.7142857142857143,"","Culex quinqefasciatus HAmCq strain","4th instar larvae","24 hrs","LC90","Mortality","0.1ppm ","Macroinvertebrate","Arthropoda","Insecta","Tap water",25,"Acute ","Not stated","N.A.","Liu,H., E.W. Cupp, K.M. Micher, A. Guo, and N. Liu (2004) Insecticide Resistance and Cross-Resistance in Alabama and Florida Strains of Culex quinquefaciatus J. Med. Entomol.41(3): 408-413 ","1072","Do Not Use - LC90 too high.","Not using","Do not use"]
["Freshwater/non-metal/non- plant","1072-5",65,0.7142857142857143,"","Culex quinquefasciatus MAmCq strain","4th instar larvae","24 hrs","LC50","Mortality","0.06ppm ","Macroinvertebrate","Arthropoda","Insecta","Tap water",25,"Acute ","Not stated","N.A.","Liu,H., E.W. Cupp, K.M. Micher, A. Guo, and N. Liu (2004) Insecticide Resistance and Cross-Resistance in Alabama and Florida Strains of Culex quinquefaciatus J. Med. Entomol.41(3): 408-413 ","1072",null,0.98,"OK to use"]
["Freshwater/non-metal/non- plant","1072-6",65,0.7142857142857143,"","Culex quinquefasciatus MAmCq strain","4th instar larvae","24 hrs","LC90","Mortality","0.2ppm ","Macroinvertebrate","Arthropoda","Insecta","Tap water",25,"Acute ","Not stated","N.A.","Liu,H., E.W. Cupp, K.M. Micher, A. Guo, and N. Liu (2004) Insecticide Resistance and Cross-Resistance in Alabama and Florida Strains of Culex quinquefaciatus J. Med. Entomol.41(3): 408-413 ","1072","Do Not Use - LC90 too high.","Not using","Do not use"]
["Freshwater/non-metal/non- plant","1072-7",65,0.7142857142857143,"","Culex quinqefasciatus S-Lab strain","4th instar larvae","24 hrs","LC50","Mortality","0.004ppm ","Macroinvertebrate","Arthropoda","Insecta","Tap water",25,"Acute ","Not stated","N.A.","Liu,H., E.W. Cupp, K.M. Micher, A. Guo, and N. Liu (2004) Insecticide Resistance and Cross-Resistance in Alabama and Florida Strains of Culex quinquefaciatus J. Med. Entomol.41(3): 408-413 ","1072",null,0.98,"OK to use"]
["Freshwater/non-metal/non- plant","1072-8",65,0.7142857142857143,"","Culex quinqefasciatus S-Lab strain","4th instar larvae","24 hrs","LC90","Mortality","0.02ppm ","Macroinvertebrate","Arthropoda","Insecta","Tap water",25,"Acute ","Not stated","N.A.","Liu,H., E.W. Cupp, K.M. Micher, A. Guo, and N. Liu (2004) Insecticide Resistance and Cross-Resistance in Alabama and Florida Strains of Culex quinquefaciatus J. Med. Entomol.41(3): 408-413 ","1072","Do Not Use - LC90 too high.","Not using","Do not use"]
["Freshwater/non-metal/non- plant","1073-1",71,0.78021978021978022,"","Oryzias latipes","<120 days post hatch","96hr","LC50","Mortality","94.2ug/L","Fish","Chordata","Actinopterygii","Dechlorinated tap water","25±2","Acute ","Not stated","N.A.","Nillos,M.G., K. Lin, J. Gan, S. Bondarenko, and D. Schlenk (2009) Enantioselectivity in Fipronil Aquatic Toxicity and Degradation Environ. Toxicol. Chem.28(9): 1825-1833","1073",null,"Technical standard 98.9%","OK to use"]
["Freshwater/non-metal/non- plant","1073-JF",71,0.78021978021978022,null,"Oryzias latipes","<120 days post hatch","96hr","LC50","Mortality","98.3 ug/L","Fish","Chordata","Actinopterygii","Dechlorinated tap water","25±2","Acute ","Not stated","N.A.","Nillos,M.G., K. Lin, J. Gan, S. Bondarenko, and D. Schlenk (2009) Enantioselectivity in Fipronil Aquatic Toxicity and Degradation Environ. Toxicol. Chem.28(9): 1825-1833","1073","R- enantiomer","Technical standard 98.9%","OK to use"]
["Freshwater/non-metal/non- plant","1073-JF",71,0.78021978021978022,null,"Oryzias latipes","<120 days post hatch","96hr","LC50","Mortality","95.4 ug/L","Fish","Chordata","Actinopterygii","Dechlorinated tap water","25±2","Acute ","Not stated","N.A.","Nillos,M.G., K. Lin, J. Gan, S. Bondarenko, and D. Schlenk (2009) Enantioselectivity in Fipronil Aquatic Toxicity and Degradation Environ. Toxicol. Chem.28(9): 1825-1833","1073","S+ enantiomer","Technical standard 98.9%","OK to use"]
["Freshwater/non-metal/non- plant","1073-2",71,0.78021978021978022,"","Oncorhynchus mykiss","<120 days post hatch","24hr","EC50","Cell viability","26.7ug/mL","Fish","Chordata","Actinopterygii","Dechlorinated tap water",13,"Acute ","Not stated","N.A.","Nillos,M.G., K. Lin, J. Gan, S. Bondarenko, and D. Schlenk (2009) Enantioselectivity in Fipronil Aquatic Toxicity and Degradation Environ. Toxicol. Chem.28(9): 1825-1833","1073","Do Not Use - Fish cytotoxicity","Not using","Do not use"]
["Freshwater/non-metal/non- plant","1074-1",69,0.75824175824175821,null,"Simulium vittatum","5th instar larvae","48 hr","LC50","Mortality","0.19ug/L","Macroinvertebrate","Arthropoda","Insecta","moderately hard reconstituted water","19.9 - 20.2","Acute ","7.3 - 7.7","N.A.","Overmyer,J.P., B.N. Mason, and K.L. Armbrust (2005) Acute Toxicity of Imidacloprid and Fipronil to a Nontarget Aquatic Insect, Simulium vittatum Zetterstedt Cytospecies IS-7 Bull. Environ. Contam. Toxicol.74(5): 872-879","1074",null,"Analytical grade standards, ≥98% pure","OK to use"]
["Freshwater/non-metal/non- plant","1074-1",69,0.75824175824175821,null,"Simulium vittatum","5th instar larvae","48 hr","LC50","Mortality","0.19ug/L","Macroinvertebrate","Arthropoda","Insecta","moderately hard reconstituted water","19.9 - 20.2","Acute ","7.3 - 7.7","N.A.","Overmyer,J.P., B.N. Mason, and K.L. Armbrust (2005) Acute Toxicity of Imidacloprid and Fipronil to a Nontarget Aquatic Insect, Simulium vittatum Zetterstedt Cytospecies IS-7 Bull. Environ. Contam. Toxicol.74(5): 872-879","1074",null,"Analytical grade standards, ≥98% pure","OK to use"]
["Freshwater/non-metal/non- plant","1074-1",69,0.75824175824175821,null,"Simulium vittatum","5th instar larvae","48 hr","LC50","Mortality","0.29ug/L","Macroinvertebrate","Arthropoda","Insecta","moderately hard reconstituted water","19.9 - 20.2","Acute ","7.3 - 7.7","N.A.","Overmyer,J.P., B.N. Mason, and K.L. Armbrust (2005) Acute Toxicity of Imidacloprid and Fipronil to a Nontarget Aquatic Insect, Simulium vittatum Zetterstedt Cytospecies IS-7 Bull. Environ. Contam. Toxicol.74(5): 872-879","1074",null,"Analytical grade standards, ≥98% pure","OK to use"]
["Freshwater/non-metal/non- plant","1075-1",72,0.79120879120879117,"Note: Control mortality not stated for larval tests, therefore fails question 7 which states the data cannot be used.","Aedes aegypti","1st instar larvae","24hr","LC50","Mortality","1.2ppb","Macroinvertebrate","Arthropoda","Insecta","Deionised water",27,"Acute ","Not stated","N.A.","Pridgeon,J.W., J.J. Becnel, G.G. Clark, and K.J. Linthicum (2009) A High-Throughput Screening Method to Identify Potential Pesticides for Mosquito Control J. Med. Entomol.46(2): 335-341. ","1075",null,"Technical grade","OK to use"]
["Freshwater/non-metal/non- plant","1075-2",72,0.79120879120879117,"","Aedes aegypti","1st instar larvae","24hr","LC95","Mortality","2.8ppb","Macroinvertebrate","Arthropoda","Insecta","Deionised water",27,"Acute ","Not stated","N.A.","Pridgeon,J.W., J.J. Becnel, G.G. Clark, and K.J. Linthicum (2009) A High-Throughput Screening Method to Identify Potential Pesticides for Mosquito Control J. Med. Entomol.46(2): 335-341. ","1075","Do Not Use - LC95 too high.","Not using","Do not use"]
["Freshwater/non-metal/non- plant","1075-3",72,0.79120879120879117,"","Aedes aegypti","5-7d adult","24hr","LC50","Mortality","0.00000046ug/mg","Macroinvertebrate","Arthropoda","Insecta","Deionised water",26,"Acute ","Not stated","N.A.","Pridgeon,J.W., J.J. Becnel, G.G. Clark, and K.J. Linthicum (2009) A High-Throughput Screening Method to Identify Potential Pesticides for Mosquito Control J. Med. Entomol.46(2): 335-341. ","1075","Do Not Use - Adult insect not aquatic","Not using","Do not use"]
["Freshwater/non-metal/non- plant","1076-1",73,0.80219780219780223,"","Ceriodaphnia dubia","Not stated","96 hrs","LC50","Mortality","143.43ug/L","Microinvertebrate","Arthropoda","Branchiopoda","moderate hard synthetic water","22.0-22.4","Acute ","7.78-8.33","N.A.","Qin,G., S.M. Presley, T.A. Anderson, W. Gao, and J.D. Maul (2011) Effects of Predator Cues on Pesticide Toxicity: Toward an Understanding of the Mechanism of the Interaction Environ. Toxicol. Chem.30(8): 1926-1934","1076",null,"Fipronil 98.7%","OK to use"]
["Freshwater/non-metal/plant","1077-1 ",75,0.85227272727272729,"","Scenedesmus obliguus","logarithmic growth phase","72 hour","EC50","Growth inhibition: cell count","0.54mg/L","Microalga","Chlorophyta","AAP","21-24 ± 2","21-24 ± 2","Chronic",7.5,"N.A.","Qu,H., R.X. Ma, D.H. Liu, P. Wang, L.D. Huang, X.X. Qiu, and Z.Q. Zhou (2014) Enantioselective Toxicity and Degradation of the Chiral Insecticide Fipronil in Scenedesmus obliguus Suspension System Environ. Toxicol. Chem.33(11): 2516-2521","1077",null,">96.5% purity","OK to use"]
["Freshwater/non-metal/plant","1077_JF",75,0.85227272727272729,null,"Scenedesmus obliguus","logarithmic growth phase","72 hour","EC50","Growth inhibition: cell count","0.29 mg/L","Microalga","Chlorophyta","AAP","21-24 ± 2","21-24 ± 2","Chronic",7.5,"N.A.","Qu,H., R.X. Ma, D.H. Liu, P. Wang, L.D. Huang, X.X. Qiu, and Z.Q. Zhou (2014) Enantioselective Toxicity and Degradation of the Chiral Insecticide Fipronil in Scenedesmus obliguus Suspension System Environ. Toxicol. Chem.33(11): 2516-2521","1077","R- enantiomer",">96.5% purity","OK to use"]
["Freshwater/non-metal/plant","1077_JF",75,0.85227272727272729,null,"Scenedesmus obliguus","logarithmic growth phase","72 hour","EC50","Growth inhibition: cell count","1.5 mg/L","Microalga","Chlorophyta","AAP","21-24 ± 2","21-24 ± 2","Chronic",7.5,"N.A.","Qu,H., R.X. Ma, D.H. Liu, P. Wang, L.D. Huang, X.X. Qiu, and Z.Q. Zhou (2014) Enantioselective Toxicity and Degradation of the Chiral Insecticide Fipronil in Scenedesmus obliguus Suspension System Environ. Toxicol. Chem.33(11): 2516-2521","1077","S+ enantiomer",">96.5% purity","OK to use"]
["Freshwater/non-metal/plant","1077-2",75,0.85227272727272729,"","Scenedesmus obliguus","logarithmic growth phase","72 hour","LOEC","Chlorophyll a conc. ","0.2mg/L","Microalga","Chlorophyta","AAP","21-24 ± 2","21-24 ± 2","Chronic",7.5,"N.A.","Qu,H., R.X. Ma, D.H. Liu, P. Wang, L.D. Huang, X.X. Qiu, and Z.Q. Zhou (2014) Enantioselective Toxicity and Degradation of the Chiral Insecticide Fipronil in Scenedesmus obliguus Suspension System Environ. Toxicol. Chem.33(11): 2516-2521","1077","Do Not Use - Not correlated with cell count/growth - In regards to photosynthetic activity","Not using","Do not use"]
["Freshwater/non-metal/plant","1077-3",75,0.85227272727272729,"","Scenedesmus obliguus","logarithmic growth phase","72 hour","LOEC","Chlorophyll b conc. ","0.2mg/L","Microalga","Chlorophyta","AAP","21-24 ± 2","21-24 ± 2","Chronic",7.5,"N.A.","Qu,H., R.X. Ma, D.H. Liu, P. Wang, L.D. Huang, X.X. Qiu, and Z.Q. Zhou (2014) Enantioselective Toxicity and Degradation of the Chiral Insecticide Fipronil in Scenedesmus obliguus Suspension System Environ. Toxicol. Chem.33(11): 2516-2521","1077","Do Not Use - Not correlated with cell count/growth - In regards to photosynthetic activity","Not using","Do not use"]
["Freshwater/non-metal/plant","1077-4",75,0.85227272727272729,"","Scenedesmus obliguus","logarithmic growth phase","72 hour","LOEC","cartenoid conc. ","0.2mg/L","Microalga","Chlorophyta","AAP","21-24 ± 2","21-24 ± 2","Chronic",7.5,"N.A.","Qu,H., R.X. Ma, D.H. Liu, P. Wang, L.D. Huang, X.X. Qiu, and Z.Q. Zhou (2014) Enantioselective Toxicity and Degradation of the Chiral Insecticide Fipronil in Scenedesmus obliguus Suspension System Environ. Toxicol. Chem.33(11): 2516-2521","1077","Do Not Use - Not correlated with cell count/growth - In regards to photosynthetic activity","Not using","Do not use"]
["Freshwater/non-metal/non- plant","1079-1",75,0.82417582417582413,"","Procambarus clarkii","6-9cm length","96 hour","LC50","Mortality","14.3ug/L","Macroinvertebrate","Arthropoda","Malacostraca","deinonised reconstituted water",25,"Acute ",8.1,"N.A.","Schlenk,D., D.B. Huggett, J. Allgood, E. Bennett, J. Rimoldi, A.B. Beeler, D. Block, A.W. Holder, R. Hovinga, and P. Bed (2001) Toxicity of Fipronil and Its Degradation Products to Procambarus sp.: Field and Laboratory Studies Arch. Environ. Contam. Toxicol.41(3): 325-332","1079",null,"98% pure","OK to use"]
["Freshwater/non-metal/non- plant","1079-2",75,0.82417582417582413,"","Procambarus zonangulus","6-9cm length","96 hour","LC50","Mortality","19.5ug/L","Macroinvertebrate","Arthropoda","Malacostraca","deinonised reconstituted water",25,"Acute ",8.1,"N.A.","Schlenk,D., D.B. Huggett, J. Allgood, E. Bennett, J. Rimoldi, A.B. Beeler, D. Block, A.W. Holder, R. Hovinga, and P. Bed (2001) Toxicity of Fipronil and Its Degradation Products to Procambarus sp.: Field and Laboratory Studies Arch. Environ. Contam. Toxicol.41(3): 325-332","1079",null,"98% pure","OK to use"]
["MEW_nonplant","1080-1",49,0.53846153846153844,"","Danio rerio","embryo","5 day","LOEC","Immobilisation",">0.33mg/L","Fish","Chordata","Actinopterygii","artificial system water",28.5,"Acute ","7.0–7.4","1500 uS/cm.","Stehr,C.M., T.L. Linbo, J.P. Incardona, and N.L. Scholz (2006) The Developmental Neurotoxicity of Fipronil: Notochord Degeneration and Locomotor Defects in Zebrafish Embryos and Larvae Toxicol. Sci.92(1): 270-278","1080","Do Not Use - Use the QCQC'd version of this entry below","Not using","Do not use"]
["MEW_nonplant","1080-2",49,0.53846153846153844,"","Danio rerio","embryo","5 day","LOEC","Development: body length",">0.33mg/L","Fish","Chordata","Actinopterygii","artificial system water",28.5,"Acute ","7.0–7.4","1501 uS/cm.","Stehr,C.M., T.L. Linbo, J.P. Incardona, and N.L. Scholz (2006) The Developmental Neurotoxicity of Fipronil: Notochord Degeneration and Locomotor Defects in Zebrafish Embryos and Larvae Toxicol. Sci.92(1): 270-278","1080","Do Not Use - Use the QCQC'd version of this entry below","Not using","Do not use"]
["MEW_nonplant","1080-3",49,0.53846153846153844,"","Danio rerio","embryo","5 day","EC50","Development","0.37uM","Fish","Chordata","Actinopterygii","artificial system water",28.5,"Acute ","7.0–7.4","1502 uS/cm.","Stehr,C.M., T.L. Linbo, J.P. Incardona, and N.L. Scholz (2006) The Developmental Neurotoxicity of Fipronil: Notochord Degeneration and Locomotor Defects in Zebrafish Embryos and Larvae Toxicol. Sci.92(1): 270-278","1080","Do Not Use - Use the QCQC'd version of this entry below","Not using","Do not use"]
["MEW_nonplant","1080-4",49,0.53846153846153844,"","Danio rerio","embryo","5 day","LOEC","Mortality","11uM","Fish","Chordata","Actinopterygii","artificial system water",28.5,"Acute ","7.0–7.4","1503 uS/cm.","Stehr,C.M., T.L. Linbo, J.P. Incardona, and N.L. Scholz (2006) The Developmental Neurotoxicity of Fipronil: Notochord Degeneration and Locomotor Defects in Zebrafish Embryos and Larvae Toxicol. Sci.92(1): 270-278","1080","Do Not Use - Use the QCQC'd version of this entry below","Not using","Do not use"]
["Freshwater/non-metal/non- plant","1081-1",74,0.81318681318681318,"","Simocephalus elizabethae","neonate unfed","48 hr","LC50","Mortality","11.13ug/L","Microinvertebrate","Arthropoda","Branchiopoda","Martins rearing solution/thiamine hydrochloride","25±1","Acute ","Not stated","N.A.","Stevens,M.M., A.S. Burdett, E.M. Mudford, S. Helliwell, and G. Doran (2011) The Acute Toxicity of Fipronil to Two Non-Target Invertebrates Associated with Mosquito Breeding Sites in Australia Acta Trop.117(2): 125-130","1081",null,"Technical fipronil 95% purity","OK to use"]
["Freshwater/non-metal/non- plant","1081-2",74,0.81318681318681318,"","Simocephalus elizabethae","neonate unfed","48 hr","LC90","Mortality","193.59ug/L","Microinvertebrate","Arthropoda","Branchiopoda","Martins rearing solution/thiamine hydrochloride","25±1","Acute ","Not stated","N.A.","Stevens,M.M., A.S. Burdett, E.M. Mudford, S. Helliwell, and G. Doran (2011) The Acute Toxicity of Fipronil to Two Non-Target Invertebrates Associated with Mosquito Breeding Sites in Australia Acta Trop.117(2): 125-130","1081","Do Not Use - LC90 too high.","Not using","Do not use"]
["Freshwater/non-metal/non- plant","1081-3",74,0.81318681318681318,"","Simocephalus elizabethae","neonate fed","48 hr","LC50","Mortality","14.11ug/L","Microinvertebrate","Arthropoda","Branchiopoda","Martins rearing solution/thiamine hydrochloride","25±1","Acute ","Not stated","N.A.","Stevens,M.M., A.S. Burdett, E.M. Mudford, S. Helliwell, and G. Doran (2011) The Acute Toxicity of Fipronil to Two Non-Target Invertebrates Associated with Mosquito Breeding Sites in Australia Acta Trop.117(2): 125-130","1081",null,"Technical fipronil 95% purity","OK to use"]
["Freshwater/non-metal/non- plant","1081-4",74,0.81318681318681318,"","Simocephalus elizabethae","neonate fed","48 hr","LC90","Mortality","60.43 ug/L","Microinvertebrate","Arthropoda","Branchiopoda","Martins rearing solution/thiamine hydrochloride","25±1","Acute ","Not stated","N.A.","Stevens,M.M., A.S. Burdett, E.M. Mudford, S. Helliwell, and G. Doran (2011) The Acute Toxicity of Fipronil to Two Non-Target Invertebrates Associated with Mosquito Breeding Sites in Australia Acta Trop.117(2): 125-130","1081","Do Not Use - LC90 too high.","Not using","Do not use"]
["Freshwater/non-metal/non- plant","1081-5",74,0.81318681318681318,"","Polypedilum nubiferum","larvae 4th instar unfed","48 hr","LC50","Mortality","1.00ug/L","macroinvertebrate","Arthropoda","Insecta","Martins rearing solution/thiamine hydrochloride","25±1","Acute ","Not stated","N.A.","Stevens,M.M., A.S. Burdett, E.M. Mudford, S. Helliwell, and G. Doran (2011) The Acute Toxicity of Fipronil to Two Non-Target Invertebrates Associated with Mosquito Breeding Sites in Australia Acta Trop.117(2): 125-130","1081",null,"Technical fipronil 95% purity","OK to use"]
["Freshwater/non-metal/non- plant","1081-6",74,0.81318681318681318,"","Polypedilum nubiferum","larvae 4th instar unfed","48 hr","LC90","Mortality","3.41ug/L","macroinvertebrate","Arthropoda","Insecta","Martins rearing solution/thiamine hydrochloride","25±1","Acute ","Not stated","N.A.","Stevens,M.M., A.S. Burdett, E.M. Mudford, S. Helliwell, and G. Doran (2011) The Acute Toxicity of Fipronil to Two Non-Target Invertebrates Associated with Mosquito Breeding Sites in Australia Acta Trop.117(2): 125-130","1081","Do Not Use - LC90 too high.","Not using","Do not use"]
["Freshwater/non-metal/non- plant","1081-7",74,0.81318681318681318,"","Polypedilum nubiferum","larvae 4th instar fed","48 hr","LC50","Mortality","2.18ug/L","macroinvertebrate","Arthropoda","Insecta","Martins rearing solution/thiamine hydrochloride","25±1","Acute ","Not stated","N.A.","Stevens,M.M., A.S. Burdett, E.M. Mudford, S. Helliwell, and G. Doran (2011) The Acute Toxicity of Fipronil to Two Non-Target Invertebrates Associated with Mosquito Breeding Sites in Australia Acta Trop.117(2): 125-130","1081",null,"Technical fipronil 95% purity","OK to use"]
["Freshwater/non-metal/non- plant","1081-8",74,0.81318681318681318,"","Polypedilum nubiferum","larvae 4th instar fed","48 hr","LC90","Mortality","4.23ug/L","macroinvertebrate","Arthropoda","Insecta","Martins rearing solution/thiamine hydrochloride","25±1","Acute ","Not stated","N.A.","Stevens,M.M., A.S. Burdett, E.M. Mudford, S. Helliwell, and G. Doran (2011) The Acute Toxicity of Fipronil to Two Non-Target Invertebrates Associated with Mosquito Breeding Sites in Australia Acta Trop.117(2): 125-130","1081","Do Not Use - LC90 too high.","Not using","Do not use"]
["Freshwater/non-metal/non- plant","1082-1",60,0.65934065934065933,"","Oryzias latipes","larvae","28 days","LOEC","growth: body length","30ug/L","Fish","Chordata","Actinopterygii","Dechlorinated tap water","25±1","Chronic","Not stated","N.A.","Sun,L., R. Jin, Z. Peng, Q. Zhou, H. Qian, and Z. Fu (2014) Effects of Trilostane and Fipronil on the Reproductive Axis in an Early Life Stage of the Japanese Medaka (Oryzias latipes) Ecotoxicology23(6): 1044-1054 ","1082",null,"98.0% purity","OK to use"]
["Freshwater/non-metal/non- plant","1082-HA",60,0.65934065934065933,"","Oryzias latipes","larvae","28 days","NOEC","growth: body length","10 ug/L","Fish","Chordata","Actinopterygii","Dechlorinated tap water","25±1","Chronic","Not stated","N.A.","Sun,L., R. Jin, Z. Peng, Q. Zhou, H. Qian, and Z. Fu (2014) Effects of Trilostane and Fipronil on the Reproductive Axis in an Early Life Stage of the Japanese Medaka (Oryzias latipes) Ecotoxicology23(6): 1044-1055",1082,null,"98.0% purity","OK to use"]
["Freshwater/non-metal/non- plant","1082-HA",60,0.65934065934065933,"Highest concentration tested","Oryzias latipes","larvae","28 days","NOEC","Growth: body weight","30 ug/L","Fish","Chordata","Actinopterygii","Dechlorinated tap water","25±1","Chronic","Not stated","N.A.","Sun,L., R. Jin, Z. Peng, Q. Zhou, H. Qian, and Z. Fu (2014) Effects of Trilostane and Fipronil on the Reproductive Axis in an Early Life Stage of the Japanese Medaka (Oryzias latipes) Ecotoxicology23(6): 1044-1056",1082,null,"98.0% purity","OK to use"]
["Freshwater/non-metal/non- plant","1083-1",40,0.43956043956043955,"","Aedes aegypti","larvae","24hr","LOEC","Mortality","100uM","Macroinvertebrate","Arthropoda","Insecta","deionised sterile water","Not stated","Acute ","Not stated","N.A.","Tsikolia,M., U.R. Bernier, M.R. Coy, K.C. Chalaire, J.J. Becnel, N.M. Agramonte, N. Tabanca, D.E. Wedge, G.G. Clark, K.J (2013) Insecticidal, Repellent and Fungicidal Properties of Novel Trifluoromethylphenyl Amides Pestic. Biochem. Physiol.107(1): 138-147 ","1083","Do Not Use - Failed QAQC","Not using","Do not use"]
["Freshwater/non-metal/non- plant","1083-2",40,0.43956043956043955,"","Aedes aegypti","larvae","48 hr","LOEC","Mortality","100uM","Macroinvertebrate","Arthropoda","Insecta","deionised sterile water","Not stated","Acute ","Not stated","N.A.","Tsikolia,M., U.R. Bernier, M.R. Coy, K.C. Chalaire, J.J. Becnel, N.M. Agramonte, N. Tabanca, D.E. Wedge, G.G. Clark, K.J (2013) Insecticidal, Repellent and Fungicidal Properties of Novel Trifluoromethylphenyl Amides Pestic. Biochem. Physiol.107(1): 138-147 ","1083","Do Not Use - Failed QAQC","Not using","Do not use"]
["Freshwater/non-metal/non- plant","1083-3",40,0.43956043956043955,"","Aedes aegypti","larvae","72 hrs","LOEC","Mortality","100uM","Macroinvertebrate","Arthropoda","Insecta","deionised sterile water","Not stated","Acute ","Not stated","N.A.","Tsikolia,M., U.R. Bernier, M.R. Coy, K.C. Chalaire, J.J. Becnel, N.M. Agramonte, N. Tabanca, D.E. Wedge, G.G. Clark, K.J (2013) Insecticidal, Repellent and Fungicidal Properties of Novel Trifluoromethylphenyl Amides Pestic. Biochem. Physiol.107(1): 138-147 ","1083","Do Not Use - Failed QAQC","Not using","Do not use"]
["Freshwater/non-metal/non- plant","1083-4",58,0.68100000000000005,"","Aedes aegypti","adult","24h","LD50","Mortality","0.787x10^-4 nM","Macroinvertebrate","Arthropoda","Insecta","deionised sterile water",26,"Acute ","Not stated","N.A.","Tsikolia,M., U.R. Bernier, M.R. Coy, K.C. Chalaire, J.J. Becnel, N.M. Agramonte, N. Tabanca, D.E. Wedge, G.G. Clark, K.J (2013) Insecticidal, Repellent and Fungicidal Properties of Novel Trifluoromethylphenyl Amides Pestic. Biochem. Physiol.107(1): 138-147 ","1083","Do Not Use - Adult insect not aquatic","Not using","Do not use"]
["Freshwater/non-metal/non- plant","1083-5",62,0.68131868131868134,"","Aedes aegypti","1st instar larvae","24h","LC50","Mortality","13.55nM","Macroinvertebrate","Arthropoda","Insecta","deionised sterile water",26,"Acute ","Not stated","N.A.","Tsikolia,M., U.R. Bernier, M.R. Coy, K.C. Chalaire, J.J. Becnel, N.M. Agramonte, N. Tabanca, D.E. Wedge, G.G. Clark, K.J (2013) Insecticidal, Repellent and Fungicidal Properties of Novel Trifluoromethylphenyl Amides Pestic. Biochem. Physiol.107(1): 138-147 ","1083",null,"Purity 97.5%","OK to use"]
["MEW_nonplant","1084-1",59,0.62765957446808507,"","Palaemonetes pugio","adult","45 day","LOEC","Mortality","200ng/L","Macroinvertebrate","Arthropoda","Malacostraca","filtered seawater",23.2,"Chronic",8,20,"Volz,D.C., E.F. Wirth, M.H. Fulton, G.I. Scott, E. Strozier, D.S. Block, J.L. Ferry, S.S. Walse, and G.T. Chandler (2003) Effects of Fipronil and Chlorpyrifos on Endocrine-Related Endpoints in Female Grass Shrimp (Palaemonetes pugio) Bull. Environ. Contam. Toxicol.71(3): 497-503","1084","Do Not Use - Use the QCQC'd version of this entry below","Not using","Do not use"]
["MEW_nonplant","1084-2",59,0.62765957446808507,"","Palaemonetes pugio","Gravid female","45 day","NOEC","Growth: length","200ng/L","Macroinvertebrate","Arthropoda","Malacostraca","filtered seawater",23.2,"Chronic",8,20,"Volz,D.C., E.F. Wirth, M.H. Fulton, G.I. Scott, E. Strozier, D.S. Block, J.L. Ferry, S.S. Walse, and G.T. Chandler (2003) Effects of Fipronil and Chlorpyrifos on Endocrine-Related Endpoints in Female Grass Shrimp (Palaemonetes pugio) Bull. Environ. Contam. Toxicol.71(3): 497-503","1084","Do Not Use - Use the QCQC'd version of this entry below","Not using","Do not use"]
["MEW_nonplant","1084-3",59,0.62765957446808507,null,"Palaemonetes pugio","Gravid female","45 day","NOEC","Growth: weight","200ng/L","Macroinvertebrate","Arthropoda","Malacostraca","filtered seawater",23.2,"Chronic",8,20,"Volz,D.C., E.F. Wirth, M.H. Fulton, G.I. Scott, E. Strozier, D.S. Block, J.L. Ferry, S.S. Walse, and G.T. Chandler (2003) Effects of Fipronil and Chlorpyrifos on Endocrine-Related Endpoints in Female Grass Shrimp (Palaemonetes pugio) Bull. Environ. Contam. Toxicol.71(3): 497-503","1084","Do Not Use - Use the QCQC'd version of this entry below","Not using","Do not use"]
["MEW_nonplant","1084-4",59,0.62765957446808507,"","Palaemonetes pugio","Gravid female","45 day","NOEC","Reproduction success","200ng/L","Macroinvertebrate","Arthropoda","Malacostraca","filtered seawater",23.2,"Chronic",8,20,"Volz,D.C., E.F. Wirth, M.H. Fulton, G.I. Scott, E. Strozier, D.S. Block, J.L. Ferry, S.S. Walse, and G.T. Chandler (2003) Effects of Fipronil and Chlorpyrifos on Endocrine-Related Endpoints in Female Grass Shrimp (Palaemonetes pugio) Bull. Environ. Contam. Toxicol.71(3): 497-503","1084","Do Not Use - Use the QCQC'd version of this entry below","Not using","Do not use"]
["Freshwater/non-metal/non- plant","1085-1",49,0.53846153846153844,"","Danio rerio","embryo","120 h","LOEC","mobility: swim speed","10ug/L","Fish","Chordata","Actinopterygii","essential medium","28 ± 1","Acute ","Not stated","N.A.","Wang,C., Y. Qian, X. Zhang, F. Chen, Q. Zhang, Z. Li, and M. Zhao (2016) A Metabolomic Study of Fipronil for the Anxiety-Like Behavior in Zebrafish Larvae at Environmentally Relevant Levels Environ. Pollut.211:252-258","1085","Do Not Use - Use the QCQC'd version of this entry below","Not using","Do not use"]
["Freshwater/non-metal/non- plant","1085-2",49,0.53846153846153844,"","Danio rerio","embryo","120hpf","NOEC","Mortality","160ug/L","Fish","Chordata","Actinopterygii","essential medium","28 ± 1","Acute ","Not stated","N.A.","Wang,C., Y. Qian, X. Zhang, F. Chen, Q. Zhang, Z. Li, and M. Zhao (2016) A Metabolomic Study of Fipronil for the Anxiety-Like Behavior in Zebrafish Larvae at Environmentally Relevant Levels Environ. Pollut.211:252-258","1085","Do Not Use - Use the QCQC'd version of this entry below","Not using","Do not use"]
["Freshwater/non-metal/non- plant","1085-3",49,0.53846153846153844,"","Danio rerio","embryo","120hpf","NOEC","Developmental","160ug/L","Fish","Chordata","Actinopterygii","essential medium","28 ± 1","Acute ","Not stated","N.A.","Wang,C., Y. Qian, X. Zhang, F. Chen, Q. Zhang, Z. Li, and M. Zhao (2016) A Metabolomic Study of Fipronil for the Anxiety-Like Behavior in Zebrafish Larvae at Environmentally Relevant Levels Environ. Pollut.211:252-258","1085","Do Not Use - Use the QCQC'd version of this entry below","Not using","Do not use"]
["Freshwater/non-metal/non- plant","1086-1",65,0.7142857142857143,"","Hyalella azteca","Not stated","96 hrs","LC50","Mortality","1593ng/L","Macroinvertebrate","Arthropoda","Malacostraca","Moderately hard Milli-Q water",23,"Acute ","Not stated","N.A.","Weston,D.P., and M.J. Lydy (2013) Toxicity of the Insecticide Fipronil and Its Degradates to Benthic Macroinvertebrates of Urban Streams Environ. Sci. Technol.48(2): 1290-1297","1086","Do Not Use - Unknown purity","Purity not stated","Do not use"]
["Freshwater/non-metal/non- plant","1086-2",65,0.7142857142857143,"","Hyalella azteca","Not stated","96 hrs","LC50","Mortality","1725ng/L","Macroinvertebrate","Arthropoda","Malacostraca","Moderately hard Milli-Q water",23,"Acute ","Not stated","N.A.","Weston,D.P., and M.J. Lydy (2013) Toxicity of the Insecticide Fipronil and Its Degradates to Benthic Macroinvertebrates of Urban Streams Environ. Sci. Technol.48(2): 1290-1297","1086","Do Not Use - Unknown purity","Purity not stated","Do not use"]
["Freshwater/non-metal/non- plant","1086-3",65,0.7142857142857143,"","Hyalella azteca","Not stated","96 hrs","EC50","Swim ability","729ng/L","Macroinvertebrate","Arthropoda","Malacostraca","Moderately hard Milli-Q water",23,"Acute ","Not stated","N.A.","Weston,D.P., and M.J. Lydy (2013) Toxicity of the Insecticide Fipronil and Its Degradates to Benthic Macroinvertebrates of Urban Streams Environ. Sci. Technol.48(2): 1290-1297","1086","Do Not Use - Non-viable endpoint","Not using","Do not use"]
["Freshwater/non-metal/non- plant","1086-4",65,0.7142857142857143,"","Hyalella azteca","Not stated","96 hrs","EC50","Swim ability","727ng/L","Macroinvertebrate","Arthropoda","Malacostraca","Moderately hard Milli-Q water",23,"Acute ","Not stated","N.A.","Weston,D.P., and M.J. Lydy (2013) Toxicity of the Insecticide Fipronil and Its Degradates to Benthic Macroinvertebrates of Urban Streams Environ. Sci. Technol.48(2): 1290-1297","1086","Do Not Use - Non-viable endpoint","Not using","Do not use"]
["Freshwater/non-metal/non- plant","1086-5",65,0.7142857142857143,"","Chironomus dilutus","Not stated","96 hrs","EC50","Immobility: ability to thrash when prodded","35.0ng/L","Macroinvertebrate","Arthropoda","Insecta","Moderately hard Milli-Q water",23,"Acute ","Not stated","N.A.","Weston,D.P., and M.J. Lydy (2013) Toxicity of the Insecticide Fipronil and Its Degradates to Benthic Macroinvertebrates of Urban Streams Environ. Sci. Technol.48(2): 1290-1297","1086","Do Not Use - Non-viable endpoint","Not using","Do not use"]
["Freshwater/non-metal/non- plant","1086-6",65,0.7142857142857143,"","Chironomus dilutus","Not stated","96 hrs","EC50","Immobility: ability to thrash when prodded","30.0ng/L","Macroinvertebrate","Arthropoda","Insecta","Moderately hard Milli-Q water",23,"Acute ","Not stated","N.A.","Weston,D.P., and M.J. Lydy (2013) Toxicity of the Insecticide Fipronil and Its Degradates to Benthic Macroinvertebrates of Urban Streams Environ. Sci. Technol.48(2): 1290-1297","1086","Do Not Use - Non-viable endpoint","Not using","Do not use"]
["Freshwater/non-metal/non- plant","1086-7",65,0.7142857142857143,"","Chironomus dilutus","Not stated","96 hrs","LC50","Mortality",">81.5ng/L","Macroinvertebrate","Arthropoda","Insecta","Moderately hard Milli-Q water",23,"Acute ","Not stated","N.A.","Weston,D.P., and M.J. Lydy (2013) Toxicity of the Insecticide Fipronil and Its Degradates to Benthic Macroinvertebrates of Urban Streams Environ. Sci. Technol.48(2): 1290-1297","1086","Do Not Use - LC50 value not obtained","Not using","Do not use"]
["Freshwater/non-metal/non- plant","1086-8",65,0.7142857142857143,"","Hexagenia sp.","Not stated","96 hrs","EC50","ability to swim","480ng/L","Macroinvertebrate","Arthropoda","Insecta","Moderately hard Milli-Q water",18,"Acute ","Not stated","N.A.","Weston,D.P., and M.J. Lydy (2013) Toxicity of the Insecticide Fipronil and Its Degradates to Benthic Macroinvertebrates of Urban Streams Environ. Sci. Technol.48(2): 1290-1297","1086","Do Not Use - Non-viable endpoint","Not using","Do not use"]
["Freshwater/non-metal/non- plant","1086-9",65,0.7142857142857143,"","Hexagenia sp.","Not stated","96 hrs","LC50","Mortality","1231ng/L","Macroinvertebrate","Arthropoda","Insecta","Moderately hard Milli-Q water",18,"Acute ","Not stated","N.A.","Weston,D.P., and M.J. Lydy (2013) Toxicity of the Insecticide Fipronil and Its Degradates to Benthic Macroinvertebrates of Urban Streams Environ. Sci. Technol.48(2): 1290-1297","1086","Do Not Use - Unknown purity","Purity not stated","Do not use"]
["Freshwater/non-metal/non- plant","1086-10",65,0.7142857142857143,"","Baetis tricaudatus","Not stated","48 hrs","EC50","ability to swim","51.9ng/L","Macroinvertebrate","Arthropoda","Insecta","Moderately hard Milli-Q water",17,"Acute ","Not stated","N.A.","Weston,D.P., and M.J. Lydy (2013) Toxicity of the Insecticide Fipronil and Its Degradates to Benthic Macroinvertebrates of Urban Streams Environ. Sci. Technol.48(2): 1290-1297","1086","Do Not Use - Non-viable endpoint","Not using","Do not use"]
["Freshwater/non-metal/non- plant","1086-11",65,0.7142857142857143,"","Baetis tricaudatus","Not stated","48 hrs","LC50","Mortality","105ng/L","Macroinvertebrate","Arthropoda","Insecta","Moderately hard Milli-Q water",17,"Acute ","Not stated","N.A.","Weston,D.P., and M.J. Lydy (2013) Toxicity of the Insecticide Fipronil and Its Degradates to Benthic Macroinvertebrates of Urban Streams Environ. Sci. Technol.48(2): 1290-1297","1086","Do Not Use - Unknown purity","Purity not stated","Do not use"]
["Freshwater/non-metal/non- plant","1086-12",65,0.7142857142857143,"","Diphetor hageni","Not stated","48 hrs","EC50","ability to swim","163ng/L","Macroinvertebrate","Arthropoda","Insecta","Moderately hard Milli-Q water",18,"Acute ","Not stated","N.A.","Weston,D.P., and M.J. Lydy (2013) Toxicity of the Insecticide Fipronil and Its Degradates to Benthic Macroinvertebrates of Urban Streams Environ. Sci. Technol.48(2): 1290-1297","1086","Do Not Use - Non-viable endpoint","Not using","Do not use"]
["Freshwater/non-metal/non- plant","1086-13",65,0.7142857142857143,"","Diphetor hageni","Not stated","48 hrs","LC50","Mortality","347ng/L","Macroinvertebrate","Arthropoda","Insecta","Moderately hard Milli-Q water",18,"Acute ","Not stated","N.A.","Weston,D.P., and M.J. Lydy (2013) Toxicity of the Insecticide Fipronil and Its Degradates to Benthic Macroinvertebrates of Urban Streams Environ. Sci. Technol.48(2): 1290-1297","1086","Do Not Use - Unknown purity","Purity not stated","Do not use"]
["Freshwater/non-metal/non- plant","1086-14",65,0.7142857142857143,"","Fallceon quilleri","Not stated","48 hrs","EC50","ability to swim","70.7ng/L","Macroinvertebrate","Arthropoda","Insecta","Moderately hard Milli-Q water",23,"Acute ","Not stated","N.A.","Weston,D.P., and M.J. Lydy (2013) Toxicity of the Insecticide Fipronil and Its Degradates to Benthic Macroinvertebrates of Urban Streams Environ. Sci. Technol.48(2): 1290-1297","1086","Do Not Use - Non-viable endpoint","Not using","Do not use"]
["Freshwater/non-metal/non- plant","1086-15",65,0.7142857142857143,"","Fallceon quilleri","Not stated","48 hrs","LC50","Mortality",">187ng/L","Macroinvertebrate","Arthropoda","Insecta","Moderately hard Milli-Q water",23,"Acute ","Not stated","N.A.","Weston,D.P., and M.J. Lydy (2013) Toxicity of the Insecticide Fipronil and Its Degradates to Benthic Macroinvertebrates of Urban Streams Environ. Sci. Technol.48(2): 1290-1297","1086","Do Not Use - LC50 value not obtained","Not using","Do not use"]
["Freshwater/non-metal/non- plant","1086-16",65,0.7142857142857143,"","Serratella micheneri","Not stated","48 hrs","EC50","ability to swim","589ng/L","Macroinvertebrate","Arthropoda","Insecta","Moderately hard Milli-Q water",23,"Acute ","Not stated","N.A.","Weston,D.P., and M.J. Lydy (2013) Toxicity of the Insecticide Fipronil and Its Degradates to Benthic Macroinvertebrates of Urban Streams Environ. Sci. Technol.48(2): 1290-1297","1086","Do Not Use - Unknown purity","Not using","Do not use"]
["Freshwater/non-metal/non- plant","1086-17",65,0.7142857142857143,"","Serratella micheneri","Not stated","48 hrs","LC50","Mortality",">722ng/L","Macroinvertebrate","Arthropoda","Insecta","Moderately hard Milli-Q water",23,"Acute ","Not stated","N.A.","Weston,D.P., and M.J. Lydy (2013) Toxicity of the Insecticide Fipronil and Its Degradates to Benthic Macroinvertebrates of Urban Streams Environ. Sci. Technol.48(2): 1290-1297","1086","Do Not Use - LC50 value not obtained","Not using","Do not use"]
["Freshwater/non-metal/non- plant","1086-18",65,0.7142857142857143,"","Ephemeralla excrucians","Not stated","48 hrs","LC50","Mortality",">436ng/L","Macroinvertebrate","Arthropoda","Insecta","Moderately hard Milli-Q water",13,"Acute ","Not stated","N.A.","Weston,D.P., and M.J. Lydy (2013) Toxicity of the Insecticide Fipronil and Its Degradates to Benthic Macroinvertebrates of Urban Streams Environ. Sci. Technol.48(2): 1290-1297","1086","Do Not Use - LC50 value not obtained","Not using","Do not use"]
["Freshwater/non-metal/non- plant","1086-19",65,0.7142857142857143,"","Ephemeralla excrucians","Not stated","48 hrs","EC50","ability to swim",">436ng/L","Macroinvertebrate","Arthropoda","Insecta","Moderately hard Milli-Q water",13,"Acute ","Not stated","N.A.","Weston,D.P., and M.J. Lydy (2013) Toxicity of the Insecticide Fipronil and Its Degradates to Benthic Macroinvertebrates of Urban Streams Environ. Sci. Technol.48(2): 1290-1297","1086","Do Not Use - Unknown purity","Not using","Do not use"]
["Freshwater/non-metal/non- plant","1086-21",65,0.7142857142857143,"","Taenionema sp.","Not stated","96hr","LC50","Mortality",">184ng/L","Macroinvertebrate","Arthropoda","Insecta","Moderately hard Milli-Q water",8,"Acute ","Not stated","N.A.","Weston,D.P., and M.J. Lydy (2013) Toxicity of the Insecticide Fipronil and Its Degradates to Benthic Macroinvertebrates of Urban Streams Environ. Sci. Technol.48(2): 1290-1297","1086","Do Not Use - LC50 value not obtained","Not using","Do not use"]
["Freshwater/non-metal/non- plant","1086-23",65,0.7142857142857143,"","Isoperla quinquepunctata","Not stated","96hr","LC50","Mortality","113ng/L","Macroinvertebrate","Arthropoda","Insecta","Moderately hard Milli-Q water",13,"Acute ","Not stated","N.A.","Weston,D.P., and M.J. Lydy (2013) Toxicity of the Insecticide Fipronil and Its Degradates to Benthic Macroinvertebrates of Urban Streams Environ. Sci. Technol.48(2): 1290-1297","1086","Do Not Use - Unknown purity","Purity not stated","Do not use"]
["Freshwater/non-metal/non- plant","1086-24",65,0.7142857142857143,"","Tricorythodes sp. ","Not stated","48 hrs","LC50","Mortality",">1229ng/L","Macroinvertebrate","Arthropoda","Insecta","Moderately hard Milli-Q water",18,"Acute ","Not stated","N.A.","Weston,D.P., and M.J. Lydy (2013) Toxicity of the Insecticide Fipronil and Its Degradates to Benthic Macroinvertebrates of Urban Streams Environ. Sci. Technol.48(2): 1290-1297","1086","Do Not Use - LC50 value not obtained","Not using","Do not use"]
["Freshwater/non-metal/non- plant","1086-26",65,0.7142857142857143,"","Hydropsyche sp. ","Not stated","96 hour","EC50","Immobility: ability to thrash when prodded","602ng/L","Macroinvertebrate","Arthropoda","Insecta","Moderately hard Milli-Q water",12,"Acute ","Not stated","N.A.","Weston,D.P., and M.J. Lydy (2013) Toxicity of the Insecticide Fipronil and Its Degradates to Benthic Macroinvertebrates of Urban Streams Environ. Sci. Technol.48(2): 1290-1297","1086","Do Not Use - Non-viable endpoint","Not using","Do not use"]
["Freshwater/non-metal/non- plant","1086-27",65,0.7142857142857143,"","Hydropsyche sp. ","Not stated","96 hour","LC50","Mortality","2107ng/L","Macroinvertebrate","Arthropoda","Insecta","Moderately hard Milli-Q water",12,"Acute ","Not stated","N.A.","Weston,D.P., and M.J. Lydy (2013) Toxicity of the Insecticide Fipronil and Its Degradates to Benthic Macroinvertebrates of Urban Streams Environ. Sci. Technol.48(2): 1290-1297","1086","Do Not Use - Unknown purity","Purity not stated","Do not use"]
["Freshwater/non-metal/non- plant","1086-28",65,0.7142857142857143,"","Nectopsyche sp.","Not stated","96 hour","EC50","Immobility: ability to walk/crawl","634ng/L","Macroinvertebrate","Arthropoda","Insecta","Moderately hard Milli-Q water",12,"Acute ","Not stated","N.A.","Weston,D.P., and M.J. Lydy (2013) Toxicity of the Insecticide Fipronil and Its Degradates to Benthic Macroinvertebrates of Urban Streams Environ. Sci. Technol.48(2): 1290-1297","1086","Do Not Use - Non-viable endpoint","Not using","Do not use"]
["Freshwater/non-metal/non- plant","1086-29",65,0.7142857142857143,"","Nectopsyche sp.","Not stated","96 hour","LC50","Mortality",">2947ng/L","Macroinvertebrate","Arthropoda","Insecta","Moderately hard Milli-Q water",12,"Acute ","Not stated","N.A.","Weston,D.P., and M.J. Lydy (2013) Toxicity of the Insecticide Fipronil and Its Degradates to Benthic Macroinvertebrates of Urban Streams Environ. Sci. Technol.48(2): 1290-1297","1086","Do Not Use - LC50 value not obtained","Not using","Do not use"]
["Freshwater/non-metal/non- plant","1086-30",65,0.7142857142857143,"","Helicopsyche sp. ","Not stated","96 hour","EC50","ability to cling","267ng/L","Macroinvertebrate","Arthropoda","Insecta","Moderately hard Milli-Q water",13,"Acute ","Not stated","N.A.","Weston,D.P., and M.J. Lydy (2013) Toxicity of the Insecticide Fipronil and Its Degradates to Benthic Macroinvertebrates of Urban Streams Environ. Sci. Technol.48(2): 1290-1297","1086","Do Not Use - Non-viable endpoint","Not using","Do not use"]
["Freshwater/non-metal/non- plant","1086-31",65,0.7142857142857143,"","Helicopsyche sp. ","Not stated","96 hour","LC50","Mortality",">842ng/L","Macroinvertebrate","Arthropoda","Insecta","Moderately hard Milli-Q water",13,"Acute ","Not stated","N.A.","Weston,D.P., and M.J. Lydy (2013) Toxicity of the Insecticide Fipronil and Its Degradates to Benthic Macroinvertebrates of Urban Streams Environ. Sci. Technol.48(2): 1290-1297","1086","Do Not Use - LC50 value not obtained","Not using","Do not use"]
["MEW_nonplant","1088-1",58,0.61702127659574468,"","Palaemonetes pugio","6 month adult","28 day","LOEC","Mortality","355ng/L","Macroinvertebrate","Arthropoda","Malacostraca","natural seawater","28.5-31.1","Chronic","7.7-8.1","20.4-22.8","Wirth,E.F., P.L. Pennington, J.C. Lawton, M.E. DeLorenzo, D. Bearden, B. Shaddrix, S. Sivertsen, and M.H. Fulton (2004) The Effects of the Contemporary-Use Insecticide (Fipronil) in an Estuarine Mesocosm Environ. Pollut.131(3): 365-371 ","1088","Do Not Use - Use the QCQC'd version of this entry below","Not using","Do not use"]
["MEW_nonplant","1088-2",76,0.80851063829787229,"","Palaemonetes pugio","6 month adult","28 day","LC50","Mortality","357ng/L","Macroinvertebrate","Arthropoda","Malacostraca","natural seawater","28.5-31.1","Chronic","7.7-8.1","20.4-22.8","Wirth,E.F., P.L. Pennington, J.C. Lawton, M.E. DeLorenzo, D. Bearden, B. Shaddrix, S. Sivertsen, and M.H. Fulton (2004) The Effects of the Contemporary-Use Insecticide (Fipronil) in an Estuarine Mesocosm Environ. Pollut.131(3): 365-371 ","1088","Do Not Use - Use the QCQC'd version of this entry below","Not using","Do not use"]
["MEW_nonplant","1088-3",58,0.61702127659574468,"","Palaemonetes pugio","6 month adult","28 day","NOEC","Mortality","150ng/L","Macroinvertebrate","Arthropoda","Malacostraca","natural seawater","28.5-31.1","Chronic","7.7-8.1","20.4-22.8","Wirth,E.F., P.L. Pennington, J.C. Lawton, M.E. DeLorenzo, D. Bearden, B. Shaddrix, S. Sivertsen, and M.H. Fulton (2004) The Effects of the Contemporary-Use Insecticide (Fipronil) in an Estuarine Mesocosm Environ. Pollut.131(3): 365-371 ","1088","Do Not Use - Use the QCQC'd version of this entry below","Not using","Do not use"]
["MEW_nonplant","1088-4",58,0.61702127659574468,"","Cyprinidon variegatus","6 month adult","28 day","NOEC","Mortality","5000ng/L","Fish ","Chordata","\tActinopterygii","natural seawater","28.5-31.1","Chronic","7.7-8.1","20.4-22.8","Wirth,E.F., P.L. Pennington, J.C. Lawton, M.E. DeLorenzo, D. Bearden, B. Shaddrix, S. Sivertsen, and M.H. Fulton (2004) The Effects of the Contemporary-Use Insecticide (Fipronil) in an Estuarine Mesocosm Environ. Pollut.131(3): 365-371 ","1088","Do Not Use - Use the QCQC'd version of this entry below","Not using","Do not use"]
["MEW_nonplant","1088-5",58,0.61702127659574468,"","Mercenaria mercenaria","6 month adult","28 day","NOEC","Mortality","5000ng/L","Macroinvertebrate","Mollusca","Bivalvia","natural seawater","28.5-31.1","Chronic","7.7-8.1","20.4-22.8","Wirth,E.F., P.L. Pennington, J.C. Lawton, M.E. DeLorenzo, D. Bearden, B. Shaddrix, S. Sivertsen, and M.H. Fulton (2004) The Effects of the Contemporary-Use Insecticide (Fipronil) in an Estuarine Mesocosm Environ. Pollut.131(3): 365-371 ","1088","Do Not Use - Use the QCQC'd version of this entry below","Not using","Do not use"]
["MEW_nonplant","1088-6",58,0.61702127659574468,"","Crassostrea virginica","6 month adult","28 day","NOEC","Mortality","5000ng/L","Macroinvertebrate","Mollusca","Bivalvia","natural seawater","28.5-31.1","Chronic","7.7-8.1","20.4-22.8","Wirth,E.F., P.L. Pennington, J.C. Lawton, M.E. DeLorenzo, D. Bearden, B. Shaddrix, S. Sivertsen, and M.H. Fulton (2004) The Effects of the Contemporary-Use Insecticide (Fipronil) in an Estuarine Mesocosm Environ. Pollut.131(3): 365-371 ","1088","Do Not Use - Use the QCQC'd version of this entry below","Not using","Do not use"]
["Freshwater/non-metal/non- plant","1087-1",70,0.76923076923076927,"","Ceriodaphnia dubia","<24hr neonate","8 days","NOEC","Reproduction: number of broods per female","60ug/L","Microinvertebrate","Arthropoda","Branchiopoda","moderately hard water","24-26","Chronic","7.6-8.2","N.A.","Wilson,W.A., B.J. Konwick, A.W. Garrison, J.K. Avants, and M.C. Black (2008) Enantioselective Chronic Toxicity of Fipronil to Ceriodaphnia dubia Arch. Environ. Contam. Toxicol.54(1): 36-43 ","1087",null,"Fipronil 98% pure","OK to use"]
["Freshwater/non-metal/non- plant","1087-2",70,0.76923076923076927,"","Ceriodaphnia dubia","<24hr neonate","8 days","LOEC","Reproduction: time taken to release brood","120ug/L","Microinvertebrate","Arthropoda","Branchiopoda","moderately hard water","24-26","Chronic","7.6-8.2","N.A.","Wilson,W.A., B.J. Konwick, A.W. Garrison, J.K. Avants, and M.C. Black (2008) Enantioselective Chronic Toxicity of Fipronil to Ceriodaphnia dubia Arch. Environ. Contam. Toxicol.54(1): 36-43 ","1087",null,"Fipronil 98% pure","OK to use"]
["Freshwater/non-metal/non- plant","1087-2a",70,0.76923076923076927,"","Ceriodaphnia dubia","<24hr neonate","8 days","NOEC","time taken to release brood","60ug/L","Microinvertebrate","Arthropoda","Branchiopoda","moderately hard water","24-26","Chronic","7.6-8.2","N.A.","Wilson,W.A., B.J. Konwick, A.W. Garrison, J.K. Avants, and M.C. Black (2008) Enantioselective Chronic Toxicity of Fipronil to Ceriodaphnia dubia Arch. Environ. Contam. Toxicol.54(1): 36-43 ","1087",null,"Fipronil 98% pure","OK to use"]
["Freshwater/non-metal/non- plant","1087-3",70,0.76923076923076927,"Lowest concentration tested","Ceriodaphnia dubia","<24hr neonate","8 days","LOEC","Reproduction: Brood size","15ug/L","Microinvertebrate","Arthropoda","Branchiopoda","moderately hard water","24-26","Chronic","7.6-8.2","N.A.","Wilson,W.A., B.J. Konwick, A.W. Garrison, J.K. Avants, and M.C. Black (2008) Enantioselective Chronic Toxicity of Fipronil to Ceriodaphnia dubia Arch. Environ. Contam. Toxicol.54(1): 36-43 ","1087",null,"Fipronil 98% pure","OK to use"]
["Freshwater/non-metal/non- plant","1087-4",70,0.76923076923076927,"","Ceriodaphnia dubia","<24hr neonate","8 days","LOEC","Mortality","120ug/L","Microinvertebrate","Arthropoda","Branchiopoda","moderately hard water","24-26","Chronic","7.6-8.2","N.A.","Wilson,W.A., B.J. Konwick, A.W. Garrison, J.K. Avants, and M.C. Black (2008) Enantioselective Chronic Toxicity of Fipronil to Ceriodaphnia dubia Arch. Environ. Contam. Toxicol.54(1): 36-43 ","1087",null,"Fipronil 98% pure","OK to use"]
["Freshwater/non-metal/non- plant","1087-4a",70,0.76923076923076927,"","Ceriodaphnia dubia","<24hr neonate","8 days","NOEC","Mortality","60ug/L","Microinvertebrate","Arthropoda","Branchiopoda","moderately hard water","24-26","Chronic","7.6-8.2","N.A.","Wilson,W.A., B.J. Konwick, A.W. Garrison, J.K. Avants, and M.C. Black (2008) Enantioselective Chronic Toxicity of Fipronil to Ceriodaphnia dubia Arch. Environ. Contam. Toxicol.54(1): 36-43 ","1087",null,"Fipronil 98% pure","OK to use"]
["Freshwater/non-metal/non- plant","1087-5",74,0.81318681318681318,"","Ceriodaphnia dubia","<24h neonate f2 ","24hr","LC50","Mortality","33.3ug/L","Microinvertebrate","Arthropoda","Branchiopoda","moderately hard water","24-26","Acute","7.6-8.2","N.A.","Wilson,W.A., B.J. Konwick, A.W. Garrison, J.K. Avants, and M.C. Black (2008) Enantioselective Chronic Toxicity of Fipronil to Ceriodaphnia dubia Arch. Environ. Contam. Toxicol.54(1): 36-43 ","1087",null,"Fipronil 98% pure","OK to use"]
["Freshwater/non-metal/non- plant","1087-6",74,0.81318681318681318,"","Ceriodaphnia dubia","<24h neonate f2 ","48 hr","LC50","Mortality","30.3ug/L","Microinvertebrate","Arthropoda","Branchiopoda","moderately hard water","24-26","Acute","7.6-8.2","N.A.","Wilson,W.A., B.J. Konwick, A.W. Garrison, J.K. Avants, and M.C. Black (2008) Enantioselective Chronic Toxicity of Fipronil to Ceriodaphnia dubia Arch. Environ. Contam. Toxicol.54(1): 36-43 ","1087",null,"Fipronil 98% pure","OK to use"]
["Freshwater/non-metal/non- plant","1087-7",74,0.76923076923076927,"","Ceriodaphnia dubia","<24hr neonate","8 days","LOEC","Reproduction: number of broods per female","120ug/L","Microinvertebrate","Arthropoda","Branchiopoda","moderately hard water","24-26","Chronic","7.6-8.2","N.A.","Wilson,W.A., B.J. Konwick, A.W. Garrison, J.K. Avants, and M.C. Black (2008) Enantioselective Chronic Toxicity of Fipronil to Ceriodaphnia dubia Arch. Environ. Contam. Toxicol.54(1): 36-43 ","1087",null,"Fipronil 98% pure","OK to use"]
["Freshwater/non-metal/non- plant","1087-8",70,0.76923076923076927,"Lowest concentration tested","Ceriodaphnia dubia","<24hr neonate","8 days","LOEC","Reproductive output (neonates)","15ug/L","Microinvertebrate","Arthropoda","Branchiopoda","moderately hard water","24-26","Chronic","7.6-8.2","N.A.","Wilson,W.A., B.J. Konwick, A.W. Garrison, J.K. Avants, and M.C. Black (2008) Enantioselective Chronic Toxicity of Fipronil to Ceriodaphnia dubia Arch. Environ. Contam. Toxicol.54(1): 36-43 ","1087",null,"Fipronil 98% pure","OK to use"]
["Freshwater/non-metal/non- plant","1087-JF",70,0.76923076923076927,null,"Ceriodaphnia dubia","<24hr neonate","8 days","LOEC","Reproduction: number of broods per female","32 ug/L","Microinvertebrate","Arthropoda","Branchiopoda","moderately hard water","24-26","Chronic","7.6-8.2","N.A.","Wilson,W.A., B.J. Konwick, A.W. Garrison, J.K. Avants, and M.C. Black (2008) Enantioselective Chronic Toxicity of Fipronil to Ceriodaphnia dubia Arch. Environ. Contam. Toxicol.54(1): 36-43 ","1087","S+ enantiomer","Fipronil 98% pure","OK to use"]
["Freshwater/non-metal/non- plant","1087-JF",70,0.76923076923076927,"Highest concentration tested","Ceriodaphnia dubia","<24hr neonate","8 days","NOEC","Reproduction: time taken to release brood","64ug/L","Microinvertebrate","Arthropoda","Branchiopoda","moderately hard water","24-26","Chronic","7.6-8.2","N.A.","Wilson,W.A., B.J. Konwick, A.W. Garrison, J.K. Avants, and M.C. Black (2008) Enantioselective Chronic Toxicity of Fipronil to Ceriodaphnia dubia Arch. Environ. Contam. Toxicol.54(1): 36-43 ","1087","S+ enantiomer","Fipronil 98% pure","OK to use"]
["Freshwater/non-metal/non- plant","1087-JF",70,0.76923076923076927,"Lowest concentration tested","Ceriodaphnia dubia","<24hr neonate","8 days","LOEC","Reproductive output (neonates)","2 ug/L","Microinvertebrate","Arthropoda","Branchiopoda","moderately hard water","24-26","Chronic","7.6-8.2","N.A.","Wilson,W.A., B.J. Konwick, A.W. Garrison, J.K. Avants, and M.C. Black (2008) Enantioselective Chronic Toxicity of Fipronil to Ceriodaphnia dubia Arch. Environ. Contam. Toxicol.54(1): 36-43 ","1087","S+ enantiomer","Fipronil 98% pure","OK to use"]
["Freshwater/non-metal/non- plant","1087-JF",70,0.76923076923076927,"Lowest concentration tested","Ceriodaphnia dubia","<24hr neonate","8 days","LOEC","Reproduction: Brood size","2 ug/L","Microinvertebrate","Arthropoda","Branchiopoda","moderately hard water","24-26","Chronic","7.6-8.2","N.A.","Wilson,W.A., B.J. Konwick, A.W. Garrison, J.K. Avants, and M.C. Black (2008) Enantioselective Chronic Toxicity of Fipronil to Ceriodaphnia dubia Arch. Environ. Contam. Toxicol.54(1): 36-43 ","1087","S+ enantiomer","Fipronil 98% pure","OK to use"]
["Freshwater/non-metal/non- plant","1087-JF",70,0.76923076923076927,null,"Ceriodaphnia dubia","<24hr neonate","8 days","NOEC","Reproduction: number of broods per female","8 ug/L","Microinvertebrate","Arthropoda","Branchiopoda","moderately hard water","24-26","Chronic","7.6-8.2","N.A.","Wilson,W.A., B.J. Konwick, A.W. Garrison, J.K. Avants, and M.C. Black (2008) Enantioselective Chronic Toxicity of Fipronil to Ceriodaphnia dubia Arch. Environ. Contam. Toxicol.54(1): 36-43 ","1087","S+ enantiomer","Fipronil 98% pure","OK to use"]
["Freshwater/non-metal/non- plant","1087-JF",70,0.76923076923076927,"Highest concentration tested","Ceriodaphnia dubia","<24hr neonate","8 days","NOEC","Mortality","64 ug/L","Microinvertebrate","Arthropoda","Branchiopoda","moderately hard water","24-26","Chronic","7.6-8.2","N.A.","Wilson,W.A., B.J. Konwick, A.W. Garrison, J.K. Avants, and M.C. Black (2008) Enantioselective Chronic Toxicity of Fipronil to Ceriodaphnia dubia Arch. Environ. Contam. Toxicol.54(1): 36-43 ","1087","S+ enantiomer","Fipronil 98% pure","OK to use"]
["Freshwater/non-metal/non- plant","1087-JF",74,0.81318681318681318,null,"Ceriodaphnia dubia","<24h neonate f2 ","24hr","LC50","Mortality","18.1 ug/L","Microinvertebrate","Arthropoda","Branchiopoda","moderately hard water","24-26","Chronic","7.6-8.2","N.A.","Wilson,W.A., B.J. Konwick, A.W. Garrison, J.K. Avants, and M.C. Black (2008) Enantioselective Chronic Toxicity of Fipronil to Ceriodaphnia dubia Arch. Environ. Contam. Toxicol.54(1): 36-43 ","1087","S+ enantiomer","Fipronil 98% pure","OK to use"]
["Freshwater/non-metal/non- plant","1087-JF",74,0.81318681318681318,null,"Ceriodaphnia dubia","<24h neonate f2 ","48 hr","LC50","Mortality","10.3 ug/L","Microinvertebrate","Arthropoda","Branchiopoda","moderately hard water","24-26","Chronic","7.6-8.2","N.A.","Wilson,W.A., B.J. Konwick, A.W. Garrison, J.K. Avants, and M.C. Black (2008) Enantioselective Chronic Toxicity of Fipronil to Ceriodaphnia dubia Arch. Environ. Contam. Toxicol.54(1): 36-43 ","1087","S+ enantiomer","Fipronil 98% pure","OK to use"]
["Freshwater/non-metal/non- plant","1087-JF",70,0.76923076923076927,null,"Ceriodaphnia dubia","<24hr neonate","8 days","LOEC","Reproductive output (neonates)","30ug/L","Microinvertebrate","Arthropoda","Branchiopoda","moderately hard water","24-26","Chronic","7.6-8.2","N.A.","Wilson,W.A., B.J. Konwick, A.W. Garrison, J.K. Avants, and M.C. Black (2008) Enantioselective Chronic Toxicity of Fipronil to Ceriodaphnia dubia Arch. Environ. Contam. Toxicol.54(1): 36-43 ","1087","R- enantiomer","Fipronil 98% pure","OK to use"]
["Freshwater/non-metal/non- plant","1087-JF",70,0.76923076923076927,null,"Ceriodaphnia dubia","<24hr neonate","8 days","NOEC","Reproductive output (neonates)","10 ug/L","Microinvertebrate","Arthropoda","Branchiopoda","moderately hard water","24-26","Chronic","7.6-8.2","N.A.","Wilson,W.A., B.J. Konwick, A.W. Garrison, J.K. Avants, and M.C. Black (2008) Enantioselective Chronic Toxicity of Fipronil to Ceriodaphnia dubia Arch. Environ. Contam. Toxicol.54(1): 36-43 ","1087","R- enantiomer","Fipronil 98% pure","OK to use"]
["Freshwater/non-metal/non- plant","1087-JF",70,0.76923076923076927,null,"Ceriodaphnia dubia","<24hr neonate","8 days","LOEC","Reproduction: Brood size","30ug/L","Microinvertebrate","Arthropoda","Branchiopoda","moderately hard water","24-26","Chronic","7.6-8.2","N.A.","Wilson,W.A., B.J. Konwick, A.W. Garrison, J.K. Avants, and M.C. Black (2008) Enantioselective Chronic Toxicity of Fipronil to Ceriodaphnia dubia Arch. Environ. Contam. Toxicol.54(1): 36-43 ","1087","R- enantiomer","Fipronil 98% pure","OK to use"]
["Freshwater/non-metal/non- plant","1087-JF",70,0.76923076923076927,null,"Ceriodaphnia dubia","<24hr neonate","8 days","NOEC","Reproduction: Brood size","10 ug/L","Microinvertebrate","Arthropoda","Branchiopoda","moderately hard water","24-26","Chronic","7.6-8.2","N.A.","Wilson,W.A., B.J. Konwick, A.W. Garrison, J.K. Avants, and M.C. Black (2008) Enantioselective Chronic Toxicity of Fipronil to Ceriodaphnia dubia Arch. Environ. Contam. Toxicol.54(1): 36-43 ","1087","R- enantiomer","Fipronil 98% pure","OK to use"]
["Freshwater/non-metal/non- plant","1087-JF",70,0.76923076923076927,"Highest concentration tested","Ceriodaphnia dubia","<24hr neonate","8 days","LOEC","Reproduction: number of broods per female","270 ug/L","Microinvertebrate","Arthropoda","Branchiopoda","moderately hard water","24-26","Chronic","7.6-8.2","N.A.","Wilson,W.A., B.J. Konwick, A.W. Garrison, J.K. Avants, and M.C. Black (2008) Enantioselective Chronic Toxicity of Fipronil to Ceriodaphnia dubia Arch. Environ. Contam. Toxicol.54(1): 36-43 ","1087","R- enantiomer","Fipronil 98% pure","OK to use"]
["Freshwater/non-metal/non- plant","1087-JF",70,0.76923076923076927,null,"Ceriodaphnia dubia","<24hr neonate","8 days","NOEC","Reproduction: number of broods per female","90 ug/L","Microinvertebrate","Arthropoda","Branchiopoda","moderately hard water","24-26","Chronic","7.6-8.2","N.A.","Wilson,W.A., B.J. Konwick, A.W. Garrison, J.K. Avants, and M.C. Black (2008) Enantioselective Chronic Toxicity of Fipronil to Ceriodaphnia dubia Arch. Environ. Contam. Toxicol.54(1): 36-43 ","1087","R- enantiomer","Fipronil 98% pure","OK to use"]
["Freshwater/non-metal/non- plant","1087-JF",70,0.76923076923076927,null,"Ceriodaphnia dubia","<24hr neonate","8 days","NOEC","Mortality","90ug/L","Microinvertebrate","Arthropoda","Branchiopoda","moderately hard water","24-26","Chronic","7.6-8.2","N.A.","Wilson,W.A., B.J. Konwick, A.W. Garrison, J.K. Avants, and M.C. Black (2008) Enantioselective Chronic Toxicity of Fipronil to Ceriodaphnia dubia Arch. Environ. Contam. Toxicol.54(1): 36-43 ","1087","R- enantiomer","Fipronil 98% pure","OK to use"]
["Freshwater/non-metal/non- plant","1087-JF",70,0.76923076923076927,"Highest concentration tested","Ceriodaphnia dubia","<24hr neonate","8 days","LOEC","Mortality","270 ug/L","Microinvertebrate","Arthropoda","Branchiopoda","moderately hard water","24-26","Chronic","7.6-8.2","N.A.","Wilson,W.A., B.J. Konwick, A.W. Garrison, J.K. Avants, and M.C. Black (2008) Enantioselective Chronic Toxicity of Fipronil to Ceriodaphnia dubia Arch. Environ. Contam. Toxicol.54(1): 36-43 ","1087","R- enantiomer","Fipronil 98% pure","OK to use"]
["Freshwater/non-metal/non- plant","1087-JF",70,0.76923076923076927,null,"Ceriodaphnia dubia","<24hr neonate","8 days","LOEC","Reproduction: time taken to release brood","90 ug/L","Microinvertebrate","Arthropoda","Branchiopoda","moderately hard water","24-26","Chronic","7.6-8.2","N.A.","Wilson,W.A., B.J. Konwick, A.W. Garrison, J.K. Avants, and M.C. Black (2008) Enantioselective Chronic Toxicity of Fipronil to Ceriodaphnia dubia Arch. Environ. Contam. Toxicol.54(1): 36-43 ","1087","R- enantiomer","Fipronil 98% pure","OK to use"]
["Freshwater/non-metal/non- plant","1087-JF",70,0.76923076923076927,null,"Ceriodaphnia dubia","<24hr neonate","8 days","NOEC","Reproduction: time taken to release brood","30ug/L","Microinvertebrate","Arthropoda","Branchiopoda","moderately hard water","24-26","Chronic","7.6-8.2","N.A.","Wilson,W.A., B.J. Konwick, A.W. Garrison, J.K. Avants, and M.C. Black (2008) Enantioselective Chronic Toxicity of Fipronil to Ceriodaphnia dubia Arch. Environ. Contam. Toxicol.54(1): 36-43 ","1087","R- enantiomer","Fipronil 98% pure","OK to use"]
["Freshwater/non-metal/non- plant","1087-JF",74,0.81318681318681318,null,"Ceriodaphnia dubia","<24h neonate f2 ","24hr","LC50","Mortality","65.2 ug/L","Microinvertebrate","Arthropoda","Branchiopoda","moderately hard water","24-26","Chronic","7.6-8.2","N.A.","Wilson,W.A., B.J. Konwick, A.W. Garrison, J.K. Avants, and M.C. Black (2008) Enantioselective Chronic Toxicity of Fipronil to Ceriodaphnia dubia Arch. Environ. Contam. Toxicol.54(1): 36-43 ","1087","R- enantiomer","Fipronil 98% pure","OK to use"]
["Freshwater/non-metal/non- plant","1087-JF",74,0.81318681318681318,null,"Ceriodaphnia dubia","<24h neonate f2 ","48 hr","LC50","Mortality","50.1 ug/L","Microinvertebrate","Arthropoda","Branchiopoda","moderately hard water","24-26","Chronic","7.6-8.2","N.A.","Wilson,W.A., B.J. Konwick, A.W. Garrison, J.K. Avants, and M.C. Black (2008) Enantioselective Chronic Toxicity of Fipronil to Ceriodaphnia dubia Arch. Environ. Contam. Toxicol.54(1): 36-43 ","1087","R- enantiomer","Fipronil 98% pure","OK to use"]
["Freshwater/non-metal/non- plant","1090-1",76,0.8351648351648352,"","Danio rerio","juvenile","24h","LC50","Mortality","220.4ug/L","Fish","Chordata","Actinopterygii","reconstituted water","25 ± 1","Acute ","7.1 ± 0.5","N.A.","Wu,H., C. Gao, Y. Guo, Y. Zhang, J. Zhang, and E. Ma (2014) Acute Toxicity and Sublethal Effects of Fipronil on Detoxification Enzymes in Juvenile Zebrafish (Danio rerio) Pestic. Biochem. Physiol.115:9-14. ","1090",null,"Fipronil 97.6%","OK to use"]
["Freshwater/non-metal/non- plant","1093-1",77,0.84615384615384615,"","Simulium vittatum IS-7","4-5th instar larvae","48 hr","LC50","Mortality","0.65 ug/L","Macroinvertebrate","Arthropoda","Insecta","moderately hard water",20,"Acute ","Not stated","N.A.","Overmyer,J.P., D.R. Rouse, J.K. Avants, A.W. Garrison, M.E. DeLorenzo, K.W. Chung, P.B. Key, W.A. Wilson, and M.C. Black (2007) Toxicity of Fipronil and Its Enantiomers to Marine and Freshwater Non-Targets J. Environ. Sci. Health Part B Pestic. Food Contam. Agric. Wastes42(5): 471-480.","1093","Racemate","Fipronil 98% pure","OK to use"]
["Freshwater/non-metal/non- plant","1093-1",77,0.84615384615384615,"","Simulium vittatum IS-7","4-5th instar larvae","48 hr","LC50","Mortality","0.72 ug/L","Macroinvertebrate","Arthropoda","Insecta","moderately hard water",20,"Acute ","Not stated","N.A.","Overmyer,J.P., D.R. Rouse, J.K. Avants, A.W. Garrison, M.E. DeLorenzo, K.W. Chung, P.B. Key, W.A. Wilson, and M.C. Black (2007) Toxicity of Fipronil and Its Enantiomers to Marine and Freshwater Non-Targets J. Environ. Sci. Health Part B Pestic. Food Contam. Agric. Wastes42(5): 471-480.","1093","S+ enantiomer","Fipronil 98% pure","OK to use"]
["Freshwater/non-metal/non- plant","1093-1",77,0.84615384615384615,"","Simulium vittatum IS-7","4-5th instar larvae","48 hr","LC50","Mortality","0.74 ug/L","Macroinvertebrate","Arthropoda","Insecta","moderately hard water",20,"Acute ","Not stated","N.A.","Overmyer,J.P., D.R. Rouse, J.K. Avants, A.W. Garrison, M.E. DeLorenzo, K.W. Chung, P.B. Key, W.A. Wilson, and M.C. Black (2007) Toxicity of Fipronil and Its Enantiomers to Marine and Freshwater Non-Targets J. Environ. Sci. Health Part B Pestic. Food Contam. Agric. Wastes42(5): 471-480.","1093","R- enantiomer","Fipronil 98% pure","OK to use"]
["Freshwater/non-metal/non- plant","1093-2",77,0.84615384615384615,"","Procambarus clarkii","Adult (7.1-10.5cm length)","96hr","LC50","Mortality","124.89 ug/L","Macroinvertebrate","Arthropoda","Malacostraca","moderately hard water",20,"Acute ","Not stated","N.A.","Overmyer,J.P., D.R. Rouse, J.K. Avants, A.W. Garrison, M.E. DeLorenzo, K.W. Chung, P.B. Key, W.A. Wilson, and M.C. Black (2007) Toxicity of Fipronil and Its Enantiomers to Marine and Freshwater Non-Targets J. Environ. Sci. Health Part B Pestic. Food Contam. Agric. Wastes42(5): 471-480.","1093","Racemate","Fipronil 98% pure","OK to use"]
["Freshwater/non-metal/non- plant","1093-2",77,0.84615384615384615,"","Procambarus clarkii","Adult (7.1-10.5cm length)","96hr","LC50","Mortality","81.07 ug/L","Macroinvertebrate","Arthropoda","Malacostraca","moderately hard water",20,"Acute ","Not stated","N.A.","Overmyer,J.P., D.R. Rouse, J.K. Avants, A.W. Garrison, M.E. DeLorenzo, K.W. Chung, P.B. Key, W.A. Wilson, and M.C. Black (2007) Toxicity of Fipronil and Its Enantiomers to Marine and Freshwater Non-Targets J. Environ. Sci. Health Part B Pestic. Food Contam. Agric. Wastes42(5): 471-480.","1093","S+ enantiomer","Fipronil 98% pure","OK to use"]
["Freshwater/non-metal/non- plant","1093-2",77,0.84615384615384615,"","Procambarus clarkii","Adult (7.1-10.5cm length)","96hr","LC50","Mortality","163.50 ug/L","Macroinvertebrate","Arthropoda","Malacostraca","moderately hard water",20,"Acute ","Not stated","N.A.","Overmyer,J.P., D.R. Rouse, J.K. Avants, A.W. Garrison, M.E. DeLorenzo, K.W. Chung, P.B. Key, W.A. Wilson, and M.C. Black (2007) Toxicity of Fipronil and Its Enantiomers to Marine and Freshwater Non-Targets J. Environ. Sci. Health Part B Pestic. Food Contam. Agric. Wastes42(5): 471-480.","1093","R- enantiomer","Fipronil 98% pure","OK to use"]
["Freshwater/non-metal/non- plant","1093-3",77,0.84615384615384615,"","Xenopus laevis","tadpole","96hr","LC50","Mortality","850.0ug/L","Amphibian","Chordata","Amphibia","dechlorinated water",25,"Acute ","Not stated","N.A.","Overmyer,J.P., D.R. Rouse, J.K. Avants, A.W. Garrison, M.E. DeLorenzo, K.W. Chung, P.B. Key, W.A. Wilson, and M.C. Black (2007) Toxicity of Fipronil and Its Enantiomers to Marine and Freshwater Non-Targets J. Environ. Sci. Health Part B Pestic. Food Contam. Agric. Wastes42(5): 471-480.","1093","Racemate","Fipronil 98% pure","OK to use"]
["Freshwater/non-metal/non- plant","1093-3",77,0.84615384615384615,"","Xenopus laevis","tadpole","96hr","LC50","Mortality","910 ug/L","Amphibian","Chordata","Amphibia","dechlorinated water",25,"Acute ","Not stated","N.A.","Overmyer,J.P., D.R. Rouse, J.K. Avants, A.W. Garrison, M.E. DeLorenzo, K.W. Chung, P.B. Key, W.A. Wilson, and M.C. Black (2007) Toxicity of Fipronil and Its Enantiomers to Marine and Freshwater Non-Targets J. Environ. Sci. Health Part B Pestic. Food Contam. Agric. Wastes42(5): 471-480.","1093","S+ enantiomer","Fipronil 98% pure","OK to use"]
["Freshwater/non-metal/non- plant","1093-3",77,0.84615384615384615,"","Xenopus laevis","tadpole","96hr","LC50","Mortality","1140.0ug/L","Amphibian","Chordata","Amphibia","dechlorinated water",25,"Acute ","Not stated","N.A.","Overmyer,J.P., D.R. Rouse, J.K. Avants, A.W. Garrison, M.E. DeLorenzo, K.W. Chung, P.B. Key, W.A. Wilson, and M.C. Black (2007) Toxicity of Fipronil and Its Enantiomers to Marine and Freshwater Non-Targets J. Environ. Sci. Health Part B Pestic. Food Contam. Agric. Wastes42(5): 471-480.","1093","R- enantiomer","Fipronil 98% pure","OK to use"]
["MEW_nonplant","1093-3",78,0.82978723404255317,"","Palaemonetes pugio","adult","96hr","LC50","Mortality","0.32ug/L","Macroinvertebrate","Arthropoda","Malacostraca","seawater",25,"Acute","Not stated",20,"Overmyer,J.P., D.R. Rouse, J.K. Avants, A.W. Garrison, M.E. DeLorenzo, K.W. Chung, P.B. Key, W.A. Wilson, and M.C. Black (2007) Toxicity of Fipronil and Its Enantiomers to Marine and Freshwater Non-Targets J. Environ. Sci. Health Part B Pestic. Food Contam. Agric. Wastes42(5): 471-480.","1093","Do Not Use - Value is a reference from another Paper: Key et al","Not using","Do not use"]
["MEW_nonplant","1093-3",78,0.82978723404255317,"","Palaemonetes pugio","adult","96hr","LC50","Mortality","0.37ug/L","Macroinvertebrate","Arthropoda","Malacostraca","seawater",25,"Acute","Not stated",20,"Overmyer,J.P., D.R. Rouse, J.K. Avants, A.W. Garrison, M.E. DeLorenzo, K.W. Chung, P.B. Key, W.A. Wilson, and M.C. Black (2007) Toxicity of Fipronil and Its Enantiomers to Marine and Freshwater Non-Targets J. Environ. Sci. Health Part B Pestic. Food Contam. Agric. Wastes42(5): 471-480.","1093","S+ enantiomer","Fipronil 98% pure","OK to use"]
["MEW_nonplant","1093-3",78,0.82978723404255317,"","Palaemonetes pugio","adult","96hr","LC50","Mortality","0.32ug/L","Macroinvertebrate","Arthropoda","Malacostraca","seawater",25,"Acute","Not stated",20,"Overmyer,J.P., D.R. Rouse, J.K. Avants, A.W. Garrison, M.E. DeLorenzo, K.W. Chung, P.B. Key, W.A. Wilson, and M.C. Black (2007) Toxicity of Fipronil and Its Enantiomers to Marine and Freshwater Non-Targets J. Environ. Sci. Health Part B Pestic. Food Contam. Agric. Wastes42(5): 471-480.","1093","R- enantiomer","Fipronil 98% pure","OK to use"]
["MEW_nonplant","1093-4",78,0.82978723404255317,"","Palaemonetes pugio","1-2day old larvae","96hr","LC50","Mortality","0.68ug/L","Macroinvertebrate","Arthropoda","Malacostraca","seawater",25,"Acute","Not stated",20,"Overmyer,J.P., D.R. Rouse, J.K. Avants, A.W. Garrison, M.E. DeLorenzo, K.W. Chung, P.B. Key, W.A. Wilson, and M.C. Black (2007) Toxicity of Fipronil and Its Enantiomers to Marine and Freshwater Non-Targets J. Environ. Sci. Health Part B Pestic. Food Contam. Agric. Wastes42(5): 471-480.","1093","Do Not Use - Value is a reference from another Paper: Key et al","Not using","Do not use"]
["MEW_nonplant","1093-4",78,0.82978723404255317,"","Palaemonetes pugio","1-2day old larvae","96hr","LC50","Mortality","0.54 ug/L","Macroinvertebrate","Arthropoda","Malacostraca","seawater",25,"Acute","Not stated",20,"Overmyer,J.P., D.R. Rouse, J.K. Avants, A.W. Garrison, M.E. DeLorenzo, K.W. Chung, P.B. Key, W.A. Wilson, and M.C. Black (2007) Toxicity of Fipronil and Its Enantiomers to Marine and Freshwater Non-Targets J. Environ. Sci. Health Part B Pestic. Food Contam. Agric. Wastes42(5): 471-480.","1093","S+ enantiomer","Fipronil 98% pure","OK to use"]
["MEW_nonplant","1093-4",78,0.82978723404255317,"","Palaemonetes pugio","1-2day old larvae","96hr","LC50","Mortality","0.35 ug/L","Macroinvertebrate","Arthropoda","Malacostraca","seawater",25,"Acute","Not stated",20,"Overmyer,J.P., D.R. Rouse, J.K. Avants, A.W. Garrison, M.E. DeLorenzo, K.W. Chung, P.B. Key, W.A. Wilson, and M.C. Black (2007) Toxicity of Fipronil and Its Enantiomers to Marine and Freshwater Non-Targets J. Environ. Sci. Health Part B Pestic. Food Contam. Agric. Wastes42(5): 471-480.","1093","R- enantiomer","Fipronil 98% pure","OK to use"]
["MEW_nonplant","1093-5",78,0.82978723404255317,"","Palaemonetes pugio","stage VI embryo","96hr","LC50","Mortality",">512 ug/L","Macroinvertebrate","Arthropoda","Malacostraca","20um filtered seawater",27,"Acute","Not stated",20,"Overmyer,J.P., D.R. Rouse, J.K. Avants, A.W. Garrison, M.E. DeLorenzo, K.W. Chung, P.B. Key, W.A. Wilson, and M.C. Black (2007) Toxicity of Fipronil and Its Enantiomers to Marine and Freshwater Non-Targets J. Environ. Sci. Health Part B Pestic. Food Contam. Agric. Wastes42(5): 471-480.","1093","Do Not Use - No LC50 obtained","Not using","Do not use"]
["MEW_nonplant","1093-6",78,0.82978723404255317,"","Mercenaria mercenaria","juvenile (212-350um)","96hr","LC50","Mortality","177.0 ug/L","Macroinvertebrate","Arthropoda","Malacostraca","seawater",20,"Acute","Not stated",30,"Overmyer,J.P., D.R. Rouse, J.K. Avants, A.W. Garrison, M.E. DeLorenzo, K.W. Chung, P.B. Key, W.A. Wilson, and M.C. Black (2007) Toxicity of Fipronil and Its Enantiomers to Marine and Freshwater Non-Targets J. Environ. Sci. Health Part B Pestic. Food Contam. Agric. Wastes42(5): 471-480.","1093","Racemate","Fipronil 98% pure","OK to use"]
["MEW_nonplant","1093-6",78,0.82978723404255317,"","Mercenaria mercenaria","juvenile (212-350um)","96hr","LC50","Mortality","208.0 ug/L","Macroinvertebrate","Arthropoda","Malacostraca","seawater",20,"Acute","Not stated",30,"Overmyer,J.P., D.R. Rouse, J.K. Avants, A.W. Garrison, M.E. DeLorenzo, K.W. Chung, P.B. Key, W.A. Wilson, and M.C. Black (2007) Toxicity of Fipronil and Its Enantiomers to Marine and Freshwater Non-Targets J. Environ. Sci. Health Part B Pestic. Food Contam. Agric. Wastes42(5): 471-480.","1093","S+ enantiomer","Fipronil 98% pure","OK to use"]
["MEW_nonplant","1093-6",78,0.82978723404255317,"","Mercenaria mercenaria","juvenile (212-350um)","96hr","LC50","Mortality","187.0 ug/L","Macroinvertebrate","Arthropoda","Malacostraca","seawater",20,"Acute","Not stated",30,"Overmyer,J.P., D.R. Rouse, J.K. Avants, A.W. Garrison, M.E. DeLorenzo, K.W. Chung, P.B. Key, W.A. Wilson, and M.C. Black (2007) Toxicity of Fipronil and Its Enantiomers to Marine and Freshwater Non-Targets J. Environ. Sci. Health Part B Pestic. Food Contam. Agric. Wastes42(5): 471-480.","1093","R- enantiomer","Fipronil 98% pure","OK to use"]
["MEW_plant","1093-7",73,0.80219780219780223,"","Dunaliella tertiolecta","log phase growth","96 hrs","EC50","Population growth rate: Cellular biovolume (dimension of cells & no. of cells)","631.2ug/L","Microalga","Chlorophyta","Chlorophyceae","F/2 marine media",25,"Chronic","Not stated",20,"Overmyer,J.P., D.R. Rouse, J.K. Avants, A.W. Garrison, M.E. DeLorenzo, K.W. Chung, P.B. Key, W.A. Wilson, and M.C. Black (2007) Toxicity of Fipronil and Its Enantiomers to Marine and Freshwater Non-Targets J. Environ. Sci. Health Part B Pestic. Food Contam. Agric. Wastes42(5): 471-480.","1093","Racemate","Fipronil 98% pure","OK to use"]
["MEW_plant","1093-8",73,0.80219780219780223,"","Dunaliella tertiolecta","log phase growth","96 hrs","NOEC","Population growth rate: Cellular biovolume (dimension of cells & no. of cells)","250ug/L","Microalga","Chlorophyta","Chlorophyceae","F/2 marine media",25,"Chronic","Not stated",20,"Overmyer,J.P., D.R. Rouse, J.K. Avants, A.W. Garrison, M.E. DeLorenzo, K.W. Chung, P.B. Key, W.A. Wilson, and M.C. Black (2007) Toxicity of Fipronil and Its Enantiomers to Marine and Freshwater Non-Targets J. Environ. Sci. Health Part B Pestic. Food Contam. Agric. Wastes42(5): 471-480.","1093","Racemate","Fipronil 98% pure","OK to use"]
["MEW_plant","1093-9",73,0.80219780219780223,"","Dunaliella tertiolecta","log phase growth","96 hrs","LOEC","Population growth rate: Cellular biovolume (dimension of cells & no. of cells)","500ug/L","Microalga","Chlorophyta","Chlorophyceae","F/2 marine media",25,"Chronic","Not stated",20,"Overmyer,J.P., D.R. Rouse, J.K. Avants, A.W. Garrison, M.E. DeLorenzo, K.W. Chung, P.B. Key, W.A. Wilson, and M.C. Black (2007) Toxicity of Fipronil and Its Enantiomers to Marine and Freshwater Non-Targets J. Environ. Sci. Health Part B Pestic. Food Contam. Agric. Wastes42(5): 471-480.","1093","Racemate","Fipronil 98% pure","OK to use"]
["MEW_plant","1093-HA",73,0.80219780219780223,"Highest concentration tested","Dunaliella tertiolecta","log phase growth","96 hrs","NOEC","Population growth rate: Cell density (cell count)","1000ug/L","Microalga","Chlorophyta","Chlorophyceae","F/2 marine media",25,"Chronic","Not stated",20,"Overmyer,J.P., D.R. Rouse, J.K. Avants, A.W. Garrison, M.E. DeLorenzo, K.W. Chung, P.B. Key, W.A. Wilson, and M.C. Black (2007) Toxicity of Fipronil and Its Enantiomers to Marine and Freshwater Non-Targets J. Environ. Sci. Health Part B Pestic. Food Contam. Agric. Wastes42(5): 471-480.","1093","Racemate","Fipronil 98% pure","OK to use"]
["MEW_plant","1093-HA",73,0.80219780219780223,"Highest concentration tested","Dunaliella tertiolecta","log phase growth","96 hrs","NOEC","Population growth rate: (divisions/day)","1000ug/L","Microalga","Chlorophyta","Chlorophyceae","F/2 marine media",25,"Chronic","Not stated",20,"Overmyer,J.P., D.R. Rouse, J.K. Avants, A.W. Garrison, M.E. DeLorenzo, K.W. Chung, P.B. Key, W.A. Wilson, and M.C. Black (2007) Toxicity of Fipronil and Its Enantiomers to Marine and Freshwater Non-Targets J. Environ. Sci. Health Part B Pestic. Food Contam. Agric. Wastes42(5): 471-480.","1093","Racemate","Fipronil 98% pure","OK to use"]
["MEW_plant","1093-9",73,0.80219780219780223,"Highest concentration - at higher concentrations, Fipronil precipitated out of solution","Dunaliella tertiolecta","log phase growth","96 hrs","NOEC","Population growth rate: Cellular biovolume (dimension of cells & no. of cells)","1600 ug/L","Microalga","Chlorophyta","Chlorophyceae","F/2 marine media",25,"Chronic","Not stated",20,"Overmyer,J.P., D.R. Rouse, J.K. Avants, A.W. Garrison, M.E. DeLorenzo, K.W. Chung, P.B. Key, W.A. Wilson, and M.C. Black (2007) Toxicity of Fipronil and Its Enantiomers to Marine and Freshwater Non-Targets J. Environ. Sci. Health Part B Pestic. Food Contam. Agric. Wastes42(5): 471-480.","1093","S+ enantiomer","Fipronil 98% pure","OK to use"]
["MEW_plant","1093-HA",73,0.80219780219780223,"Highest concentration - at higher concentrations, Fipronil precipitated out of solution","Dunaliella tertiolecta","log phase growth","96 hrs","NOEC","Population growth rate: Cell density (cell count)","1600 ug/L","Microalga","Chlorophyta","Chlorophyceae","F/2 marine media",25,"Chronic","Not stated",20,"Overmyer,J.P., D.R. Rouse, J.K. Avants, A.W. Garrison, M.E. DeLorenzo, K.W. Chung, P.B. Key, W.A. Wilson, and M.C. Black (2007) Toxicity of Fipronil and Its Enantiomers to Marine and Freshwater Non-Targets J. Environ. Sci. Health Part B Pestic. Food Contam. Agric. Wastes42(5): 471-480.","1093","S+ enantiomer","Fipronil 98% pure","OK to use"]
["MEW_plant","1093-HA",73,0.80219780219780223,"Highest concentration - at higher concentrations, Fipronil precipitated out of solution","Dunaliella tertiolecta","log phase growth","96 hrs","NOEC","Population growth rate: (divisions/day)","1600 ug/L","Microalga","Chlorophyta","Chlorophyceae","F/2 marine media",25,"Chronic","Not stated",20,"Overmyer,J.P., D.R. Rouse, J.K. Avants, A.W. Garrison, M.E. DeLorenzo, K.W. Chung, P.B. Key, W.A. Wilson, and M.C. Black (2007) Toxicity of Fipronil and Its Enantiomers to Marine and Freshwater Non-Targets J. Environ. Sci. Health Part B Pestic. Food Contam. Agric. Wastes42(5): 471-480.","1093","S+ enantiomer","Fipronil 98% pure","OK to use"]
["MEW_plant","1093-9",73,0.80219780219780223,"Highest concentration - at higher concentrations, Fipronil precipitated out of solution","Dunaliella tertiolecta","log phase growth","96 hrs","NOEC","Population growth rate: Cellular biovolume (dimension of cells & no. of cells)","1600 ug/L","Microalga","Chlorophyta","Chlorophyceae","F/2 marine media",25,"Chronic","Not stated",20,"Overmyer,J.P., D.R. Rouse, J.K. Avants, A.W. Garrison, M.E. DeLorenzo, K.W. Chung, P.B. Key, W.A. Wilson, and M.C. Black (2007) Toxicity of Fipronil and Its Enantiomers to Marine and Freshwater Non-Targets J. Environ. Sci. Health Part B Pestic. Food Contam. Agric. Wastes42(5): 471-480.","1093","R- enantiomer","Fipronil 98% pure","OK to use"]
["MEW_plant","1093-HA",73,0.80219780219780223,"Highest concentration - at higher concentrations, Fipronil precipitated out of solution","Dunaliella tertiolecta","log phase growth","96 hrs","NOEC","Population growth rate: Cell density (cell count)","1600 ug/L","Microalga","Chlorophyta","Chlorophyceae","F/2 marine media",25,"Chronic","Not stated",20,"Overmyer,J.P., D.R. Rouse, J.K. Avants, A.W. Garrison, M.E. DeLorenzo, K.W. Chung, P.B. Key, W.A. Wilson, and M.C. Black (2007) Toxicity of Fipronil and Its Enantiomers to Marine and Freshwater Non-Targets J. Environ. Sci. Health Part B Pestic. Food Contam. Agric. Wastes42(5): 471-480.","1093","R- enantiomer","Fipronil 98% pure","OK to use"]
["MEW_plant","1093-HA",73,0.80219780219780223,"Highest concentration - at higher concentrations, Fipronil precipitated out of solution","Dunaliella tertiolecta","log phase growth","96 hrs","NOEC","Population growth rate: (divisions/day)","1600 ug/L","Microalga","Chlorophyta","Chlorophyceae","F/2 marine media",25,"Chronic","Not stated",20,"Overmyer,J.P., D.R. Rouse, J.K. Avants, A.W. Garrison, M.E. DeLorenzo, K.W. Chung, P.B. Key, W.A. Wilson, and M.C. Black (2007) Toxicity of Fipronil and Its Enantiomers to Marine and Freshwater Non-Targets J. Environ. Sci. Health Part B Pestic. Food Contam. Agric. Wastes42(5): 471-480.","1093","R- enantiomer","Fipronil 98% pure","OK to use"]
["MEW_nonplant","1063-1-OK",56,0.5957446808510638,"The highest possible grade for this datum is acceptable.","Amphiascus tenuiremis","Larvae (Naupliar <24 hours old)","32d (3 brood)","NOEC","Survival to adult","0.25 ug/L","Microinvertebrate","Arthropoda","Maxillopoda","Filtered synthetic seawater","25 °C","Chronic","Not stated","Not stated","Chandler,G.T., T.L. Cary, A.C. Bejarano, J. Pender, and J.L. Ferry (2004) Population Consequences of Fipronil and Degradates to Copepods at Field Concentrations: An Integration of Life Cycle Testing with Leslie Matrix Population Modeling Environ. Sci. Technol.38(23): 6407-6414","1063",null,"Technical grade fipronil (98.0% pure)","OK to use"]
["MEW_nonplant","1063-2-OK",56,0.5957446808510638,"The highest possible grade for this datum is acceptable.","Amphiascus tenuiremis","Larvae (Naupliar <24 hours old)","32d (3 brood)","LOEC","Survival to adult","0.5 ug/L","Microinvertebrate","Arthropoda","Maxillopoda","Filtered synthetic seawater","25 °C","Chronic","Not stated","Not stated","Chandler,G.T., T.L. Cary, A.C. Bejarano, J. Pender, and J.L. Ferry (2004) Population Consequences of Fipronil and Degradates to Copepods at Field Concentrations: An Integration of Life Cycle Testing with Leslie Matrix Population Modeling Environ. Sci. Technol.38(23): 6407-6414","1063",null,"Technical grade fipronil (98.0% pure)","OK to use"]
["MEW_nonplant","1063-3-OK",65,0.69148936170212771,"The highest possible grade for this datum is acceptable.","Amphiascus tenuiremis","Adult","12 days","LOEC","Reproduction: Fertility","0.25 ug/L","Microinvertebrate","Arthropoda","Maxillopoda","Filtered synthetic seawater","25 °C","Chronic","Not stated","Not stated","Chandler,G.T., T.L. Cary, A.C. Bejarano, J. Pender, and J.L. Ferry (2004) Population Consequences of Fipronil and Degradates to Copepods at Field Concentrations: An Integration of Life Cycle Testing with Leslie Matrix Population Modeling Environ. Sci. Technol.38(23): 6407-6414","1063",null,"Technical grade fipronil (98.0% pure)","OK to use"]
["MEW_nonplant","1063-4-OK",65,0.69148936170212771,"The highest possible grade for this datum is acceptable.","Amphiascus tenuiremis","Adult","12 days","NOEC","Reproduction: Fercundity","0.5 ug/L","Microinvertebrate","Arthropoda","Maxillopoda","Filtered synthetic seawater","25 °C","Chronic","Not stated","Not stated","Chandler,G.T., T.L. Cary, A.C. Bejarano, J. Pender, and J.L. Ferry (2004) Population Consequences of Fipronil and Degradates to Copepods at Field Concentrations: An Integration of Life Cycle Testing with Leslie Matrix Population Modeling Environ. Sci. Technol.38(23): 6407-6414","1063",null,"Technical grade fipronil (98.0% pure)","OK to use"]
["MEW_nonplant","1084-1-OK",60,0.63829787234042556,"","Palaemonetes pugio","Adult","45 day","NOEC","Adult survival","97.90 ng/L","Macroinvertebrate","Arthropoda","Malacostraca","filtered seawater","23.2 ± 0.4°C","Chronic","8 ± 0.2","20.3 ± 0.4 ppt","Volz,D.C., E.F. Wirth, M.H. Fulton, G.I. Scott, E. Strozier, D.S. Block, J.L. Ferry, S.S. Walse, and G.T. Chandler (2003) Effects of Fipronil and Chlorpyrifos on Endocrine-Related Endpoints in Female Grass Shrimp (Palaemonetes pugio) Bull. Environ. Contam. Toxicol.71(3): 497-503","1084",null,"Technical grade fipronil 98.0%","OK to use"]
["MEW_nonplant","1084-2-OK",60,0.63829787234042556,"","Palaemonetes pugio","Adult","45 day","LOEC","Adult survival","142.98 ng/L","Macroinvertebrate","Arthropoda","Malacostraca","filtered seawater","23.2 ± 0.4°C","Chronic","8 ± 0.2","20.3 ± 0.4 ppt","Volz,D.C., E.F. Wirth, M.H. Fulton, G.I. Scott, E. Strozier, D.S. Block, J.L. Ferry, S.S. Walse, and G.T. Chandler (2003) Effects of Fipronil and Chlorpyrifos on Endocrine-Related Endpoints in Female Grass Shrimp (Palaemonetes pugio) Bull. Environ. Contam. Toxicol.71(3): 497-503","1084",null,"Technical grade fipronil 98.0%","OK to use"]
["MEW_nonplant","1084-3-OK",60,0.63829787234042556,"","Palaemonetes pugio","Adult (Gravid female)","45 day","NOEC","Growth: Body weight","97.90 ng/L","Macroinvertebrate","Arthropoda","Malacostraca","filtered seawater","23.2 ± 0.4°C","Chronic","8 ± 0.2","20.3 ± 0.4 ppt","Volz,D.C., E.F. Wirth, M.H. Fulton, G.I. Scott, E. Strozier, D.S. Block, J.L. Ferry, S.S. Walse, and G.T. Chandler (2003) Effects of Fipronil and Chlorpyrifos on Endocrine-Related Endpoints in Female Grass Shrimp (Palaemonetes pugio) Bull. Environ. Contam. Toxicol.71(3): 497-503","1084",null,"Technical grade fipronil 98.0%","OK to use"]
["MEW_nonplant","1084-4-OK",60,0.63829787234042556,"","Palaemonetes pugio","Adult (Gravid female)","45 day","NOEC","Growth: Body length","97.90 ng/L","Macroinvertebrate","Arthropoda","Malacostraca","filtered seawater","23.2 ± 0.4°C","Chronic","8 ± 0.2","20.3 ± 0.4 ppt","Volz,D.C., E.F. Wirth, M.H. Fulton, G.I. Scott, E. Strozier, D.S. Block, J.L. Ferry, S.S. Walse, and G.T. Chandler (2003) Effects of Fipronil and Chlorpyrifos on Endocrine-Related Endpoints in Female Grass Shrimp (Palaemonetes pugio) Bull. Environ. Contam. Toxicol.71(3): 497-503","1084",null,"Technical grade fipronil 98.0%","OK to use"]
["MEW_nonplant","1088-1-OK",65,0.69148936170212771,"Highest concentration tested","Crassostrea virginica","Not stated","28 day","NOEC","Survival","5000 ng/L","Macroinvertebrate","Mollusca","Bivalvia","Natural seawater","28.5-31.1°C","Chronic","7.7-8.1","20.4-22.8‰","Wirth,E.F., P.L. Pennington, J.C. Lawton, M.E. DeLorenzo, D. Bearden, B. Shaddrix, S. Sivertsen, and M.H. Fulton (2004) The Effects of the Contemporary-Use Insecticide (Fipronil) in an Estuarine Mesocosm Environ. Pollut.131(3): 365-371 ","1088","Do Not Use - Unknown purity","Purity not stated","Do not use"]
["MEW_nonplant","1088-2-OK",70,0.74468085106382975,"Highest concentration tested","Crassostrea virginica","Not stated","28 day","NOEC","Growth: Wet weight","5000 ng/L","Macroinvertebrate","Mollusca","Bivalvia","Natural seawater","28.5-31.1°C","Chronic","7.7-8.1","20.4-22.8‰","Wirth,E.F., P.L. Pennington, J.C. Lawton, M.E. DeLorenzo, D. Bearden, B. Shaddrix, S. Sivertsen, and M.H. Fulton (2004) The Effects of the Contemporary-Use Insecticide (Fipronil) in an Estuarine Mesocosm Environ. Pollut.131(3): 365-371 ","1088","Do Not Use - Unknown purity","Purity not stated","Do not use"]
["MEW_nonplant","1088-3-OK",70,0.74468085106382975,"","Crassostrea virginica","Not stated","28 day","LOEC","Growth: Shell length","5000 ng/L","Macroinvertebrate","Mollusca","Bivalvia","Natural seawater","28.5-31.1°C","Chronic","7.7-8.1","20.4-22.8‰","Wirth,E.F., P.L. Pennington, J.C. Lawton, M.E. DeLorenzo, D. Bearden, B. Shaddrix, S. Sivertsen, and M.H. Fulton (2004) The Effects of the Contemporary-Use Insecticide (Fipronil) in an Estuarine Mesocosm Environ. Pollut.131(3): 365-371 ","1088","Do Not Use - Unknown purity","Purity not stated","Do not use"]
["MEW_nonplant","1088-4-OK",70,0.74468085106382975,"","Crassostrea virginica","Not stated","28 day","NOEC","Growth: Shell length","355 ng/L","Macroinvertebrate","Mollusca","Bivalvia","Natural seawater","28.5-31.1°C","Chronic","7.7-8.1","20.4-22.8‰","Wirth,E.F., P.L. Pennington, J.C. Lawton, M.E. DeLorenzo, D. Bearden, B. Shaddrix, S. Sivertsen, and M.H. Fulton (2004) The Effects of the Contemporary-Use Insecticide (Fipronil) in an Estuarine Mesocosm Environ. Pollut.131(3): 365-371 ","1088","Do Not Use - Unknown purity","Purity not stated","Do not use"]
["MEW_nonplant","1088-5-OK",65,0.69148936170212771,"Highest concentration tested","Mercenaria mercenaria","Juvenile","28 day","NOEC","Survival","5000 ng/L","Macroinvertebrate","Mollusca","Bivalvia","Natural seawater","28.5-31.1°C","Chronic","7.7-8.1","20.4-22.8‰","Wirth,E.F., P.L. Pennington, J.C. Lawton, M.E. DeLorenzo, D. Bearden, B. Shaddrix, S. Sivertsen, and M.H. Fulton (2004) The Effects of the Contemporary-Use Insecticide (Fipronil) in an Estuarine Mesocosm Environ. Pollut.131(3): 365-371 ","1088","Do Not Use - Unknown purity","Purity not stated","Do not use"]
["MEW_nonplant","1088-6-OK",65,0.69148936170212771,"Highest concentration tested","Mercenaria mercenaria","Juvenile","28 day","NOEC","Growth: Wet weight","5000 ng/L","Macroinvertebrate","Mollusca","Bivalvia","Natural seawater","28.5-31.1°C","Chronic","7.7-8.1","20.4-22.8‰","Wirth,E.F., P.L. Pennington, J.C. Lawton, M.E. DeLorenzo, D. Bearden, B. Shaddrix, S. Sivertsen, and M.H. Fulton (2004) The Effects of the Contemporary-Use Insecticide (Fipronil) in an Estuarine Mesocosm Environ. Pollut.131(3): 365-371 ","1088","Do Not Use - Unknown purity","Purity not stated","Do not use"]
["MEW_nonplant","1088-7-OK",65,0.69148936170212771,"Highest concentration tested","Mercenaria mercenaria","Juvenile","28 day","NOEC","Growth: Shell area","5000 ng/L","Macroinvertebrate","Mollusca","Bivalvia","Natural seawater","28.5-31.1°C","Chronic","7.7-8.1","20.4-22.8‰","Wirth,E.F., P.L. Pennington, J.C. Lawton, M.E. DeLorenzo, D. Bearden, B. Shaddrix, S. Sivertsen, and M.H. Fulton (2004) The Effects of the Contemporary-Use Insecticide (Fipronil) in an Estuarine Mesocosm Environ. Pollut.131(3): 365-371 ","1088","Do Not Use - Unknown purity","Purity not stated","Do not use"]
["MEW_nonplant","1088-8-OK",65,0.69148936170212771,"","Palaemonetes pugio","6 months old","28 day","NOEC","Survival","150 ng/L","Macroinvertebrate","Arthropoda","Malacostraca","Natural seawater","28.5-31.1°C","Chronic","7.7-8.1","20.4-22.8‰","Wirth,E.F., P.L. Pennington, J.C. Lawton, M.E. DeLorenzo, D. Bearden, B. Shaddrix, S. Sivertsen, and M.H. Fulton (2004) The Effects of the Contemporary-Use Insecticide (Fipronil) in an Estuarine Mesocosm Environ. Pollut.131(3): 365-371 ","1088","Do Not Use - Unknown purity","Purity not stated","Do not use"]
["MEW_nonplant","1088-9-OK",65,0.69148936170212771,"","Palaemonetes pugio","6 months old","28 day","LOEC","Survival","355 ng/L","Macroinvertebrate","Arthropoda","Malacostraca","Natural seawater","28.5-31.1°C","Chronic","7.7-8.1","20.4-22.8‰","Wirth,E.F., P.L. Pennington, J.C. Lawton, M.E. DeLorenzo, D. Bearden, B. Shaddrix, S. Sivertsen, and M.H. Fulton (2004) The Effects of the Contemporary-Use Insecticide (Fipronil) in an Estuarine Mesocosm Environ. Pollut.131(3): 365-371 ","1088","Do Not Use - Unknown purity","Purity not stated","Do not use"]
["MEW_nonplant","1088-10-OK",70,0.74468085106382975,"","Palaemonetes pugio","6 months old","28 day","LC50","Survival","357 ng/L","Macroinvertebrate","Arthropoda","Malacostraca","Natural seawater","28.5-31.1°C","Chronic","7.7-8.1","20.4-22.8‰","Wirth,E.F., P.L. Pennington, J.C. Lawton, M.E. DeLorenzo, D. Bearden, B. Shaddrix, S. Sivertsen, and M.H. Fulton (2004) The Effects of the Contemporary-Use Insecticide (Fipronil) in an Estuarine Mesocosm Environ. Pollut.131(3): 365-371 ","1088","Do Not Use - Unknown purity","Purity not stated","Do not use"]
["MEW_nonplant","1088-11-OK",73,0.77659574468085102,"","Palaemonetes pugio","6 months old","7 days","NOEC","Survival: Persistence of toxicity","150 ng/L","Macroinvertebrate","Arthropoda","Malacostraca","Natural seawater","28.5-31.1°C","Acute","7.7-8.1","20.4-22.8‰","Wirth,E.F., P.L. Pennington, J.C. Lawton, M.E. DeLorenzo, D. Bearden, B. Shaddrix, S. Sivertsen, and M.H. Fulton (2004) The Effects of the Contemporary-Use Insecticide (Fipronil) in an Estuarine Mesocosm Environ. Pollut.131(3): 365-371 ","1088","Do Not Use - Unknown purity","Purity not stated","Do not use"]
["MEW_nonplant","1088-12-OK",73,0.77659574468085102,"","Palaemonetes pugio","6 months old","7 days","LOEC","Survival: Persistence of toxicity","355 ng/L","Macroinvertebrate","Arthropoda","Malacostraca","Natural seawater","28.5-31.1°C","Acute","7.7-8.1","20.4-22.8‰","Wirth,E.F., P.L. Pennington, J.C. Lawton, M.E. DeLorenzo, D. Bearden, B. Shaddrix, S. Sivertsen, and M.H. Fulton (2004) The Effects of the Contemporary-Use Insecticide (Fipronil) in an Estuarine Mesocosm Environ. Pollut.131(3): 365-371 ","1088","Do Not Use - Unknown purity","Purity not stated","Do not use"]
["MEW_nonplant","1088-13-OK",70,0.74468085106382975,"Highest concentration tested","Cyprinidon variegatus","Juvenile","28 day","NOEC","Survival","5000 ng/L","Fish ","Chordata","\tActinopterygii","Natural seawater","28.5-31.1°C","Chronic","7.7-8.1","20.4-22.8‰","Wirth,E.F., P.L. Pennington, J.C. Lawton, M.E. DeLorenzo, D. Bearden, B. Shaddrix, S. Sivertsen, and M.H. Fulton (2004) The Effects of the Contemporary-Use Insecticide (Fipronil) in an Estuarine Mesocosm Environ. Pollut.131(3): 365-371 ","1088","Do Not Use - Unknown purity","Purity not stated","Do not use"]
["MEW_nonplant","1088-14-OK",70,0.74468085106382975,"Highest concentration tested","Cyprinidon variegatus","Juvenile","28 day","NOEC","Growth: Weight","5000 ng/L","Fish ","Chordata","\tActinopterygii","Natural seawater","28.5-31.1°C","Chronic","7.7-8.1","20.4-22.8‰","Wirth,E.F., P.L. Pennington, J.C. Lawton, M.E. DeLorenzo, D. Bearden, B. Shaddrix, S. Sivertsen, and M.H. Fulton (2004) The Effects of the Contemporary-Use Insecticide (Fipronil) in an Estuarine Mesocosm Environ. Pollut.131(3): 365-371 ","1088","Do Not Use - Unknown purity","Purity not stated","Do not use"]
["MEW_nonplant","1088-15-OK",70,0.74468085106382975,"Highest concentration tested","Cyprinidon variegatus","Juvenile","28 day","NOEC","Growth: Length","5000 ng/L","Fish ","Chordata","\tActinopterygii","Natural seawater","28.5-31.1°C","Chronic","7.7-8.1","20.4-22.8‰","Wirth,E.F., P.L. Pennington, J.C. Lawton, M.E. DeLorenzo, D. Bearden, B. Shaddrix, S. Sivertsen, and M.H. Fulton (2004) The Effects of the Contemporary-Use Insecticide (Fipronil) in an Estuarine Mesocosm Environ. Pollut.131(3): 365-371 ","1088","Do Not Use - Unknown purity","Purity not stated","Do not use"]
["MEW_nonplant","1062-1-OK",60,0.63829787234042556,"Only one concentration tested.","Amphiascus tenuiremis ","Stage-I Juveniles","12 days","NOEC","Survival","0.63 ug/L","Microinvertebrate","Arthropoda","Maxillopoda","Filtered synthetic seawater",25,"Chronic","Not stated","30 ppt","Cary,T.L., G.T. Chandler, D.C. Volz, S.S. Walse, and J.L. Ferry (2004) Phenylpyrazole Insecticide Fipronil Induces Male Infertility in the Estuarine Meiobenthic Crustacean Amphiascus tenuiremis Environ. Sci. Technol.38(2): 522-528 ","1062",null,"Technical grade fipronil 98.0%","OK to use"]
["MEW_nonplant","1062-2-OK",55,0.58510638297872342,"Only one concentration tested.","Amphiascus tenuiremis ","Stage-I Juveniles","12 days","NOEC","Reproduction: Viable offspring production","0.63 ug/L","Microinvertebrate","Arthropoda","Maxillopoda","Filtered synthetic seawater",25,"Chronic","Not stated","30 ppt","Cary,T.L., G.T. Chandler, D.C. Volz, S.S. Walse, and J.L. Ferry (2004) Phenylpyrazole Insecticide Fipronil Induces Male Infertility in the Estuarine Meiobenthic Crustacean Amphiascus tenuiremis Environ. Sci. Technol.38(2): 522-528 ","1062",null,"Technical grade fipronil 98.0%","OK to use"]
["MEW_nonplant","1062-3-OK",65,0.73404255319148903,"Only one concentration tested.","Amphiascus tenuiremis ","Stage-I Juveniles","12 days","NOEC","Reproductive success: Mean % brood sac extrusion","0.63 ug/L","Microinvertebrate","Arthropoda","Maxillopoda","Filtered synthetic seawater",25,"Chronic","Not stated","30 ppt","Cary,T.L., G.T. Chandler, D.C. Volz, S.S. Walse, and J.L. Ferry (2004) Phenylpyrazole Insecticide Fipronil Induces Male Infertility in the Estuarine Meiobenthic Crustacean Amphiascus tenuiremis Environ. Sci. Technol.38(2): 522-528 ","1062",null,"Technical grade fipronil 98.0%","OK to use"]
["Freshwater/non-metal/non- plant","1085-1-OK",32,0.35164835164835168,"The highest possible grade for this datum is acceptable.","Danio rerio","Larvae (96 hours post fertilisation)","Not stated (test went until 120 hours post fertilisation)","NOEC","Mortality","160 ug/L","Fish","Chordata","Actinopterygii","essential medium","28 ± 1","N.A.","Not stated","N.A.","Wang,C., Y. Qian, X. Zhang, F. Chen, Q. Zhang, Z. Li, and M. Zhao (2016) A Metabolomic Study of Fipronil for the Anxiety-Like Behavior in Zebrafish Larvae at Environmentally Relevant Levels Environ. Pollut.211:252-258","1085","Do Not Use - Failed QAQC","Not using","Do not use"]
["Freshwater/non-metal/non- plant","1080-1RS",60,0.65934065934065933,"The highest possible grade for this datum is acceptable.","Danio rerio","embryo","5 day","EC50","Body length","0.37 uM","Fish","Chordata","Actinopterygii","Not stated",28.5,"Acute ","Not stated","N.A.","Stehr,C.M., T.L. Linbo, J.P. Incardona, and N.L. Scholz (2006) The Developmental Neurotoxicity of Fipronil: Notochord Degeneration and Locomotor Defects in Zebrafish Embryos and Larvae Toxicol. Sci.92(1): 270-278","1080",null,"98.2% purity","OK to use"]
["Freshwater/non-metal/non- plant","1080-1RS",47,0.51648351648351654,"The highest possible grade for this datum is acceptable.","Danio rerio","embryo","5 day","NOEC","Mortality","2.3 uM = 1 mg/L","Fish","Chordata","Actinopterygii","Not stated",28.5,"Acute ","Not stated","N.A.","Stehr,C.M., T.L. Linbo, J.P. Incardona, and N.L. Scholz (2006) The Developmental Neurotoxicity of Fipronil: Notochord Degeneration and Locomotor Defects in Zebrafish Embryos and Larvae Toxicol. Sci.92(1): 270-278","1080","Passed this paper even though 'NOEC' was not stated, but LOEC was and concentrations that were not significantly different from the control were stated","98.2% purity","OK to use"]
["Freshwater/non-metal/non- plant","1080-1RS",52,0.5714285714285714,"The highest possible grade for this datum is acceptable.","Danio rerio","embryo","5 day","LOEC","Mortality","11 uM = 5 mg/L","Fish","Chordata","Actinopterygii","Not stated",28.5,"Acute ","Not stated","N.A.","Stehr,C.M., T.L. Linbo, J.P. Incardona, and N.L. Scholz (2006) The Developmental Neurotoxicity of Fipronil: Notochord Degeneration and Locomotor Defects in Zebrafish Embryos and Larvae Toxicol. Sci.92(1): 270-278","1080",null,"98.2% purity","OK to use"]
["Freshwater/non-metal/non- plant","??-1",77,0.84615384615384615,"The highest possible grade for this datum is acceptable.","Cheumatopsyche brevilineata","First-instar larvae","48 hr","EC50","Mobility","0.153 ug/L","Macroinvertebrate","Arthropoda","Insecta","Dechlorinated tap water",20,"Acute ","N/A","N.A.","Yokoyama A, Ohtsu K, Iwafune T, Nagai T, Ishihara S, Kobara Y, Horio T and Endo S (2009). A useful new insecticide bioassay using first-instar larvae of a net-spinning caddisfly, Cheumatopsyche brevilineata (Trichoptera: Hydropsychidae), Journal of Pesticide Science, 34(1), 13-20.","??"]
["Freshwater/non-metal/non- plant","yyyy-1",63,0.69230769230769229,"Note: Control mortality not stated for larval tests, therefore fails question 7 which states the data cannot be used.","Culex quinqefasciatus","Larvae (late 4th instar)","48hr","LC50","Mortality","0.00035 PPM","Macroinvertebrate","Arthropoda","Insecta","Tap water","28 + 3","Acute ","Not stated","N.A.","Ali A, Chowdhury MA, Hossain MI, Ameen MU, Habiba DB and Aslam AFM (1999). Laboratory evaluation of selected larvicides and insect growth regulators against field-collected Culex quinquefasciatus larvae from urban Dhaka, Bangladesh, Journal of the American Mosquito Control Association, 15(1), 43-47.","yyyy",null,"Alert - Control mortality not stated for larval tests, therefore fails question 7 which states the data cannot be used."]
["Freshwater/non-metal/non- plant","yyyy-2",63,0.69230769230769229,"Note: Control mortality not stated for larval tests, therefore fails question 7 which states the data cannot be used.","Culex quinqefasciatus","Larvae (late 4th instar)","48hr","LC90","Mortality","0.000896 PPM","Macroinvertebrate","Arthropoda","Insecta","Tap water","28 + 3","Acute ","Not stated","N.A.","Ali A, Chowdhury MA, Hossain MI, Ameen MU, Habiba DB and Aslam AFM (1999). Laboratory evaluation of selected larvicides and insect growth regulators against field-collected Culex quinquefasciatus larvae from urban Dhaka, Bangladesh, Journal of the American Mosquito Control Association, 15(1), 43-47.","yyyy","Do Not Use - EC90 too high","Alert - Control mortality not stated for larval tests, therefore fails question 7 which states the data cannot be used."]
["MEW_plant","NESP-1",91,1,"Buttons weren't working on spreadsheet - however all have been checked and are 100% (NESP REPORT)","Acropora tenuis","Planula larvae","48hr","NEC","Reproductive, failure of planula larvae to metamorphose","12.3  ug/L","Cnidarian","Cnidaria","Anthozoa","Natural, 0.5 µm polypropylene-filtered coastal seawater ","26.7 ± 0.7 °C ","Chronic","8.2 ± 0.1","36 ± 1 psu","Negri, A.P., Templeman, S., Flores, F., van Dam, J., Thomas, M., McKenzie, M., Stapp, L., Kaserzon, S., Mann, R.M., Smith, R., Warne, M.St.J. and Mueller, J. (2020) Ecotoxicology of pesticides on the Great Barrier Reef for guideline development and risk assessments. Final report to the National Environmental Science Program. Reef and Rainforest Research Centre Limited, Cairns (120 pp.).",null,null,"Yes","Yes"]
["MEW_plant","NESP-2",91,1,"Buttons weren't working on spreadsheet - however all have been checked and are 100% (NESP REPORT)","Acropora tenuis","Planula larvae","48hr","EC10","Reproductive, failure of planula larvae to metamorphose","13.9 ug/L","Cnidarian","Cnidaria","Anthozoa","Natural, 0.5 µm polypropylene-filtered coastal seawater ","26.7 ± 0.7 °C ","Chronic","8.2 ± 0.1","36 ± 1 psu","Negri, A.P., Templeman, S., Flores, F., van Dam, J., Thomas, M., McKenzie, M., Stapp, L., Kaserzon, S., Mann, R.M., Smith, R., Warne, M.St.J. and Mueller, J. (2020) Ecotoxicology of pesticides on the Great Barrier Reef for guideline development and risk assessments. Final report to the National Environmental Science Program. Reef and Rainforest Research Centre Limited, Cairns (120 pp.).",null,null,"Yes","Yes"]
["MEW_plant","NESP-3",91,1,"Buttons weren't working on spreadsheet - however all have been checked and are 100% (NESP REPORT)","Acropora tenuis","Planula larvae","48hr","EC50","Reproductive, failure of planula larvae to metamorphose","29.1  ug/L","Cnidarian","Cnidaria","Anthozoa","Natural, 0.5 µm polypropylene-filtered coastal seawater ","26.7 ± 0.7 °C ","Chronic","8.2 ± 0.1","36 ± 1 psu","Negri, A.P., Templeman, S., Flores, F., van Dam, J., Thomas, M., McKenzie, M., Stapp, L., Kaserzon, S., Mann, R.M., Smith, R., Warne, M.St.J. and Mueller, J. (2020) Ecotoxicology of pesticides on the Great Barrier Reef for guideline development and risk assessments. Final report to the National Environmental Science Program. Reef and Rainforest Research Centre Limited, Cairns (120 pp.).",null,null,"Yes","Yes"]
[]
[]
[]
["Konwick et al. 2006 - cannot be used as 1) it only appears they use one test concentration, and; 2) they don't even tell you the test concentration."]
[]
["OPP"]
["RecordID","CHEMICAL","DOC_NUMBER","TAXA","COMMONNAME","TAXONOMIC","AGE","GUIDELINE","AI","STUDYTIME","DOSETYPE","TGL","TOXICITY","TOXLEVEL","NGL","NOEL","Toxicity measure b (Test Endpoint)",null,null,"Test medium","Salinity (‰)","Temp. (°C)","pH","QAQC Check"]
[10072,"Fipronil","2050208","Aquatic Plant","Freshwater diatom","Navicula pelliculosa","N.R.","122-2","96.1","5 D","EC50",">","0.12","PPM","","0.12","Biomass yield, growth rate, area under the growth curve","Growth, Growth rate","Biomass Yield, Growth Rate, AUC","ASTM Type 1 Water","N/A","24 ± 2","7.5 ± 0.1","Not using","Do Not Use - No EC50 value obtained"]
[10072,"Fipronil","2050208","Aquatic Plant","Freshwater diatom","Navicula pelliculosa","N.R.","122-2","96.1","5 D","NOEL",null,0.12,"PPM","",null,"Biomass yield, growth rate, area under the growth curve","Growth, Growth rate","Biomass Yield, Growth Rate, AUC","ASTM Type 1 Water","N/A","24 ± 2","7.5 ± 0.1","≥80% purity"]
[10073,"Fipronil","2050291","Crustacea","Mysid","Americamysis bahia","<24 hr","72-3","96.1","96 hr","LC50","","0.14","PPB","<","0.062","Mortality ","Mortality ","Mortality ","Natural or artificial seawater dilution water or dilution water from area of origin","20 ± 3","25 ± 2 ","Not stated","≥80% purity","NOEC not obtained for this entry - Make this a LOEC value of 0.062 PPB"]
[10073,"Fipronil","2050291","Crustacea","Mysid","Americamysis bahia","<24 hr","72-3","96.1","96 hr","NOEL","<",6.2E-2,"PPB",null,null,"Mortality ","Mortality ","Mortality ","Natural or artificial seawater dilution water or dilution water from area of origin","20 ± 3","25 ± 2 ","Not stated","≥80% purity"]
[10078,"Fipronil MB 46136 metabolite","2050216","Fishes","Bluegill sunfish","Lepomis macrochirus","1.5 g","72-1a","99.2","96 hr","LC50","","25","PPB","","6.7","Mortality ","Mortality ","Mortality ","Clean surface or ground water, reconstituted water","N/A","22 ± 2 ","6.0 - 8.0","≥80% purity"]
[10078,"Fipronil MB 46136 metabolite","2050216","Fishes","Bluegill sunfish","Lepomis macrochirus","1.5 g","72-1a","99.2","96 hr","NOEL","",6.7,"PPB","","6.7","Mortality ","Mortality ","Mortality ","Clean surface or ground water, reconstituted water","N/A","22 ± 2 ","6.0 - 8.0","≥80% purity"]
[10079,"Fipronil","2050217","Fishes","Rainbow trout","Oncorhynchus mykiss","0.98 g","72-1c","100","96 hr","LC50","","246","PPB","","34","Mortality ","Mortality ","Mortality ","Clean surface or ground water, reconstituted water",null,"12 ± 2","6.0-8.0 ","≥80% purity"]
[10079,"Fipronil","2050217","Fishes","Rainbow trout","Oncorhynchus mykiss","0.98 g","72-1c","100","96 hr","NOEL","",34,"PPB","","34","Mortality ","Mortality ","Mortality ","Clean surface or ground water, reconstituted water",null,"12 ± 2","6.0-8.0 ","≥80% purity"]
[10080,"Fipronil","2050202","Fishes","Bluegill sunfish","Lepomis macrochirus","0.22 g","72-1a","100","96 hr","LC50","","83","PPB","","43","Mortality ","Mortality ","Mortality ","Clean surface or ground water, reconstituted water","N/A","22 ± 2 ","6.0 - 8.0","≥80% purity"]
[10080,"Fipronil","2050202","Fishes","Bluegill sunfish","Lepomis macrochirus","0.22 g","72-1a","100","96 hr","NOEL","",43,"PPB","","43","Mortality ","Mortality ","Mortality ","Clean surface or ground water, reconstituted water","N/A","22 ± 2 ","6.0 - 8.0","≥80% purity"]
[10081,"Fipronil MB 46136 metabolite","2050215","Fishes","Rainbow trout","Oncorhynchus mykiss","0.55 g","72-1c","99.2","96 hr","LC50","","39","PPB","","18","Mortality ","Mortality ","Mortality ","Clean surface or ground water, reconstituted water","N/A","12 ± 2","6.0-8.0 ","≥80% purity"]
[10081,"Fipronil MB 46136 metabolite","2050215","Fishes","Rainbow trout","Oncorhynchus mykiss","0.55 g","72-1c","99.2","96 hr","NOEL","",18,"PPB","","18","Mortality ","Mortality ","Mortality ","Clean surface or ground water, reconstituted water","N/A","12 ± 2","6.0-8.0 ","≥80% purity"]
[10082,"Fipronil","2050203","Crustacea","Water flea","Daphnia magna","<24 hr","72-2","100","48 hr","EC50","","190","PPB","","52","Growth of total body length and dry weight","Growth of total body length and dry weight","Body length/ Dry weight","Surface or ground, reconstituted or dechlorinated tap water","N/A","20 ± 2","Not stated","≥80% purity"]
[10082,"Fipronil","2050203","Crustacea","Water flea","Daphnia magna","<24 hr","72-2","100","48 hr","NOEL","",52,"PPB","","52","Growth of total body length and dry weight","Growth of total body length and dry weight","Body length/ Dry weight","Surface or ground, reconstituted or dechlorinated tap water","N/A","20 ± 2","Not stated","≥80% purity"]
[10083,"Fipronil MB 46136 metabolite","2050213","Crustacea","Water flea","Daphnia magna","<24 hr","72-2","100","48 hr","EC50","","29","PPB","<","19","Growth of total body length and dry weight","Growth of total body length and dry weight","Body length/ Dry weight","Surface or ground, reconstituted or dechlorinated tap water","N/A","20 ± 2","Not stated","Degradate not to be used","NOEC not obtained for this entry - Make this a LOEC value of 19 PPB"]
[10083,"Fipronil MB 46136 metabolite","2050213","Crustacea","Water flea","Daphnia magna","<24 hr","72-2","100","48 hr","NOEL","<",19,"PPB",null,null,"Growth of total body length and dry weight","Growth of total body length and dry weight","Body length/ Dry weight","Surface or ground, reconstituted or dechlorinated tap water","N/A","20 ± 2","Not stated","Degradate not to be used"]
[10084,"Fipronil","2050284","Mollusca","Eastern oyster","Crassostrea virginica","SPAT","72-3b","96","96 hr","EC50","","770","PPB","","N.R.","Mortality ","Mortality ","Mortality ","Good quality unfiltered seawater (natural or artificial with food added)",">12",25,"Not stated","≥80% purity"]
[10085,"Fipronil","2050285","Fishes","Sheepshead minnow","Cyprinodon variegatus","0.29 g","72-3","96.1","96 hr","LC50","","130","PPB","","<110","Mortality ","Mortality ","Mortality ","Clean surface or ground water, reconstituted water","20 ± 5",22,"7.5-8.5","≥80% purity","NOEC not obtained for this entry - Make this a LOEC value of 110 PPB"]
[10085,"Fipronil","2050285","Fishes","Sheepshead minnow","Cyprinodon variegatus","0.29 g","72-3","96.1","96 hr","NOEL","<",110,"PPB","",null,"Mortality ","Mortality ","Mortality ","Clean surface or ground water, reconstituted water","20 ± 5",22,"7.5-8.5","≥80% purity"]
[10086,"Fipronil","2050286","Fishes","Rainbow trout","Oncorhynchus mykiss","0.85 g","72-1c","Deg.","96 hr","LC50",">","100","PPB","","36","Mortality ","Mortality ","Mortality ","Clean surface or ground water, reconstituted water","N/A","12 ± 2","6.0-8.0 ","Not using","Do Not Use - No EC50 value obtained"]
[10086,"Fipronil","2050286","Fishes","Rainbow trout","Oncorhynchus mykiss","0.85 g","72-1c","Deg.","96 hr","NOEL",null,36,"PPB","","36","Mortality ","Mortality ","Mortality ","Clean surface or ground water, reconstituted water","N/A","12 ± 2","6.0-8.0 ","Do Not Use"]
[10087,"Fipronil","2050287","Crustacea","Water flea","Daphnia magna","<24 hr","72-2","Deg.","48 hr","EC50",">","100","PPB","","22","Growth of total body length and dry weight","Growth of total body length and dry weight","Body length/ Dry weight","Surface or ground, reconstituted or dechlorinated tap water","N/A","20 ± 2","Not stated","Not using","Do Not Use - No EC50 value obtained"]
[10087,"Fipronil","2050287","Crustacea","Water flea","Daphnia magna","<24 hr","72-2","Deg.","48 hr","NOEL",null,22,"PPB","","22","Growth of total body length and dry weight","Growth of total body length and dry weight","Body length/ Dry weight","Surface or ground, reconstituted or dechlorinated tap water","N/A","20 ± 2","Not stated","Do Not Use"]
[10088,"Fipronil MB 45950 metabolite","2050211","Crustacea","Water flea","Daphnia magna","<24 hr","72-2","100","48 hr","EC50","","100","PPB","<","34","Growth of total body length and dry weight","Growth of total body length and dry weight","Body length/ Dry weight","Surface or ground, reconstituted or dechlorinated tap water","N/A","20 ± 2","Not stated","Degradate not to be used","NOEC not obtained for this entry - Make this a LOEC value of 34 PPB"]
[10088,"Fipronil MB 45950 metabolite","2050211","Crustacea","Water flea","Daphnia magna","<24 hr","72-2","100","48 hr","NOEL","<",34,"PPB",null,null,"Growth of total body length and dry weight","Growth of total body length and dry weight","Body length/ Dry weight","Surface or ground, reconstituted or dechlorinated tap water","N/A","20 ± 2","Not stated","Degradate not to be used"]
[10089,"Fipronil","2050210","Aquatic Plant","Green algae","Selenastrum capricornutum","N.R.","122-2","96.1","5 D","EC50","","0.14","PPM","","N.R.","Biomass yield, growth rate, area under the growth curve","Growth, Growth rate","Biomass Yield, Growth Rate, AUC","ASTM Type 1 Water","N/A","24 ± 2","7.5 ± 0.1","≥80% purity"]
[10090,"Fipronil","2050207","Aquatic Plant","Bluegreen algae","Anabaena flos-aquae","N.R.","122-2","96.1","5 D","EC50",">","0.17","PPM","","0.17","Biomass yield, growth rate, area under the growth curve","Growth, Growth rate","Biomass Yield, Growth Rate, AUC","ASTM Type 1 Water","N/A","25 ± 2","7.5 ± 0.1","Not using","Do Not Use - No EC50 value obtained"]
[10090,"Fipronil","2050207","Aquatic Plant","Bluegreen algae","Anabaena flos-aquae","N.R.","122-2","96.1","5 D","NOEL",null,0.17,"PPM","",null,"Biomass yield, growth rate, area under the growth curve","Growth, Growth rate","Biomass Yield, Growth Rate, AUC","ASTM Type 1 Water","N/A","25 ± 2","7.5 ± 0.1","≥80% purity"]
[10091,"Fipronil","2050209","Aquatic Plant","Marine diatom","Skeletonema costatum","N.R.","122-2","96.1","5 D","EC50",">","0.14","PPM","","0.14","Biomass yield, growth rate, area under the growth curve","Growth, Growth rate","Biomass Yield, Growth Rate, AUC","ASTM Type 1 Water","30 ± 5","20 ± 2","8.0 ± 0.1","Not using","Do Not Use - No EC50 value obtained"]
[10091,"Fipronil","2050209","Aquatic Plant","Marine diatom","Skeletonema costatum","N.R.","122-2","96.1","5 D","NOEL",null,0.14000000000000001,"PPM","",null,"Biomass yield, growth rate, area under the growth curve","Growth, Growth rate","Biomass Yield, Growth Rate, AUC","ASTM Type 1 Water","30 ± 5","20 ± 2","8.0 ± 0.1","≥80% purity"]
[10092,"Fipronil","2050206","Aquatic Plant","Duckweed","Lemna gibba","N.R.","122-2","96.1","5 D","EC50",">","0.1","PPM","","0.1","Biomass yield, growth rate, area under the growth curve","Growth, Growth rate","Biomass Yield, Growth Rate, AUC","M-Hoaglan'ds or 20X-AAP nutrient media. ASTM Type 1 Water","N/A","25 ± 2","4.8-5.2 (M-Hoagland's medium) and 7.5 ± 0.1 (20X-AAP media)","Not using","Do Not Use - No EC50 value obtained"]
[10092,"Fipronil","2050206","Aquatic Plant","Duckweed","Lemna gibba","N.R.","122-2","96.1","5 D","NOEL",null,0.1,"PPM","",null,"Growth rate (number of fronds per day), frond area, dry weight","Growth, growth rate, mortality","Total frond number/Growth rate/Mortality","M-Hoaglan'ds or 20X-AAP nutrient media. ASTM Type 1 Water","N/A","25 ± 2","4.8-5.2 (M-Hoagland's medium) and 7.5 ± 0.1 (20X-AAP media)","≥80% purity"]
[11687,"Fipronil","2050868","Fishes","Channel catfish","Ictalurus punctatus","1.7 g","72-1","97","96 hr","LC50","","560","PPB","","89","Mortality ","Mortality ","Mortality ","Clean surface or ground water, reconstituted water","N/A",22,"6.0-8.0 ","≥80% purity"]
[11687,"Fipronil","2050868","Fishes","Channel catfish","Ictalurus punctatus","1.7 g","72-1","97","96 hr","NOEL","",89,"PPB","","89","Mortality ","Mortality ","Mortality ","Clean surface or ground water, reconstituted water","N/A",22,"6.0-8.0 ","≥80% purity"]
[12555,"Fipronil","2050288","Crustacea","Mysid","Americamysis bahia","LifCyc","72-4b","97.7","28 D","LOEC","","0.005","PPB","<","0.005","Mortality ","Mortality ","Mortality ","Natural or artificial seawater dilution water or dilution water from area of origin","20 ± 3","25 ± 2 ","Not stated","≥80% purity","Use LOEC, Do Not Use NOEC."]
[12556,"Fipronil","2050205","Fishes","Rainbow trout","Oncorhynchus mykiss","ErlyLf","72-4a","96.7","90 D","LOEC","","15","PPB","","6.6","Mortality ","Mortality ","Mortality ","Dilution water","N/A","10 ± 2 (embryos) or 12 ± 2 (larvae/juveniles)","Not stated","≥80% purity"]
[12556,"Fipronil","2050205","Fishes","Rainbow trout","Oncorhynchus mykiss","ErlyLf","72-4a","96.7","90 D","NOEL","",6.6,"PPB","","6.6","Mortality ","Mortality ","Mortality ","Dilution water","N/A","10 ± 2 (embryos) or 12 ± 2 (larvae/juveniles)","Not stated","≥80% purity"]
[12557,"Fipronil","2050212","Crustacea","Water flea","Daphnia magna","LifCyc","72-4b","100","21 D","LOEC","","19.5","PPB","","9.6","Growth of total body length and dry weight","Growth of total body length and dry weight","Body length/ Dry weight","Surface or ground, reconstituted or dechlorinated tap water","N/A","20 ± 1","Not stated","≥80% purity"]
[12557,"Fipronil","2050212","Crustacea","Water flea","Daphnia magna","LifCyc","72-4b","100","21 D","NOEL","",9.6,"PPB","","9.6","Growth of total body length and dry weight","Growth of total body length and dry weight","Body length/ Dry weight","Surface or ground, reconstituted or dechlorinated tap water","N/A","20 ± 1","Not stated","≥80% purity"]
[13103,"Fipronil","2050437","Fishes","Sheepshead minnow","Cyprinodon variegatus","ErlyLf","72-4a","99.4","32 D","LOEC","","0.41","PPB","","0.24","Mortality ","Mortality ","Mortality ","Dilution water","N/A","10 ± 2 (embryos) or 12 ± 2 (larvae/juveniles)","Not stated","≥80% purity"]
[13103,"Fipronil","2050437","Fishes","Sheepshead minnow","Cyprinodon variegatus","ErlyLf","72-4a","99.4","32 D","NOEL","",0.24,"PPB","","0.24","Mortality ","Mortality ","Mortality ","Dilution water","N/A","10 ± 2 (embryos) or 12 ± 2 (larvae/juveniles)","Not stated","≥80% purity"]
[13104,"Fipronil","2050436","Fishes","Sheepshead minnow","Cyprinodon variegatus","ErlyLf","72-4a","97.08","32 D","LOEC","","1.6","PPB","<","1.6","Mortality ","Mortality ","Mortality ","Dilution water","N/A","10 ± 2 (embryos) or 12 ± 2 (larvae/juveniles)","Not stated","≥80% purity","Use LOEC, Do Not Use NOEC."]
[13283,"Fipronil(46513 degradate)","2050434","Crustacea","Water flea","Daphnia magna","LifCyc","72-4b","Deg","21 D","LOEC","","100","PPB","","41","Growth of total body length and dry weight","Growth of total body length and dry weight","Body length/ Dry weight","Surface or ground, reconstituted or dechlorinated tap water","N/A","20 ± 1","Not stated","Do Not Use"]
[13283,"Fipronil(46513 degradate)","2050434","Crustacea","Water flea","Daphnia magna","LifCyc","72-4b","Deg","21 D","NOEL","",41,"PPB","","41","Growth of total body length and dry weight","Growth of total body length and dry weight","Body length/ Dry weight","Surface or ground, reconstituted or dechlorinated tap water","N/A","20 ± 1","Not stated","Do Not Use"]
[13284,"Fipronil(46513 degradate)","2050435","Aquatic Plant","Green algae","Selenastrum capricornutum","N.R.","123-2","Deg","5 D","EC50","","76","PPB","","7.5","Biomass yield, growth rate, area under the growth curve","Growth, Growth rate","Biomass Yield, Growth Rate, AUC","M-Hoagland's or 20X-AAP nutrient media. ASTM type 1 water","N/A","25 ± 2","7.5 ± 0.1","Do Not Use"]
[13284,"Fipronil(46513 degradate)","2050435","Aquatic Plant","Green algae","Selenastrum capricornutum","N.R.","123-2","Deg","5 D","NOEL","",7.5,"PPB","","7.5","Biomass yield, growth rate, area under the growth curve","Growth, Growth rate","Biomass Yield, Growth Rate, AUC","M-Hoagland's or 20X-AAP nutrient media. ASTM type 1 water","N/A","25 ± 2","7.5 ± 0.1","Do Not Use"]
[15152,"Fipronil(46513 degradate)","2050432","Fishes","Bluegill sunfish","Lepomis macrochirus","0.51 g","72-1a","98.6","96 hr","LC50","","20","PPB","","9.6","Mortality ","Mortality ","Mortality ","Clean surface or ground water, reconstituted water","N/A","22 ± 2 ","6.0 - 8.0","≥80% purity"]
[15152,"Fipronil(46513 degradate)","2050432","Fishes","Bluegill sunfish","Lepomis macrochirus","0.51 g","72-1a","98.6","96 hr","NOEL","",9.6,"PPB","","9.6","Mortality ","Mortality ","Mortality ","Clean surface or ground water, reconstituted water","N/A","22 ± 2 ","6.0 - 8.0","≥80% purity"]
[15153,"Fipronil(46513 degradate)","2050275","Fishes","Rainbow trout","Oncorhynchus mykiss","0.85 g","72-1c","98.6","96 hr","LC50","","31","PPB","","11","Mortality ","Mortality ","Mortality ","Clean surface or ground water, reconstituted water","N/A","12 ± 2","6.0-8.0 ","≥80% purity"]
[15153,"Fipronil(46513 degradate)","2050275","Fishes","Rainbow trout","Oncorhynchus mykiss","0.85 g","72-1c","98.6","96 hr","NOEL","",11,"PPB","","11","Mortality ","Mortality ","Mortality ","Clean surface or ground water, reconstituted water","N/A","12 ± 2","6.0-8.0 ","≥80% purity"]
[15391,"Fipronil(46513 degradate)","2050231","Insecta","Midge","Chironomus tentans","LifCyc","72-4a","97.8","10 D","LOEC","","200","PPB","","160",null,null,null,"Surface or ground, reconstituted or dechlorinated tap water","N/A","20 ± 1","Not stated","Not using","Do Not Use - No Endpoint "]
[15391,"Fipronil(46513 degradate)","2050231","Insecta","Midge","Chironomus tentans","LifCyc","72-4a","97.8","10 D","NOEL","",160,"PPB","","160",null,null,null,"Surface or ground, reconstituted or dechlorinated tap water","N/A","20 ± 1","Not stated","Not using","Do Not Use - No Endpoint "]
[15392,"Fipronil(45950 degradate)","2050232","Insecta","Midge","Chironomus tentans","LifCyc","72-4a","99.5","10 D","LOEC","","54","PPB","","29",null,null,null,"Surface or ground, reconstituted or dechlorinated tap water","N/A","20 ± 1","Not stated","Not using","Do Not Use - No Endpoint "]
[15392,"Fipronil(45950 degradate)","2050232","Insecta","Midge","Chironomus tentans","LifCyc","72-4a","99.5","10 D","NOEL","",29,"PPB","","29",null,null,null,"Surface or ground, reconstituted or dechlorinated tap water","N/A","20 ± 1","Not stated","Not using","Do Not Use - No Endpoint "]
[15393,"Fipronil(45950 degradate)","2050232","Insecta","Midge","Chironomus tentans","N.R.","N.A.","99.5","10 D","LC50","","116.9","PPB","","29",null,null,null,null,null,null,null,"Not using","Do Not Use - No Endpoint "]
[15393,"Fipronil(45950 degradate)","2050232","Insecta","Midge","Chironomus tentans","N.R.","N.A.","99.5","10 D","NOEL","",29,"PPB","","29",null,null,null,null,null,null,null,"Not using","Do Not Use - No Endpoint "]
[15394,"Fipronil(46136 degradate) in pore water","2050231","Insecta","Midge","Chironomus tentans","ErlyLf","N.A.","99.01","10 D","LC50","","0.72","PPB","","0.35",null,null,null,null,null,null,null,"Not using","Do Not Use - No Endpoint "]
[15394,"Fipronil(46136 degradate) in pore water","2050231","Insecta","Midge","Chironomus tentans","ErlyLf","N.A.","99.01","10 D","NOEL","",0.35,"PPB","","0.35",null,null,null,null,null,null,null,"Not using","Do Not Use - No Endpoint "]
[15395,"Fipronil(46136 degradate)","2050231","Insecta","Midge","Chironomus tentans","N.R.","N.A.","99.01","10 D","LC50","","46.2","PPB","","N.R.",null,null,null,null,null,null,null,"Not using","Do Not Use - No Endpoint "]
[15396,"Fipronil(46513 degradate)","2050235","Crustacea","Mysid","Americamysis bahia","<24 hr","72-3c","97.8","96 hr","LC50","","1.5","PPB","","0.66","Mortality ","Mortality ","Mortality ","Natural or artificial seawater dilution water or dilution water from area of origin","20 ± 3","25 ± 2 ","Not stated","≥80% purity"]
[15396,"Fipronil(46513 degradate)","2050235","Crustacea","Mysid","Americamysis bahia","<24 hr","72-3c","97.8","96 hr","NOEL","",0.66,"PPB","","0.66","Mortality ","Mortality ","Mortality ","Natural or artificial seawater dilution water or dilution water from area of origin","20 ± 3","25 ± 2 ","Not stated","≥80% purity"]
[15397,"Fipronil(46136 degradate)","2050236","Crustacea","Mysid","Americamysis bahia","<24 hr","72-3c","97.7","96 hr","LC50","","0.056","PPB","","0.031","Mortality ","Mortality ","Mortality ","Natural or artificial seawater dilution water or dilution water from area of origin","20 ± 3","25 ± 2 ","Not stated","≥80% purity"]
[15397,"Fipronil(46136 degradate)","2050236","Crustacea","Mysid","Americamysis bahia","<24 hr","72-3c","97.7","96 hr","NOEL","",3.1E-2,"PPB","","0.031","Mortality ","Mortality ","Mortality ","Natural or artificial seawater dilution water or dilution water from area of origin","20 ± 3","25 ± 2 ","Not stated","≥80% purity"]
[15398,"Fipronil(45950 degradate)","2050237","Crustacea","Mysid","Americamysis bahia","<24 hr","72-3","99.7","96 hr","LC50","","0.077","PPB","","0.033","Mortality ","Mortality ","Mortality ","Natural or artificial seawater dilution water or dilution water from area of origin","20 ± 3","25 ± 2 ","Not stated","≥80% purity"]
[15398,"Fipronil(45950 degradate)","2050237","Crustacea","Mysid","Americamysis bahia","<24 hr","72-3","99.7","96 hr","NOEL","",3.3000000000000002E-2,"PPB","","0.033","Mortality ","Mortality ","Mortality ","Natural or artificial seawater dilution water or dilution water from area of origin","20 ± 3","25 ± 2 ","Not stated","≥80% purity"]
[24468,"Fipronil","2050244","Annelida","Marine Oligochaete","Lumbriculus variegatus","Adult","N.A.","99.7","96 hr","LC50",">","1.9","PPM","","1.9","Mortality ","Mortality ","Mortality ","Natural or artificial seawater dilution water or dilution water from area of origin","20 ± 3","25 ± 2 ","Not stated","Not using","Do Not Use - No LC50 value obtained"]
[24468,"Fipronil","2050244","Annelida","Marine Oligochaete","Lumbriculus variegatus","Adult","N.A.","99.7","96 hr","NOEL",null,1.9,"PPM","","1.9",null,null,null,null,null,null,null,"Not using","Do Not Use - No Endpoint "]
[24469,"Fipronil","2046661","Mollusca","Freshwater clam","Corbicula fluminea","12 mm","NA","99.7","96 hr","LC50",">","2.0","PPM","","2.0","Mortality, Abnormal Development","Mortality, Abnormal Development","Mortality/Abnormal Development","Surface or ground, reconstituted or dechlorinated tap water","N/A","20 ± 2","Not stated","Not using","Do Not Use - No LC50 value obtained"]
[24469,"Fipronil","2046661","Mollusca","Freshwater clam","Corbicula fluminea","12 mm","NA","99.7","96 hr","NOEL",null,2,"PPM","","2.0","Mortality, Abnormal Development","Mortality, Abnormal Development","Mortality/Abnormal Development","Surface or ground, reconstituted or dechlorinated tap water","N/A","20 ± 2","Not stated","Not using","Do Not Use - No Endpoint "]
[24470,"Fipronil metabolite RPA 200766","2022709","Insecta","Midge","Chironomus riparius","< 3D","N.A.","99.8","48 hr","LC50","","0.43","PPM","","0.008",null,null,null,null,null,null,null,"Not using","Do Not Use - No Endpoint "]
[24470,"Fipronil metabolite RPA 200766","2022709","Insecta","Midge","Chironomus riparius","< 3D","N.A.","99.8","48 hr","NOEL","",8.0000000000000002E-3,"PPM","","0.008",null,null,null,null,null,null,null,"Not using","Do Not Use - No Endpoint "]
[24519,"Fipronil","2083582","Crustacea","Mysid","Americamysis  bahia","LifCyc","72-4b","99.7","28 D","LOEC","","0.014","PPB","<","0.014","Mortality ","Mortality ","Mortality ","Natural or artificial seawater dilution water or dilution water from area of origin","20 ± 3","25 ± 2 ","Not stated","≥80% purity","Use LOEC, Do Not Use NOEC."]
[24599,"Fipronil","2046661","Insecta","Mayfly","Hexagenia sp.","Nymphs","72-2","99.7","96 hr","LC50","","0.44","PPB","","0.14","Mortality, Abnormal Development","Mortality, Abnormal Development","Mortality/Abnormal Development","Surface or ground, reconstituted or dechlorinated tap water","N/A","20 ± 2","Not stated","≥80% purity"]
[24599,"Fipronil","2046661","Insecta","Mayfly","Hexagenia sp.","Nymphs","72-2","99.7","96 hr","NOEL","",0.14000000000000001,"PPB","","0.14","Mortality, Abnormal Development","Mortality, Abnormal Development","Mortality/Abnormal Development","Surface or ground, reconstituted or dechlorinated tap water","N/A","20 ± 2","Not stated","≥80% purity"]
[24925,"Fipronil MB 45950 degradate","2084201","Insecta","Midge","Chironomus riparius","1st In","NA","99.5","28 D","LOEC","","5.0 in sed","PPB","","2.5",null,null,null,null,null,null,null,"Not using","Do Not Use - Concentration in sediment, not aquatic."]
[24925,"Fipronil MB 45950 degradate","2084201","Insecta","Midge","Chironomus riparius","1st In","NA","99.5","28 D","NOEL","",2.5,"PPB","","2.5",null,null,null,null,null,null,null,"Not using","Do Not Use - No Endpoint "]
[25109,"Fipronil","2050241","Fishes","Sheepshead minnow","Cyprinodon variegatus","LifCyc","72-5","98.0","110 D","LOEC","","0.85","PPB","<","0.85","Not stated ","Not stated ","Not stated ","Not stated ","Not stated ","Not stated ","Not stated ","≥80% purity","Use LOEC, Do Not Use NOEC."]

{"sheet":"Instruction","index":3,"n_rows":21,"n_cols":10,"rows_kept":21,"cut":false,"hidden":false,"merged":[[27,6,27,16],[14,6,14,7],[5,4,5,7]]}
[]
[]
[null,"Click here to see \"All Result\" -->","All Result"]
[]
[]
[null,null,null,null,"Freshwater "]
[]
[null,"Tabs contain questionaries -->           ","Freshwater/metal/nonplant",null,"Freshwater/non-metal/non-plant ",null,null,"Freshwater/metal/plant",null,"Freshwater/non-metal/plant"]
[]
[]
[]
[null,"Tabs contain score of paper and short answers to questions -->","Freshwater/metal/nonplant Worksheet",null,"Freshwater/non-metal/non-plant Worksheet",null,null,"Freshwater/metal/plant Worksheet",null,"Freshwater/non-metal/plant/ Worksheet"]
[]
[]
[null,null,"Marine ",null,null,null,"Terrestrial",null,null,"Sediment "]
[]
[null,"Tab contain questionaries -->","Marine or estuarine/non-plant",null,"Marine or estuarine/Plant",null,null,"Terrestrial Data QA",null,"Sediment Data QA"]
[]
[]
[]
[null,"Tab Contains all scores of paper --> ","Marine or estuarine/non-Plant Worksheet",null,"Marine or estuarine/Plant_Worksheet",null,null,"Terrestrial Quality",null,"Sediment Quality"]

{"sheet":"Sheet1","index":4,"n_rows":70,"n_cols":29,"rows_kept":70,"cut":false,"hidden":true,"merged":[]}
[]
[{"$f":"#REF!","v":{"$error":"#REF!"}},{"$f":"#REF!","v":{"$error":"#REF!"}},{"$f":"#REF!","v":{"$error":"#REF!"}},{"$f":"#REF!","v":{"$error":"#REF!"}},{"$f":"#REF!","v":{"$error":"#REF!"}},{"$f":"#REF!","v":{"$error":"#REF!"}},{"$f":"#REF!","v":{"$error":"#REF!"}},{"$f":"#REF!","v":{"$error":"#REF!"}},{"$f":"#REF!","v":{"$error":"#REF!"}},{"$f":"#REF!","v":{"$error":"#REF!"}},{"$f":"#REF!","v":{"$error":"#REF!"}},{"$f":"#REF!","v":{"$error":"#REF!"}},{"$f":"#REF!","v":{"$error":"#REF!"}},{"$f":"#REF!","v":{"$error":"#REF!"}},{"$f":"#REF!","v":{"$error":"#REF!"}},{"$f":"#REF!","v":{"$error":"#REF!"}},{"$f":"#REF!","v":{"$error":"#REF!"}},{"$f":"#REF!","v":{"$error":"#REF!"}},{"$f":"#REF!","v":{"$error":"#REF!"}},{"$f":"#REF!","v":{"$error":"#REF!"}},{"$f":"#REF!","v":{"$error":"#REF!"}},{"$f":"#REF!","v":{"$error":"#REF!"}},{"$f":"#REF!","v":{"$error":"#REF!"}},{"$f":"#REF!","v":{"$error":"#REF!"}},{"$f":"#REF!","v":{"$error":"#REF!"}},{"$f":"#REF!","v":{"$error":"#REF!"}}]
[{"$f":"#REF!","v":{"$error":"#REF!"}},{"$f":"#REF!","v":{"$error":"#REF!"}},{"$f":"#REF!","v":{"$error":"#REF!"}},{"$f":"#REF!","v":{"$error":"#REF!"}}]
[{"$f":"#REF!","v":{"$error":"#REF!"}},{"$f":"#REF!","v":{"$error":"#REF!"}},{"$f":"#REF!","v":{"$error":"#REF!"}},{"$f":"#REF!","v":{"$error":"#REF!"}},{"$f":"#REF!","v":{"$error":"#REF!"}},{"$f":"#REF!","v":{"$error":"#REF!"}},{"$f":"#REF!","v":{"$error":"#REF!"}},{"$f":"#REF!","v":{"$error":"#REF!"}},{"$f":"#REF!","v":{"$error":"#REF!"}},{"$f":"#REF!","v":{"$error":"#REF!"}},{"$f":"#REF!","v":{"$error":"#REF!"}},{"$f":"#REF!","v":{"$error":"#REF!"}},{"$f":"#REF!","v":{"$error":"#REF!"}},{"$f":"#REF!","v":{"$error":"#REF!"}},{"$f":"#REF!","v":{"$error":"#REF!"}},{"$f":"#REF!","v":{"$error":"#REF!"}},{"$f":"#REF!","v":{"$error":"#REF!"}},{"$f":"#REF!","v":{"$error":"#REF!"}},{"$f":"#REF!","v":{"$error":"#REF!"}},{"$f":"#REF!","v":{"$error":"#REF!"}},{"$f":"#REF!","v":{"$error":"#REF!"}},{"$f":"#REF!","v":{"$error":"#REF!"}},{"$f":"#REF!","v":{"$error":"#REF!"}},{"$f":"#REF!","v":{"$error":"#REF!"}},{"$f":"#REF!","v":{"$error":"#REF!"}},{"$f":"#REF!","v":{"$error":"#REF!"}}]
["Answers",{"$f":"IF(#REF!=0,\"\",#REF!)","v":{"$error":"#REF!"}},{"$f":"IF(#REF!=0,\"\",#REF!)","v":{"$error":"#REF!"}},{"$f":"IF(#REF!=0,\"\",#REF!)","v":{"$error":"#REF!"}},{"$f":"IF(#REF!=0,\"\",#REF!)","v":{"$error":"#REF!"}},{"$f":"IF(#REF!=0,\"\",#REF!)","v":{"$error":"#REF!"}},{"$f":"IF(#REF!=0,\"\",#REF!)","v":{"$error":"#REF!"}},{"$f":"IF(#REF!=0,\"\",#REF!)","v":{"$error":"#REF!"}},{"$f":"IF(#REF!=0,\"\",#REF!)","v":{"$error":"#REF!"}},{"$f":"IF(#REF!=0,\"\",#REF!)","v":{"$error":"#REF!"}},{"$f":"IF(#REF!=0,\"\",#REF!)","v":{"$error":"#REF!"}},{"$f":"IF(#REF!=0,\"\",#REF!)","v":{"$error":"#REF!"}},{"$f":"IF(#REF!=0,\"\",#REF!)","v":{"$error":"#REF!"}},{"$f":"IF(#REF!=0,\"\",#REF!)","v":{"$error":"#REF!"}},{"$f":"IF(#REF!=0,\"\",#REF!)","v":{"$error":"#REF!"}},{"$f":"IF(#REF!=0,\"\",#REF!)","v":{"$error":"#REF!"}},{"$f":"IF(#REF!=0,\"\",#REF!)","v":{"$error":"#REF!"}},{"$f":"IF(#REF!=0,\"\",#REF!)","v":{"$error":"#REF!"}},{"$f":"IF(#REF!=0,\"\",#REF!)","v":{"$error":"#REF!"}},{"$f":"IF(#REF!=0,\"\",#REF!)","v":{"$error":"#REF!"}},{"$f":"IF(#REF!=0,\"\",#REF!)","v":{"$error":"#REF!"}},{"$f":"IF(#REF!=0,\"\",#REF!)","v":{"$error":"#REF!"}},{"$f":"IF(#REF!=0,\"\",#REF!)","v":{"$error":"#REF!"}},{"$f":"IF(#REF!=0,\"\",#REF!)","v":{"$error":"#REF!"}}]
[{"$f":"#REF!","v":{"$error":"#REF!"}},{"$f":"#REF!","v":{"$error":"#REF!"}},{"$f":"#REF!","v":{"$error":"#REF!"}},{"$f":"#REF!","v":{"$error":"#REF!"}},{"$f":"#REF!","v":{"$error":"#REF!"}},{"$f":"#REF!","v":{"$error":"#REF!"}},{"$f":"#REF!","v":{"$error":"#REF!"}},{"$f":"#REF!","v":{"$error":"#REF!"}}]
[{"$f":"#REF!","v":{"$error":"#REF!"}},{"$f":"#REF!","v":{"$error":"#REF!"}},{"$f":"#REF!","v":{"$error":"#REF!"}},{"$f":"#REF!","v":{"$error":"#REF!"}},{"$f":"#REF!","v":{"$error":"#REF!"}},{"$f":"IF(#REF!=0,\"\",#REF!)","v":{"$error":"#REF!"}},{"$f":"IF(#REF!=0,\"\",#REF!)","v":{"$error":"#REF!"}},{"$f":"IF(#REF!=0,\"\",#REF!)","v":{"$error":"#REF!"}}]
[]
[]
[]
[{"$f":"#REF!","v":{"$error":"#REF!"}},{"$f":"#REF!","v":{"$error":"#REF!"}},{"$f":"#REF!","v":{"$error":"#REF!"}},{"$f":"#REF!","v":{"$error":"#REF!"}},{"$f":"#REF!","v":{"$error":"#REF!"}},{"$f":"#REF!","v":{"$error":"#REF!"}},{"$f":"#REF!","v":{"$error":"#REF!"}},{"$f":"#REF!","v":{"$error":"#REF!"}},{"$f":"#REF!","v":{"$error":"#REF!"}},{"$f":"#REF!","v":{"$error":"#REF!"}},{"$f":"#REF!","v":{"$error":"#REF!"}},{"$f":"#REF!","v":{"$error":"#REF!"}},{"$f":"#REF!","v":{"$error":"#REF!"}},{"$f":"#REF!","v":{"$error":"#REF!"}},{"$f":"#REF!","v":{"$error":"#REF!"}},{"$f":"#REF!","v":{"$error":"#REF!"}},{"$f":"#REF!","v":{"$error":"#REF!"}},{"$f":"#REF!","v":{"$error":"#REF!"}},{"$f":"#REF!","v":{"$error":"#REF!"}},{"$f":"#REF!","v":{"$error":"#REF!"}},{"$f":"#REF!","v":{"$error":"#REF!"}},{"$f":"#REF!","v":{"$error":"#REF!"}},{"$f":"#REF!","v":{"$error":"#REF!"}},{"$f":"#REF!","v":{"$error":"#REF!"}},{"$f":"#REF!","v":{"$error":"#REF!"}},{"$f":"#REF!","v":{"$error":"#REF!"}},{"$f":"#REF!","v":{"$error":"#REF!"}}]
[{"$f":"#REF!","v":{"$error":"#REF!"}},{"$f":"#REF!","v":{"$error":"#REF!"}},{"$f":"#REF!","v":{"$error":"#REF!"}},{"$f":"#REF!","v":{"$error":"#REF!"}}]
[{"$f":"#REF!","v":{"$error":"#REF!"}},{"$f":"#REF!","v":{"$error":"#REF!"}},{"$f":"#REF!","v":{"$error":"#REF!"}},{"$f":"#REF!","v":{"$error":"#REF!"}},{"$f":"#REF!","v":{"$error":"#REF!"}},{"$f":"#REF!","v":{"$error":"#REF!"}},{"$f":"#REF!","v":{"$error":"#REF!"}},{"$f":"#REF!","v":{"$error":"#REF!"}},{"$f":"#REF!","v":{"$error":"#REF!"}},{"$f":"#REF!","v":{"$error":"#REF!"}},{"$f":"#REF!","v":{"$error":"#REF!"}},{"$f":"#REF!","v":{"$error":"#REF!"}},{"$f":"#REF!","v":{"$error":"#REF!"}},{"$f":"#REF!","v":{"$error":"#REF!"}},{"$f":"#REF!","v":{"$error":"#REF!"}},{"$f":"#REF!","v":{"$error":"#REF!"}},{"$f":"#REF!","v":{"$error":"#REF!"}},{"$f":"#REF!","v":{"$error":"#REF!"}},{"$f":"#REF!","v":{"$error":"#REF!"}},{"$f":"#REF!","v":{"$error":"#REF!"}},{"$f":"#REF!","v":{"$error":"#REF!"}},{"$f":"#REF!","v":{"$error":"#REF!"}},{"$f":"#REF!","v":{"$error":"#REF!"}},{"$f":"#REF!","v":{"$error":"#REF!"}},{"$f":"#REF!","v":{"$error":"#REF!"}},{"$f":"#REF!","v":{"$error":"#REF!"}},{"$f":"#REF!","v":{"$error":"#REF!"}}]
[{"$f":"#REF!","v":{"$error":"#REF!"}},{"$f":"IF(#REF!=0,\"\",#REF!)","v":{"$error":"#REF!"}},{"$f":"IF(#REF!=0,\"\",#REF!)","v":{"$error":"#REF!"}},{"$f":"IF(#REF!=0,\"\",#REF!)","v":{"$error":"#REF!"}},{"$f":"IF(#REF!=0,\"\",#REF!)","v":{"$error":"#REF!"}},null,{"$f":"IF(#REF!=0,\"\",#REF!)","v":{"$error":"#REF!"}},{"$f":"IF(#REF!=0,\"\",#REF!)","v":{"$error":"#REF!"}},{"$f":"IF(#REF!=0,\"\",#REF!)","v":{"$error":"#REF!"}},{"$f":"IF(#REF!=0,\"\",#REF!)","v":{"$error":"#REF!"}},{"$f":"IF(#REF!=0,\"\",#REF!)","v":{"$error":"#REF!"}},{"$f":"IF(#REF!=0,\"\",#REF!)","v":{"$error":"#REF!"}},{"$f":"IF(#REF!=0,\"\",#REF!)","v":{"$error":"#REF!"}},{"$f":"IF(#REF!=0,\"\",#REF!)","v":{"$error":"#REF!"}},{"$f":"IF(#REF!=0,\"\",#REF!)","v":{"$error":"#REF!"}},{"$f":"IF(#REF!=0,\"\",#REF!)","v":{"$error":"#REF!"}},{"$f":"IF(#REF!=0,\"\",#REF!)","v":{"$error":"#REF!"}},{"$f":"IF(#REF!=0,\"\",#REF!)","v":{"$error":"#REF!"}},{"$f":"IF(#REF!=0,\"\",#REF!)","v":{"$error":"#REF!"}},{"$f":"IF(#REF!=0,\"\",#REF!)","v":{"$error":"#REF!"}},{"$f":"IF(#REF!=0,\"\",#REF!)","v":{"$error":"#REF!"}},{"$f":"IF(#REF!=0,\"\",#REF!)","v":{"$error":"#REF!"}},{"$f":"IF(#REF!=0,\"\",#REF!)","v":{"$error":"#REF!"}},{"$f":"IF(#REF!=0,\"\",#REF!)","v":{"$error":"#REF!"}},{"$f":"IF(#REF!=0,\"\",#REF!)","v":{"$error":"#REF!"}}]
[{"$f":"#REF!","v":{"$error":"#REF!"}},{"$f":"#REF!","v":{"$error":"#REF!"}},{"$f":"#REF!","v":{"$error":"#REF!"}},{"$f":"#REF!","v":{"$error":"#REF!"}},{"$f":"#REF!","v":{"$error":"#REF!"}},{"$f":"#REF!","v":{"$error":"#REF!"}},{"$f":"#REF!","v":{"$error":"#REF!"}},{"$f":"#REF!","v":{"$error":"#REF!"}}]
[{"$f":"#REF!","v":{"$error":"#REF!"}},{"$f":"#REF!","v":{"$error":"#REF!"}},{"$f":"#REF!","v":{"$error":"#REF!"}},{"$f":"#REF!","v":{"$error":"#REF!"}},{"$f":"#REF!","v":{"$error":"#REF!"}},{"$f":"IF(#REF!=0,\"\",#REF!)","v":{"$error":"#REF!"}},{"$f":"IF(#REF!=0,\"\",#REF!)","v":{"$error":"#REF!"}},{"$f":"IF(#REF!=0,\"\",#REF!)","v":{"$error":"#REF!"}}]
[]
[]
[]
[{"$f":"'Terrestrial Data QA'!B11","v":"No."},{"$f":"'Terrestrial Data QA'!B13","v":1},{"$f":"'Terrestrial Data QA'!B16","v":2},{"$f":"'Terrestrial Data QA'!B19","v":3},{"$f":"'Terrestrial Data QA'!B21","v":4},{"$f":"'Terrestrial Data QA'!B23","v":5},{"$f":"'Terrestrial Data QA'!B26","v":6},{"$f":"'Terrestrial Data QA'!B29","v":7},{"$f":"'Terrestrial Data QA'!B32","v":8},{"$f":"'Terrestrial Data QA'!B35","v":9},{"$f":"'Terrestrial Data QA'!B39","v":10},{"$f":"'Terrestrial Data QA'!B42","v":11},{"$f":"'Terrestrial Data QA'!B45","v":12},{"$f":"'Terrestrial Data QA'!B48","v":13},{"$f":"'Terrestrial Data QA'!B50","v":14},{"$f":"'Terrestrial Data QA'!B55","v":15.1},{"$f":"'Terrestrial Data QA'!B59","v":15.2},{"$f":"'Terrestrial Data QA'!B63","v":15.3},{"$f":"'Terrestrial Data QA'!B67","v":15.4},{"$f":"'Terrestrial Data QA'!B71","v":16},{"$f":"'Terrestrial Data QA'!B74","v":17},{"$f":"'Terrestrial Data QA'!B78","v":18},{"$f":"'Terrestrial Data QA'!B82","v":19},{"$f":"'Terrestrial Data QA'!B85","v":20},{"$f":"'Terrestrial Data QA'!C90","v":"Total Score"},{"$f":"'Terrestrial Data QA'!C92","v":"Quality Score"}]
[{"$f":"'Terrestrial Data QA'!C2","v":"Category"},{"$f":"'Terrestrial Data QA'!E2","v":"Terrestrial Quality"},{"$f":"'Terrestrial Data QA'!C3","v":"Paper and data unique identifier(eg. 1-1,10-150)"},{"$f":"'Terrestrial Data QA'!E3","v":0}]
[{"$f":"'Terrestrial Data QA'!G11","v":"Scores"},{"$f":"'Terrestrial Data QA'!G12","v":0},{"$f":"'Terrestrial Data QA'!G15","v":0},{"$f":"'Terrestrial Data QA'!G18","v":0},{"$f":"'Terrestrial Data QA'!G21","v":0},{"$f":"'Terrestrial Data QA'!G23","v":0},{"$f":"'Terrestrial Data QA'!G26","v":0},{"$f":"'Terrestrial Data QA'!G29","v":0},{"$f":"'Terrestrial Data QA'!G32","v":0},{"$f":"'Terrestrial Data QA'!G35","v":0},{"$f":"'Terrestrial Data QA'!G38","v":0},{"$f":"'Terrestrial Data QA'!G41","v":0},{"$f":"'Terrestrial Data QA'!G44","v":0},{"$f":"'Terrestrial Data QA'!G47","v":0},{"$f":"'Terrestrial Data QA'!G50","v":0},{"$f":"'Terrestrial Data QA'!G54","v":0},{"$f":"'Terrestrial Data QA'!G58","v":0},{"$f":"'Terrestrial Data QA'!G62","v":0},{"$f":"'Terrestrial Data QA'!G66","v":0},{"$f":"'Terrestrial Data QA'!G70","v":0},{"$f":"'Terrestrial Data QA'!G73","v":0},{"$f":"'Terrestrial Data QA'!G77","v":0},{"$f":"'Terrestrial Data QA'!G81","v":0},{"$f":"'Terrestrial Data QA'!G84","v":0},{"$f":"'Terrestrial Data QA'!G90","v":""},{"$f":"'Terrestrial Data QA'!G92","v":{"$error":"#N/A"}}]
[{"$f":"'Terrestrial Data QA'!H11","v":"Answers"},{"$f":"IF('Terrestrial Data QA'!H12=0,\"\",'Terrestrial Data QA'!H12)","v":""},{"$f":"IF('Terrestrial Data QA'!H15=0,\"\",'Terrestrial Data QA'!H15)","v":""},{"$f":"IF('Terrestrial Data QA'!H18=0,\"\",'Terrestrial Data QA'!H18)","v":""},{"$f":"IF('Terrestrial Data QA'!H21=0,\"\",'Terrestrial Data QA'!H21)","v":""},{"$f":"IF('Terrestrial Data QA'!H23=0,\"\",'Terrestrial Data QA'!H23)","v":""},{"$f":"IF('Terrestrial Data QA'!H26=0,\"\",'Terrestrial Data QA'!H26)","v":""},{"$f":"IF('Terrestrial Data QA'!H29=0,\"\",'Terrestrial Data QA'!H29)","v":""},{"$f":"IF('Terrestrial Data QA'!H32=0,\"\",'Terrestrial Data QA'!H32)","v":""},{"$f":"IF('Terrestrial Data QA'!H35=0,\"\",'Terrestrial Data QA'!H35)","v":""},{"$f":"IF('Terrestrial Data QA'!H38=0,\"\",'Terrestrial Data QA'!H38)","v":""},{"$f":"IF('Terrestrial Data QA'!H41=0,\"\",'Terrestrial Data QA'!H41)","v":""},{"$f":"IF('Terrestrial Data QA'!H44=0,\"\",'Terrestrial Data QA'!H44)","v":""},{"$f":"IF('Terrestrial Data QA'!H47=0,\"\",'Terrestrial Data QA'!H47)","v":""},{"$f":"IF('Terrestrial Data QA'!H50=0,\"\",'Terrestrial Data QA'!H50)","v":""},{"$f":"IF('Terrestrial Data QA'!H54=0,\"\",'Terrestrial Data QA'!H54)","v":""},{"$f":"IF('Terrestrial Data QA'!H58=0,\"\",'Terrestrial Data QA'!H58)","v":""},{"$f":"IF('Terrestrial Data QA'!H62=0,\"\",'Terrestrial Data QA'!H62)","v":""},{"$f":"IF('Terrestrial Data QA'!H66=0,\"\",'Terrestrial Data QA'!H66)","v":""},{"$f":"IF('Terrestrial Data QA'!H70=0,\"\",'Terrestrial Data QA'!H70)","v":""},{"$f":"IF('Terrestrial Data QA'!H73=0,\"\",'Terrestrial Data QA'!H73)","v":""},{"$f":"IF('Terrestrial Data QA'!H77=0,\"\",'Terrestrial Data QA'!H77)","v":""},{"$f":"IF('Terrestrial Data QA'!H81=0,\"\",'Terrestrial Data QA'!H81)","v":""},{"$f":"IF('Terrestrial Data QA'!H84=0,\"\",'Terrestrial Data QA'!H84)","v":""}]
[{"$f":"'Terrestrial Data QA'!G3","v":"Species (Scientific name)"},{"$f":"'Terrestrial Data QA'!G4","v":"Lifestage"},{"$f":"'Terrestrial Data QA'!G5","v":"Exposure duration"},{"$f":"'Terrestrial Data QA'!G6","v":"Measure of toxicity"},{"$f":"'Terrestrial Data QA'!G7","v":"Toxicity endpoint"},{"$f":"'Terrestrial Data QA'!G8","v":"Toxicity value"},{"$f":"'Terrestrial Data QA'!C4","v":"Citation"},{"$f":"'Terrestrial Data QA'!G2","v":"Citation No."}]
[{"$f":"'Terrestrial Data QA'!M3","v":""},{"$f":"'Terrestrial Data QA'!P3","v":""},{"$f":"'Terrestrial Data QA'!S3","v":""},{"$f":"'Terrestrial Data QA'!V3","v":""},{"$f":"'Terrestrial Data QA'!Y3","v":""},{"$f":"IF('Terrestrial Data QA'!H8=0,\"\",'Terrestrial Data QA'!H8)","v":""},{"$f":"IF('Terrestrial Data QA'!E4=0,\"\",'Terrestrial Data QA'!E4)","v":""},{"$f":"IF('Terrestrial Data QA'!H2=0,\"\",'Terrestrial Data QA'!H2)","v":""}]
[]
[]
[]
[{"$f":"'Sediment Data QA'!B11","v":"No."},{"$f":"'Sediment Data QA'!B13","v":1},{"$f":"'Sediment Data QA'!B16","v":2},{"$f":"'Sediment Data QA'!B19","v":3},{"$f":"'Sediment Data QA'!B21","v":4},{"$f":"'Sediment Data QA'!B23","v":5},{"$f":"'Sediment Data QA'!B26","v":6},{"$f":"'Sediment Data QA'!B29","v":7},{"$f":"'Sediment Data QA'!B32","v":8},{"$f":"'Sediment Data QA'!B35","v":9},{"$f":"'Sediment Data QA'!B39","v":10},{"$f":"'Sediment Data QA'!B42","v":11},{"$f":"'Sediment Data QA'!B45","v":12},{"$f":"'Sediment Data QA'!B48","v":13},{"$f":"'Sediment Data QA'!B51","v":14},{"$f":"'Sediment Data QA'!B53","v":15},{"$f":"'Sediment Data QA'!B58","v":16.100000000000001},{"$f":"'Sediment Data QA'!B62","v":16.2},{"$f":"'Sediment Data QA'!B66","v":16.3},{"$f":"'Sediment Data QA'!B70","v":16.399999999999999},{"$f":"'Sediment Data QA'!B74","v":16.5},{"$f":"'Sediment Data QA'!B78","v":16.600000000000001},{"$f":"'Sediment Data QA'!B82","v":17},{"$f":"'Sediment Data QA'!B85","v":18},{"$f":"'Sediment Data QA'!B88","v":19},{"$f":"'Sediment Data QA'!B90","v":20},{"$f":"'Sediment Data QA'!B92","v":21},{"$f":"'Sediment Data QA'!C95","v":"Total score"},{"$f":"'Sediment Data QA'!C97","v":"Quality Score"}]
[{"$f":"'Sediment Data QA'!C2","v":"Category"},{"$f":"'Sediment Data QA'!E2","v":"Sediment "},{"$f":"'Sediment Data QA'!C3","v":"Paper and data unique identifier(eg. 1-1,10-150)"},{"$f":"'Sediment Data QA'!E3","v":0}]
[{"$f":"'Sediment Data QA'!G11","v":"Scores"},{"$f":"'Sediment Data QA'!G12","v":0},{"$f":"'Sediment Data QA'!G15","v":0},{"$f":"'Sediment Data QA'!G18","v":0},{"$f":"'Sediment Data QA'!G21","v":0},{"$f":"'Sediment Data QA'!G23","v":0},{"$f":"'Sediment Data QA'!G26","v":0},{"$f":"'Sediment Data QA'!G29","v":0},{"$f":"'Sediment Data QA'!G32","v":0},{"$f":"'Sediment Data QA'!G35","v":0},{"$f":"'Sediment Data QA'!G38","v":0},{"$f":"'Sediment Data QA'!G41","v":0},{"$f":"'Sediment Data QA'!G44","v":0},{"$f":"'Sediment Data QA'!G47","v":0},{"$f":"'Sediment Data QA'!G50","v":0},{"$f":"'Sediment Data QA'!G53","v":0},{"$f":"'Sediment Data QA'!G57","v":0},{"$f":"'Sediment Data QA'!G61","v":0},{"$f":"'Sediment Data QA'!G65","v":0},{"$f":"'Sediment Data QA'!G69","v":0},{"$f":"'Sediment Data QA'!G73","v":0},{"$f":"'Sediment Data QA'!G77","v":0},{"$f":"'Sediment Data QA'!G81","v":0},{"$f":"'Sediment Data QA'!G84","v":0},{"$f":"'Sediment Data QA'!G88","v":0},{"$f":"'Sediment Data QA'!G90","v":0},{"$f":"'Sediment Data QA'!G92","v":0},{"$f":"'Sediment Data QA'!G95","v":""},{"$f":"'Sediment Data QA'!G97","v":{"$error":"#N/A"}}]
[{"$f":"'Sediment Data QA'!H11","v":"Answers"},{"$f":"IF('Sediment Data QA'!H12=\"\",\"\",'Sediment Data QA'!H12)","v":""},{"$f":"IF('Sediment Data QA'!H15=\"\",\"\",'Sediment Data QA'!H15)","v":""},{"$f":"IF('Sediment Data QA'!H18=\"\",\"\",'Sediment Data QA'!H18)","v":""},{"$f":"IF('Sediment Data QA'!H21=\"\",\"\",'Sediment Data QA'!H21)","v":""},{"$f":"IF('Sediment Data QA'!H23=\"\",\"\",'Sediment Data QA'!H23)","v":""},{"$f":"IF('Sediment Data QA'!H26=\"\",\"\",'Sediment Data QA'!H26)","v":""},{"$f":"IF('Sediment Data QA'!H29=\"\",\"\",'Sediment Data QA'!H29)","v":""},{"$f":"IF('Sediment Data QA'!H32=\"\",\"\",'Sediment Data QA'!H32)","v":""},{"$f":"IF('Sediment Data QA'!H35=\"\",\"\",'Sediment Data QA'!H35)","v":""},{"$f":"IF('Sediment Data QA'!H38=\"\",\"\",'Sediment Data QA'!H38)","v":""},{"$f":"IF('Sediment Data QA'!H41=\"\",\"\",'Sediment Data QA'!H41)","v":""},{"$f":"IF('Sediment Data QA'!H44=\"\",\"\",'Sediment Data QA'!H44)","v":""},{"$f":"IF('Sediment Data QA'!H47=\"\",\"\",'Sediment Data QA'!H47)","v":""},{"$f":"IF('Sediment Data QA'!H50=\"\",\"\",'Sediment Data QA'!H50)","v":""},{"$f":"IF('Sediment Data QA'!H53=\"\",\"\",'Sediment Data QA'!H53)","v":""},{"$f":"IF('Sediment Data QA'!H57=\"\",\"\",'Sediment Data QA'!H57)","v":""},{"$f":"IF('Sediment Data QA'!H61=\"\",\"\",'Sediment Data QA'!H61)","v":""},{"$f":"IF('Sediment Data QA'!H65=\"\",\"\",'Sediment Data QA'!H65)","v":""},{"$f":"IF('Sediment Data QA'!H69=\"\",\"\",'Sediment Data QA'!H69)","v":""},{"$f":"IF('Sediment Data QA'!H73=\"\",\"\",'Sediment Data QA'!H73)","v":""},{"$f":"IF('Sediment Data QA'!H77=\"\",\"\",'Sediment Data QA'!H77)","v":""},{"$f":"IF('Sediment Data QA'!H81=\"\",\"\",'Sediment Data QA'!H81)","v":""},{"$f":"IF('Sediment Data QA'!H84=\"\",\"\",'Sediment Data QA'!H84)","v":""},{"$f":"IF('Sediment Data QA'!H88=\"\",\"\",'Sediment Data QA'!H88)","v":""},{"$f":"IF('Sediment Data QA'!H90=\"\",\"\",'Sediment Data QA'!H90)","v":""},{"$f":"IF('Sediment Data QA'!H92=\"\",\"\",'Sediment Data QA'!H92)","v":""}]
[{"$f":"'Sediment Data QA'!G3","v":"Species (Scientific name)"},{"$f":"'Sediment Data QA'!G4","v":"Lifestage"},{"$f":"'Sediment Data QA'!G5","v":"Exposure duration"},{"$f":"'Sediment Data QA'!G6","v":"Measure of toxicity"},{"$f":"'Sediment Data QA'!G7","v":"Toxicity endpoint"},{"$f":"'Sediment Data QA'!G8","v":"Toxicity value"},{"$f":"'Sediment Data QA'!C4","v":"Citation"},{"$f":"'Sediment Data QA'!G2","v":"Citation No."}]
[{"$f":"'Sediment Data QA'!M3","v":""},{"$f":"'Sediment Data QA'!P3","v":""},{"$f":"'Sediment Data QA'!S3","v":""},{"$f":"'Sediment Data QA'!V3","v":""},{"$f":"'Sediment Data QA'!Y3","v":""},{"$f":"IF('Sediment Data QA'!H8=\"\",\"\",'Sediment Data QA'!H8)","v":""},{"$f":"IF('Sediment Data QA'!E4=\"\",\"\",'Sediment Data QA'!E4)","v":""},{"$f":"IF('Sediment Data QA'!H2=\"\",\"\",'Sediment Data QA'!H2)","v":0}]
[{"$f":"'FW nonmetal plant'!B11","v":"No."},{"$f":"'FW nonmetal plant'!B13","v":1},{"$f":"'FW nonmetal plant'!B16","v":2},{"$f":"'FW nonmetal plant'!B19","v":3},{"$f":"'FW nonmetal plant'!B21","v":4},{"$f":"'FW nonmetal plant'!B23","v":5},{"$f":"'FW nonmetal plant'!B26","v":6},{"$f":"'FW nonmetal plant'!B29","v":7},{"$f":"'FW nonmetal plant'!B32","v":8},{"$f":"'FW nonmetal plant'!B35","v":9},{"$f":"'FW nonmetal plant'!B39","v":10},{"$f":"'FW nonmetal plant'!B42","v":11},{"$f":"'FW nonmetal plant'!B45","v":12},{"$f":"'FW nonmetal plant'!B48","v":13},{"$f":"'FW nonmetal plant'!B51","v":14},{"$f":"'FW nonmetal plant'!B53","v":15},{"$f":"'FW nonmetal plant'!B58","v":16.100000000000001},{"$f":"'FW nonmetal plant'!B62","v":17},{"$f":"'FW nonmetal plant'!B65","v":18},{"$f":"'FW nonmetal plant'!C70","v":"Total score"},{"$f":"'FW nonmetal plant'!C72","v":"Quality Score"}]
[{"$f":"'FW nonmetal plant'!C2","v":"Category"},{"$f":"'FW nonmetal plant'!E2","v":"Freshwater/non-metal/plant"},{"$f":"'FW nonmetal plant'!C3","v":"Paper and data unique identifier(eg. 1-1,10-150)"},{"$f":"'FW nonmetal plant'!E3","v":"1077-4"}]
[{"$f":"'FW nonmetal plant'!G11","v":"Scores"},{"$f":"'FW nonmetal plant'!G12","v":10},{"$f":"'FW nonmetal plant'!G15","v":10},{"$f":"'FW nonmetal plant'!G18","v":5},{"$f":"'FW nonmetal plant'!G21","v":5},{"$f":"'FW nonmetal plant'!G23","v":5},{"$f":"'FW nonmetal plant'!G26","v":5},{"$f":"'FW nonmetal plant'!G29","v":2},{"$f":"'FW nonmetal plant'!G32","v":5},{"$f":"'FW nonmetal plant'!G35","v":5},{"$f":"'FW nonmetal plant'!G38","v":0},{"$f":"'FW nonmetal plant'!G41","v":2},{"$f":"'FW nonmetal plant'!G44","v":0},{"$f":"'FW nonmetal plant'!G47","v":4},{"$f":"'FW nonmetal plant'!G50","v":4},{"$f":"'FW nonmetal plant'!G53","v":4},{"$f":"'FW nonmetal plant'!G57","v":3},{"$f":"'FW nonmetal plant'!G61","v":3},{"$f":"'FW nonmetal plant'!G64","v":3},{"$f":"'FW nonmetal plant'!G70","v":75},{"$f":"'FW nonmetal plant'!G72","v":0.85227272727272729},{"$f":"'FW nonmetal plant'!H72","v":""}]
[{"$f":"'FW nonmetal plant'!H11","v":"Answers"},{"$f":"IF('FW nonmetal plant'!H12=\"\",\"\",'FW nonmetal plant'!H12)","v":""},{"$f":"IF('FW nonmetal plant'!H15=\"\",\"\",'FW nonmetal plant'!H15)","v":""},{"$f":"IF('FW nonmetal plant'!H18=\"\",\"\",'FW nonmetal plant'!H18)","v":""},{"$f":"IF('FW nonmetal plant'!H21=\"\",\"\",'FW nonmetal plant'!H21)","v":""},{"$f":"IF('FW nonmetal plant'!H23=\"\",\"\",'FW nonmetal plant'!H23)","v":""},{"$f":"IF('FW nonmetal plant'!H26=\"\",\"\",'FW nonmetal plant'!H26)","v":""},{"$f":"IF('FW nonmetal plant'!H29=\"\",\"\",'FW nonmetal plant'!H29)","v":""},{"$f":"IF('FW nonmetal plant'!H32=\"\",\"\",'FW nonmetal plant'!H32)","v":""},{"$f":"IF('FW nonmetal plant'!H35=\"\",\"\",'FW nonmetal plant'!H35)","v":""},{"$f":"IF('FW nonmetal plant'!H38=\"\",\"\",'FW nonmetal plant'!H38)","v":""},{"$f":"IF('FW nonmetal plant'!H41=\"\",\"\",'FW nonmetal plant'!H41)","v":""},{"$f":"IF('FW nonmetal plant'!H44=\"\",\"\",'FW nonmetal plant'!H44)","v":""},{"$f":"IF('FW nonmetal plant'!H47=\"\",\"\",'FW nonmetal plant'!H47)","v":""},{"$f":"IF('FW nonmetal plant'!H53=\"\",\"\",'FW nonmetal plant'!H53)","v":"95% CL "},{"$f":"IF('FW nonmetal plant'!H53=\"\",\"\",'FW nonmetal plant'!H53)","v":"95% CL "},{"$f":"IF('FW nonmetal plant'!H57=\"\",\"\",'FW nonmetal plant'!H57)","v":""},{"$f":"IF('FW nonmetal plant'!H61=\"\",\"\",'FW nonmetal plant'!H61)","v":""},{"$f":"IF('FW nonmetal plant'!H64=\"\",\"\",'FW nonmetal plant'!H64)","v":"96.5% pure"}]
[{"$f":"'FW nonmetal plant'!G3","v":"Species (Scientific name)"},{"$f":"'FW nonmetal plant'!G4","v":"Lifestage"},{"$f":"'FW nonmetal plant'!G5","v":"Exposure duration"},{"$f":"'FW nonmetal plant'!G6","v":"Measure of toxicity"},{"$f":"'FW nonmetal plant'!G7","v":"Toxicity endpoint"},{"$f":"'FW nonmetal plant'!G8","v":"Toxicity value"},{"$f":"'FW nonmetal plant'!J2","v":"Taxonomic group"},{"$f":"'FW nonmetal plant'!J3","v":"Phylum"},{"$f":"'FW nonmetal plant'!J4","v":"Class"},{"$f":"'FW nonmetal plant'!J5","v":"Media"},{"$f":"'FW nonmetal plant'!J6","v":"Temperature "},{"$f":"'FW nonmetal plant'!J7","v":"Acute Or Chronic "},{"$f":"'FW nonmetal plant'!J8","v":"PH"},{"$f":"'FW nonmetal plant'!J9","v":"Salinity/Conductivity"},{"$f":"'FW nonmetal plant'!C4","v":"Citation"},{"$f":"'FW nonmetal plant'!G2","v":"Citation No."}]
[{"$f":"'FW nonmetal plant'!Q3","v":"Scenedesmus obliguus"},{"$f":"'FW nonmetal plant'!T3","v":"logarithmic growth phase"},{"$f":"'FW nonmetal plant'!W3","v":"72 hour"},{"$f":"'FW nonmetal plant'!Z3","v":"LOEC"},{"$f":"'FW nonmetal plant'!AC3","v":"cartenoid conc. "},{"$f":"IF('FW nonmetal plant'!H8=\"\",\"\",'FW nonmetal plant'!H8)","v":"0.2mg/L"},{"$f":"'FW nonmetal plant'!AF3","v":"Microalga"},{"$f":"'FW nonmetal plant'!AI3","v":"Chlorophyta"},{"$f":"'FW nonmetal plant'!AO3","v":"AAP"},{"$f":"'FW nonmetal plant'!AR3","v":"21-24 ± 2"},{"$f":"'FW nonmetal plant'!AR3","v":"21-24 ± 2"},{"$f":"'FW nonmetal plant'!AU3","v":"Chronic"},{"$f":"'FW nonmetal plant'!AX3","v":7.5},{"$f":"'FW nonmetal plant'!BA3","v":"N.A."},{"$f":"IF('FW nonmetal plant'!E4=\"\",\"\",'FW nonmetal plant'!E4)","v":"Qu,H., R.X. Ma, D.H. Liu, P. Wang, L.D. Huang, X.X. Qiu, and Z.Q. Zhou (2014) Enantioselective Toxicity and Degradation of the Chiral Insecticide Fipronil in Scenedesmus obliguus Suspension System Environ. Toxicol. Chem.33(11): 2516-2521"},{"$f":"IF('FW nonmetal plant'!H2=\"\",\"\",'FW nonmetal plant'!H2)","v":"1077"}]
[{"$f":"'FW metal plant'!B11","v":"No."},{"$f":"'FW metal plant'!B13","v":1},{"$f":"'FW metal plant'!B16","v":2},{"$f":"'FW metal plant'!B19","v":3},{"$f":"'FW metal plant'!B21","v":4},{"$f":"'FW metal plant'!B23","v":5},{"$f":"'FW metal plant'!B26","v":6},{"$f":"'FW metal plant'!B29","v":7},{"$f":"'FW metal plant'!B32","v":8},{"$f":"'FW metal plant'!B35","v":9},{"$f":"'FW metal plant'!B39","v":10},{"$f":"'FW metal plant'!B42","v":11},{"$f":"'FW metal plant'!B45","v":12},{"$f":"'FW metal plant'!B48","v":13},{"$f":"'FW metal plant'!B51","v":14},{"$f":"'FW metal plant'!B53","v":15},{"$f":"'FW metal plant'!B58","v":16.100000000000001},{"$f":"'FW metal plant'!B61","v":16.2},{"$f":"'FW metal plant'!B64","v":16.3},{"$f":"'FW metal plant'!B67","v":16.399999999999999},{"$f":"'FW metal plant'!B70","v":17},{"$f":"'FW metal plant'!B73","v":18},{"$f":"'FW metal plant'!C78","v":"Total score"},{"$f":"'FW metal plant'!C80","v":"Quality Score"}]
[{"$f":"'FW metal plant'!C2","v":"Category"},{"$f":"'FW metal plant'!E2","v":"Freshwater/metal/plant"},{"$f":"'FW metal plant'!C3","v":"Paper and data unique identifier(eg. 1-1,10-150)"},{"$f":"'FW metal plant'!E3","v":0}]
[{"$f":"'FW metal plant'!G11","v":"Scores"},{"$f":"'FW metal plant'!G12","v":0},{"$f":"'FW metal plant'!G15","v":0},{"$f":"'FW metal plant'!G18","v":0},{"$f":"'FW metal plant'!G21","v":0},{"$f":"'FW metal plant'!G23","v":0},{"$f":"'FW metal plant'!G26","v":0},{"$f":"'FW metal plant'!G29","v":0},{"$f":"'FW metal plant'!G32","v":0},{"$f":"'FW metal plant'!G35","v":0},{"$f":"'FW metal plant'!G38","v":0},{"$f":"'FW metal plant'!G41","v":0},{"$f":"'FW metal plant'!G44","v":0},{"$f":"'FW metal plant'!G47","v":0},{"$f":"'FW metal plant'!G50","v":0},{"$f":"'FW metal plant'!G53","v":0},{"$f":"'FW metal plant'!G57","v":0},{"$f":"'FW metal plant'!G60","v":0},{"$f":"'FW metal plant'!G63","v":0},{"$f":"'FW metal plant'!G66","v":0},{"$f":"'FW metal plant'!G69","v":0},{"$f":"'FW metal plant'!G72","v":0},{"$f":"'FW metal plant'!G78","v":""},{"$f":"'FW metal plant'!G80","v":{"$error":"#N/A"}},{"$f":"'FW metal plant'!H80","v":""}]
[{"$f":"'FW metal plant'!H11","v":"Answers"},{"$f":"IF('FW metal plant'!H12=\"\",\"\",'FW metal plant'!H12)","v":""},{"$f":"IF('FW metal plant'!H15=\"\",\"\",'FW metal plant'!H15)","v":""},{"$f":"IF('FW metal plant'!H18=\"\",\"\",'FW metal plant'!H18)","v":""},{"$f":"IF('FW metal plant'!H21=\"\",\"\",'FW metal plant'!H21)","v":""},{"$f":"IF('FW metal plant'!H23=\"\",\"\",'FW metal plant'!H23)","v":""},{"$f":"IF('FW metal plant'!H26=\"\",\"\",'FW metal plant'!H26)","v":""},{"$f":"IF('FW metal plant'!H29=\"\",\"\",'FW metal plant'!H29)","v":""},{"$f":"IF('FW metal plant'!H32=\"\",\"\",'FW metal plant'!H32)","v":""},{"$f":"IF('FW metal plant'!H35=\"\",\"\",'FW metal plant'!H35)","v":""},{"$f":"IF('FW metal plant'!H38=\"\",\"\",'FW metal plant'!H38)","v":""},{"$f":"IF('FW metal plant'!H41=\"\",\"\",'FW metal plant'!H41)","v":""},{"$f":"IF('FW metal plant'!H44=\"\",\"\",'FW metal plant'!H44)","v":""},{"$f":"IF('FW metal plant'!H47=\"\",\"\",'FW metal plant'!H47)","v":""},{"$f":"IF('FW metal plant'!H50=\"\",\"\",'FW metal plant'!H50)","v":""},{"$f":"IF('FW metal plant'!H53=\"\",\"\",'FW metal plant'!H53)","v":""},{"$f":"IF('FW metal plant'!H57=\"\",\"\",'FW metal plant'!H57)","v":""},{"$f":"IF('FW metal plant'!H60=\"\",\"\",'FW metal plant'!H60)","v":""},{"$f":"IF('FW metal plant'!H63=\"\",\"\",'FW metal plant'!H63)","v":""},{"$f":"IF('FW metal plant'!H66=\"\",\"\",'FW metal plant'!H66)","v":""},{"$f":"IF('FW metal plant'!H69=\"\",\"\",'FW metal plant'!H69)","v":""},{"$f":"IF('FW metal plant'!H72=\"\",\"\",'FW metal plant'!H72)","v":""}]
[{"$f":"'FW metal plant'!G3","v":"Species (Scientific name)"},{"$f":"'FW metal plant'!G4","v":"Lifestage"},{"$f":"'FW metal plant'!G5","v":"Exposure duration"},{"$f":"'FW metal plant'!G6","v":"Measure of toxicity"},{"$f":"'FW metal plant'!G7","v":"Toxicity endpoint"},{"$f":"'FW metal plant'!G8","v":"Toxicity value"},{"$f":"'FW metal plant'!J2","v":"Taxonomic group"},{"$f":"'FW metal plant'!J3","v":"Phylum"},{"$f":"'FW metal plant'!J4","v":"Class"},{"$f":"'FW metal plant'!J5","v":"Media"},{"$f":"'FW metal plant'!J6","v":"Temperature "},{"$f":"'FW metal plant'!J7","v":"Acute Or Chronic "},{"$f":"'FW metal plant'!J8","v":"PH"},{"$f":"'FW metal plant'!J9","v":"Salinity/Conductivity"},{"$f":"'FW metal plant'!C4","v":"Citation"},{"$f":"'FW metal plant'!G2","v":"Citation No."}]
[{"$f":"'FW metal plant'!Q3","v":""},{"$f":"'FW metal plant'!T3","v":""},{"$f":"'FW metal plant'!W3","v":""},{"$f":"'FW metal plant'!Z3","v":""},{"$f":"'FW metal plant'!AC3","v":""},{"$f":"IF('FW metal plant'!H8=\"\",\"\",'FW metal plant'!H8)","v":""},{"$f":"'FW metal plant'!AF3","v":""},{"$f":"'FW metal plant'!AI3","v":""},{"$f":"'FW metal plant'!AL3","v":""},{"$f":"'FW metal plant'!AO3","v":""},{"$f":"'FW metal plant'!AR3","v":""},{"$f":"'FW metal plant'!AU3","v":""},{"$f":"'FW metal plant'!AX3","v":""},{"$f":"'FW metal plant'!BA3","v":"N.A."},{"$f":"IF('FW metal plant'!E4=\"\",\"\",'FW metal plant'!E4)","v":""},{"$f":"IF('FW metal plant'!H2=\"\",\"\",'FW metal plant'!H2)","v":0}]
[{"$f":"'FW nonmetal nonplant'!B11","v":"No."},{"$f":"'FW nonmetal nonplant'!B13","v":1},{"$f":"'FW nonmetal nonplant'!B16","v":2},{"$f":"'FW nonmetal nonplant'!B19","v":3},{"$f":"'FW nonmetal nonplant'!B21","v":4},{"$f":"'FW nonmetal nonplant'!B23","v":5},{"$f":"'FW nonmetal nonplant'!B26","v":6},{"$f":"'FW nonmetal nonplant'!B29","v":7},{"$f":"'FW nonmetal nonplant'!B32","v":8},{"$f":"'FW nonmetal nonplant'!B35","v":9},{"$f":"'FW nonmetal nonplant'!B39","v":10},{"$f":"'FW nonmetal nonplant'!B42","v":11},{"$f":"'FW nonmetal nonplant'!B45","v":12},{"$f":"'FW nonmetal nonplant'!B48","v":13},{"$f":"'FW nonmetal nonplant'!B51","v":14},{"$f":"'FW nonmetal nonplant'!B53","v":15},{"$f":"'FW nonmetal nonplant'!B58","v":16.100000000000001},{"$f":"'FW nonmetal nonplant'!B61","v":16.2},{"$f":"'FW nonmetal nonplant'!B64","v":17},{"$f":"'FW nonmetal nonplant'!B67","v":18},{"$f":"'FW nonmetal nonplant'!C72","v":"Total score"},{"$f":"'FW nonmetal nonplant'!C74","v":"Quality Score"}]
[{"$f":"'FW nonmetal nonplant'!C2","v":"Category"},{"$f":"'FW nonmetal nonplant'!E2","v":"Freshwater/non-metal/non- plant"},{"$f":"'FW nonmetal nonplant'!C3","v":"Paper and data unique identifier(eg. 1-1,10-150)"},{"$f":"'FW nonmetal nonplant'!E3","v":"yyyy-2"}]
[{"$f":"'FW nonmetal nonplant'!G11","v":"Scores"},{"$f":"'FW nonmetal nonplant'!G12","v":10},{"$f":"'FW nonmetal nonplant'!G15","v":5},{"$f":"'FW nonmetal nonplant'!G18","v":5},{"$f":"'FW nonmetal nonplant'!G21","v":5},{"$f":"'FW nonmetal nonplant'!G23","v":5},{"$f":"'FW nonmetal nonplant'!G26","v":5},{"$f":"'FW nonmetal nonplant'!G29","v":0},{"$f":"'FW nonmetal nonplant'!G32","v":5},{"$f":"'FW nonmetal nonplant'!G35","v":5},{"$f":"'FW nonmetal nonplant'!G38","v":0},{"$f":"'FW nonmetal nonplant'!G41","v":0},{"$f":"'FW nonmetal nonplant'!G44","v":0},{"$f":"'FW nonmetal nonplant'!G47","v":4},{"$f":"'FW nonmetal nonplant'!G50","v":4},{"$f":"'FW nonmetal nonplant'!G53","v":4},{"$f":"'FW nonmetal nonplant'!G57","v":0},{"$f":"'FW nonmetal nonplant'!G60","v":0},{"$f":"'FW nonmetal nonplant'!G63","v":3},{"$f":"'FW nonmetal nonplant'!G66","v":3},{"$f":"'FW nonmetal nonplant'!G72","v":63},{"$f":"'FW nonmetal nonplant'!G74","v":0.69230769230769229},null,{"$f":"'FW nonmetal nonplant'!H74","v":"The highest possible grade for this datum is acceptable."}]
[{"$f":"'FW nonmetal nonplant'!H11","v":"Answers"},{"$f":"IF('FW nonmetal nonplant'!H12=\"\",\"\",'FW nonmetal nonplant'!H12)","v":"48-hours"},{"$f":"IF('FW nonmetal nonplant'!H15=\"\",\"\",'FW nonmetal nonplant'!H15)","v":"Larval mortality"},{"$f":"IF('FW nonmetal nonplant'!H18=\"\",\"\",'FW nonmetal nonplant'!H18)","v":"LC"},{"$f":"IF('FW nonmetal nonplant'!H21=\"\",\"\",'FW nonmetal nonplant'!H21)","v":"50% and 90%"},{"$f":"IF('FW nonmetal nonplant'!H23=\"\",\"\",'FW nonmetal nonplant'!H23)","v":"Each concentration was replicated 3\ntimes, and 3 untreated controls receiving only 1 ml of acetone"},{"$f":"IF('FW nonmetal nonplant'!H26=\"\",\"\",'FW nonmetal nonplant'!H26)","v":"Untreated controls receiving only 1 ml of acetone"},{"$f":"IF('FW nonmetal nonplant'!H29=\"\",\"\",'FW nonmetal nonplant'!H29)","v":"Control mortality not stated or shown - methods say that treatments were corrected for control mortalities, but actual control mortalities are unknown."},{"$f":"IF('FW nonmetal nonplant'!H32=\"\",\"\",'FW nonmetal nonplant'!H32)","v":"Larvae, late 4th instar"},{"$f":"IF('FW nonmetal nonplant'!H35=\"\",\"\",'FW nonmetal nonplant'!H35)","v":"Tap water"},{"$f":"IF('FW nonmetal nonplant'!H38=\"\",\"\",'FW nonmetal nonplant'!H38)","v":"Assumed static"},{"$f":"IF('FW nonmetal nonplant'!H41=\"\",\"\",'FW nonmetal nonplant'!H41)","v":"Not stated that they were measured"},{"$f":"IF('FW nonmetal nonplant'!H44=\"\",\"\",'FW nonmetal nonplant'!H44)","v":"Not stated"},{"$f":"IF('FW nonmetal nonplant'!H47=\"\",\"\",'FW nonmetal nonplant'!H47)","v":"Not observable , but stated in statistical analysis"},{"$f":"IF('FW nonmetal nonplant'!H50=\"\",\"\",'FW nonmetal nonplant'!H50)","v":"Log dose probit regression analysis"},{"$f":"IF('FW nonmetal nonplant'!H53=\"\",\"\",'FW nonmetal nonplant'!H53)","v":"95% CL"},{"$f":"IF('FW nonmetal nonplant'!H57=\"\",\"\",'FW nonmetal nonplant'!H57)","v":"Not stated"},{"$f":"IF('FW nonmetal nonplant'!H60=\"\",\"\",'FW nonmetal nonplant'!H60)","v":"Not stated"},{"$f":"IF('FW nonmetal nonplant'!H63=\"\",\"\",'FW nonmetal nonplant'!H63)","v":"28 +/- 3*C"},{"$f":"IF('FW nonmetal nonplant'!H66=\"\",\"\",'FW nonmetal nonplant'!H66)","v":"Fipronil (97.l%),"}]
[{"$f":"'FW nonmetal nonplant'!G3","v":"Species (Scientific name)"},{"$f":"'FW nonmetal nonplant'!G4","v":"Lifestage"},{"$f":"'FW nonmetal nonplant'!G5","v":"Exposure duration"},{"$f":"'FW nonmetal nonplant'!G6","v":"Measure of toxicity"},{"$f":"'FW nonmetal nonplant'!G7","v":"Toxicity endpoint"},{"$f":"'FW nonmetal nonplant'!G8","v":"Toxicity value"},{"$f":"'FW nonmetal nonplant'!J2","v":"Taxonomic group"},{"$f":"'FW nonmetal nonplant'!J3","v":"Phylum"},{"$f":"'FW nonmetal nonplant'!J4","v":"Class"},{"$f":"'FW nonmetal nonplant'!J5","v":"Media"},{"$f":"'FW nonmetal nonplant'!J6","v":"Temperature "},{"$f":"'FW nonmetal nonplant'!J7","v":"Acute Or Chronic "},{"$f":"'FW nonmetal nonplant'!J8","v":"PH"},{"$f":"'FW nonmetal nonplant'!J9","v":"Salinity/Conductivity"},{"$f":"'FW nonmetal nonplant'!C4","v":"Citation"},{"$f":"'FW nonmetal nonplant'!G2","v":"Citation No."}]
[{"$f":"'FW nonmetal nonplant'!Q3","v":"Culex quinqefasciatus"},{"$f":"'FW nonmetal nonplant'!T3","v":"Larvae (late 4th instar)"},{"$f":"'FW nonmetal nonplant'!W3","v":"48hr"},{"$f":"'FW nonmetal nonplant'!Z3","v":"LC90"},{"$f":"'FW nonmetal nonplant'!AC3","v":"Mortality"},{"$f":"IF('FW nonmetal nonplant'!H8=\"\",\"\",'FW nonmetal nonplant'!H8)","v":"0.000896 PPM"},{"$f":"'FW nonmetal nonplant'!AF3","v":"Macroinvertebrate"},{"$f":"'FW nonmetal nonplant'!AI3","v":"Arthropoda"},{"$f":"'FW nonmetal nonplant'!AL3","v":"Insecta"},{"$f":"'FW nonmetal nonplant'!AO3","v":"Tap water"},{"$f":"'FW nonmetal nonplant'!AR3","v":"28 + 3"},{"$f":"'FW nonmetal nonplant'!AU3","v":"Acute "},{"$f":"'FW nonmetal nonplant'!AX3","v":"Not stated"},{"$f":"'FW nonmetal nonplant'!BA3","v":"N.A."},{"$f":"IF('FW nonmetal nonplant'!E4=\"\",\"\",'FW nonmetal nonplant'!E4)","v":"Ali A, Chowdhury MA, Hossain MI, Ameen MU, Habiba DB and Aslam AFM (1999). Laboratory evaluation of selected larvicides and insect growth regulators against field-collected Culex quinquefasciatus larvae from urban Dhaka, Bangladesh, Journal of the American Mosquito Control Association, 15(1), 43-47."},{"$f":"IF('FW nonmetal nonplant'!H2=\"\",\"\",'FW nonmetal nonplant'!H2)","v":"yyyy"}]
[{"$f":"'FW metal nonplant'!B11","v":"No."},{"$f":"'FW metal nonplant'!B13","v":1},{"$f":"'FW metal nonplant'!B16","v":2},{"$f":"'FW metal nonplant'!B19","v":3},{"$f":"'FW metal nonplant'!B21","v":4},{"$f":"'FW metal nonplant'!B23","v":5},{"$f":"'FW metal nonplant'!B26","v":6},{"$f":"'FW metal nonplant'!B29","v":7},{"$f":"'FW metal nonplant'!B32","v":8},{"$f":"'FW metal nonplant'!B35","v":9},{"$f":"'FW metal nonplant'!B39","v":10},{"$f":"'FW metal nonplant'!B42","v":11},{"$f":"'FW metal nonplant'!B45","v":12},{"$f":"'FW metal nonplant'!B48","v":13},{"$f":"'FW metal nonplant'!B51","v":14},{"$f":"'FW metal nonplant'!B53","v":15},{"$f":"'FW metal nonplant'!B58","v":16.100000000000001},{"$f":"'FW metal nonplant'!B61","v":16.2},{"$f":"'FW metal nonplant'!B64","v":16.3},{"$f":"'FW metal nonplant'!B67","v":16.399999999999999},{"$f":"'FW metal nonplant'!B70","v":16.5},{"$f":"'FW metal nonplant'!B73","v":17},{"$f":"'FW metal nonplant'!B76","v":18},{"$f":"'FW metal nonplant'!C81","v":"Total score"},{"$f":"'FW metal nonplant'!C83","v":"Quality Score"}]
[{"$f":"'FW metal nonplant'!C2","v":"Category"},{"$f":"'FW metal nonplant'!E2","v":"Freshwater/metal/non- plant"},{"$f":"'FW metal nonplant'!C3","v":"Paper and data unique identifier(eg. 1-1,10-150)"},{"$f":"'FW metal nonplant'!E3","v":"1024-1"}]
[{"$f":"'FW metal nonplant'!G11","v":"Scores"},{"$f":"'FW metal nonplant'!G12","v":10},{"$f":"'FW metal nonplant'!G15","v":10},{"$f":"'FW metal nonplant'!G18","v":5},{"$f":"'FW metal nonplant'!G21","v":5},{"$f":"'FW metal nonplant'!G23","v":5},{"$f":"'FW metal nonplant'!G26","v":5},{"$f":"'FW metal nonplant'!G29","v":5},{"$f":"'FW metal nonplant'!G32","v":5},{"$f":"'FW metal nonplant'!G35","v":5},{"$f":"'FW metal nonplant'!G38","v":4},{"$f":"'FW metal nonplant'!G41","v":4},{"$f":"'FW metal nonplant'!G44","v":4},{"$f":"'FW metal nonplant'!G47","v":4},{"$f":"'FW metal nonplant'!G50","v":4},{"$f":"'FW metal nonplant'!G53","v":4},{"$f":"'FW metal nonplant'!G57","v":3},{"$f":"'FW metal nonplant'!G60","v":3},{"$f":"'FW metal nonplant'!G63","v":3},{"$f":"'FW metal nonplant'!G66","v":3},{"$f":"'FW metal nonplant'!G69","v":3},{"$f":"'FW metal nonplant'!G72","v":3},{"$f":"'FW metal nonplant'!G75","v":3},{"$f":"'FW metal nonplant'!G81","v":100},{"$f":"'FW metal nonplant'!G83","v":1},{"$f":"'FW metal nonplant'!H83","v":""}]
[{"$f":"'FW metal nonplant'!H11","v":"Answers"},{"$f":"IF('FW metal nonplant'!H12=\"\",\"\",'FW metal nonplant'!H12)","v":""},{"$f":"IF('FW metal nonplant'!H15=\"\",\"\",'FW metal nonplant'!H15)","v":""},{"$f":"IF('FW metal nonplant'!H18=\"\",\"\",'FW metal nonplant'!H18)","v":""},{"$f":"IF('FW metal nonplant'!H21=\"\",\"\",'FW metal nonplant'!H21)","v":""},{"$f":"IF('FW metal nonplant'!H23=\"\",\"\",'FW metal nonplant'!H23)","v":""},{"$f":"IF('FW metal nonplant'!H26=\"\",\"\",'FW metal nonplant'!H26)","v":""},{"$f":"IF('FW metal nonplant'!H29=\"\",\"\",'FW metal nonplant'!H29)","v":""},{"$f":"IF('FW metal nonplant'!H32=\"\",\"\",'FW metal nonplant'!H32)","v":""},{"$f":"IF('FW metal nonplant'!H35=\"\",\"\",'FW metal nonplant'!H35)","v":""},{"$f":"IF('FW metal nonplant'!H38=\"\",\"\",'FW metal nonplant'!H38)","v":""},{"$f":"IF('FW metal nonplant'!H41=\"\",\"\",'FW metal nonplant'!H41)","v":""},{"$f":"IF('FW metal nonplant'!H44=\"\",\"\",'FW metal nonplant'!H44)","v":""},{"$f":"IF('FW metal nonplant'!H47=\"\",\"\",'FW metal nonplant'!H47)","v":""},{"$f":"IF('FW metal nonplant'!H50=\"\",\"\",'FW metal nonplant'!H50)","v":""},{"$f":"IF('FW metal nonplant'!H53=\"\",\"\",'FW metal nonplant'!H53)","v":""},{"$f":"IF('FW metal nonplant'!H57=\"\",\"\",'FW metal nonplant'!H57)","v":""},{"$f":"IF('FW metal nonplant'!H60=\"\",\"\",'FW metal nonplant'!H60)","v":""},{"$f":"IF('FW metal nonplant'!H63=\"\",\"\",'FW metal nonplant'!H63)","v":""},{"$f":"IF('FW metal nonplant'!H66=\"\",\"\",'FW metal nonplant'!H66)","v":""},{"$f":"IF('FW metal nonplant'!H69=\"\",\"\",'FW metal nonplant'!H69)","v":""},{"$f":"IF('FW metal nonplant'!H72=\"\",\"\",'FW metal nonplant'!H72)","v":""},{"$f":"IF('FW metal nonplant'!H75=\"\",\"\",'FW metal nonplant'!H75)","v":""}]
[{"$f":"'FW metal nonplant'!G3","v":"Species (Scientific name)"},{"$f":"'FW metal nonplant'!G4","v":"Lifestage"},{"$f":"'FW metal nonplant'!G5","v":"Exposure duration"},{"$f":"'FW metal nonplant'!G6","v":"Measure of toxicity"},{"$f":"'FW metal nonplant'!G7","v":"Toxicity endpoint"},{"$f":"'FW metal nonplant'!G8","v":"Toxicity value"},{"$f":"'FW metal nonplant'!J2","v":"Taxonomic group"},{"$f":"'FW metal nonplant'!J3","v":"Phylum"},{"$f":"'FW metal nonplant'!J4","v":"Class"},{"$f":"'FW metal nonplant'!J5","v":"Media"},{"$f":"'FW metal nonplant'!J6","v":"Temperature "},{"$f":"'FW metal nonplant'!J7","v":"Acute Or Chronic "},{"$f":"'FW metal nonplant'!J8","v":"PH"},{"$f":"'FW metal nonplant'!J9","v":"Salinity/Conductivity"},{"$f":"'FW metal nonplant'!C4","v":"Citation"},{"$f":"'FW metal nonplant'!G2","v":"Citation No."}]
[{"$f":"'FW metal nonplant'!Q3","v":"Aedes albopictus"},{"$f":"'FW metal nonplant'!T3","v":"1 month"},{"$f":"'FW metal nonplant'!W3","v":"13 days"},{"$f":"'FW metal nonplant'!Z3","v":"NOEC"},{"$f":"'FW metal nonplant'!AC3","v":"Mortality"},{"$f":"IF('FW metal nonplant'!H8=\"\",\"\",'FW metal nonplant'!H8)","v":1},{"$f":"'FW metal nonplant'!AF3","v":"Fish"},{"$f":"'FW metal nonplant'!AI3","v":"N.A."},{"$f":"'FW metal nonplant'!AL3","v":"Chlorophyceae"},{"$f":"'FW metal nonplant'!AO3","v":"N.A."},{"$f":"'FW metal nonplant'!AR3","v":"15°C"},{"$f":"'FW metal nonplant'!AU3","v":"Acute "},{"$f":"'FW metal nonplant'!AX3","v":"N.A."},{"$f":"'FW metal nonplant'!BA3","v":"N.A."},{"$f":"IF('FW metal nonplant'!E4=\"\",\"\",'FW metal nonplant'!E4)","v":"Davies,P.E., and R.W.G. White (1985) The Toxicology and Metabolism of Chlorothalonil in Fish. I. Lethal Levels for Salmo gairdneri, Galaxias maculatus, G. truttaceus and G. auratus and the Fate of 14C-TCIN in S. gairdneri Aquat. Toxicol.7(1/2): 93-105 "},{"$f":"IF('FW metal nonplant'!H2=\"\",\"\",'FW metal nonplant'!H2)","v":"1024"}]
[{"$f":"'MEW nonplant'!B11","v":"No."},{"$f":"'MEW nonplant'!B13","v":1},{"$f":"'MEW nonplant'!B16","v":2},{"$f":"'MEW nonplant'!B19","v":3},{"$f":"'MEW nonplant'!B21","v":4},{"$f":"'MEW nonplant'!B23","v":5},{"$f":"'MEW nonplant'!B26","v":6},{"$f":"'MEW nonplant'!B29","v":7},{"$f":"'MEW nonplant'!B32","v":8},{"$f":"'MEW nonplant'!B35","v":9},{"$f":"'MEW nonplant'!B39","v":10},{"$f":"'MEW nonplant'!B42","v":11},{"$f":"'MEW nonplant'!B45","v":12},{"$f":"'MEW nonplant'!B48","v":13},{"$f":"'MEW nonplant'!B51","v":14},{"$f":"'MEW nonplant'!B53","v":15},{"$f":"'MEW nonplant'!B58","v":16.100000000000001},{"$f":"'MEW nonplant'!B61","v":16.2},{"$f":"'MEW nonplant'!B64","v":16.3},{"$f":"'MEW nonplant'!B67","v":17},{"$f":"'MEW nonplant'!B70","v":18},{"$f":"'MEW nonplant'!C75","v":"Total score"},{"$f":"'MEW nonplant'!C77","v":"Quality Score"}]
[{"$f":"'MEW nonplant'!C2","v":"Category"},{"$f":"'MEW nonplant'!E2","v":"MEW_nonplant"},{"$f":"'MEW nonplant'!C3","v":"Paper and data unique identifier(eg. 1-1,10-150)"},{"$f":"'MEW nonplant'!E3","v":0}]
[{"$f":"'MEW nonplant'!G11","v":"Scores"},{"$f":"'MEW nonplant'!G12","v":0},{"$f":"'MEW nonplant'!G15","v":0},{"$f":"'MEW nonplant'!G18","v":0},{"$f":"'MEW nonplant'!G21","v":0},{"$f":"'MEW nonplant'!G23","v":0},{"$f":"'MEW nonplant'!G26","v":0},{"$f":"'MEW nonplant'!G29","v":0},{"$f":"'MEW nonplant'!G32","v":0},{"$f":"'MEW nonplant'!G35","v":0},{"$f":"'MEW nonplant'!G38","v":0},{"$f":"'MEW nonplant'!G41","v":0},{"$f":"'MEW nonplant'!G44","v":0},{"$f":"'MEW nonplant'!G47","v":0},{"$f":"'MEW nonplant'!G50","v":0},{"$f":"'MEW nonplant'!G53","v":0},{"$f":"'MEW nonplant'!G57","v":0},{"$f":"'MEW nonplant'!G60","v":0},{"$f":"'MEW nonplant'!G63","v":0},{"$f":"'MEW nonplant'!G66","v":0},{"$f":"'MEW nonplant'!G69","v":0},{"$f":"'MEW nonplant'!G75","v":""},{"$f":"'MEW nonplant'!G77","v":{"$error":"#N/A"}},{"$f":"'MEW nonplant'!H77","v":""}]
[{"$f":"'MEW nonplant'!H11","v":"Answers"},{"$f":"IF('MEW nonplant'!H12=\"\",\"\",'MEW nonplant'!H12)","v":""},{"$f":"IF('MEW nonplant'!H15=\"\",\"\",'MEW nonplant'!H15)","v":""},{"$f":"IF('MEW nonplant'!H18=\"\",\"\",'MEW nonplant'!H18)","v":""},{"$f":"IF('MEW nonplant'!H21=\"\",\"\",'MEW nonplant'!H21)","v":""},{"$f":"IF('MEW nonplant'!H23=\"\",\"\",'MEW nonplant'!H23)","v":""},{"$f":"IF('MEW nonplant'!H26=\"\",\"\",'MEW nonplant'!H26)","v":""},{"$f":"IF('MEW nonplant'!H29=\"\",\"\",'MEW nonplant'!H29)","v":""},{"$f":"IF('MEW nonplant'!H32=\"\",\"\",'MEW nonplant'!H32)","v":""},{"$f":"IF('MEW nonplant'!H35=\"\",\"\",'MEW nonplant'!H35)","v":""},{"$f":"IF('MEW nonplant'!H38=\"\",\"\",'MEW nonplant'!H38)","v":""},{"$f":"IF('MEW nonplant'!H41=\"\",\"\",'MEW nonplant'!H41)","v":""},{"$f":"IF('MEW nonplant'!H44=\"\",\"\",'MEW nonplant'!H44)","v":""},{"$f":"IF('MEW nonplant'!H47=\"\",\"\",'MEW nonplant'!H47)","v":""},{"$f":"IF('MEW nonplant'!H50=\"\",\"\",'MEW nonplant'!H50)","v":""},{"$f":"IF('MEW nonplant'!H53=\"\",\"\",'MEW nonplant'!H53)","v":""},{"$f":"IF('MEW nonplant'!H57=\"\",\"\",'MEW nonplant'!H57)","v":""},{"$f":"IF('MEW nonplant'!H60=\"\",\"\",'MEW nonplant'!H60)","v":""},{"$f":"IF('MEW nonplant'!H63=\"\",\"\",'MEW nonplant'!H63)","v":""},{"$f":"IF('MEW nonplant'!H66=\"\",\"\",'MEW nonplant'!H66)","v":""},{"$f":"IF('MEW nonplant'!H69=\"\",\"\",'MEW nonplant'!H69)","v":""}]
[{"$f":"'MEW nonplant'!G3","v":"Species (Scientific name)"},{"$f":"'MEW nonplant'!G4","v":"Lifestage"},{"$f":"'MEW nonplant'!G5","v":"Exposure duration"},{"$f":"'MEW nonplant'!G6","v":"Measure of toxicity"},{"$f":"'MEW nonplant'!G7","v":"Toxicity endpoint"},{"$f":"'MEW nonplant'!G8","v":"Toxicity value"},{"$f":"'MEW nonplant'!J2","v":"Taxonomic group"},{"$f":"'MEW nonplant'!J3","v":"Phylum"},{"$f":"'MEW nonplant'!J4","v":"Class"},{"$f":"'MEW nonplant'!J5","v":"Media"},{"$f":"'MEW nonplant'!J6","v":"Temperature "},{"$f":"'MEW nonplant'!J7","v":"Acute Or Chronic "},{"$f":"'MEW nonplant'!J8","v":"PH"},{"$f":"'MEW nonplant'!J9","v":"Salinity/Conductivity"},{"$f":"'MEW nonplant'!C4","v":"Citation"},{"$f":"'MEW nonplant'!G2","v":"Citation No."}]
[{"$f":"'MEW nonplant'!Q3","v":""},{"$f":"'MEW nonplant'!T3","v":""},{"$f":"'MEW nonplant'!W3","v":""},{"$f":"'MEW nonplant'!Z3","v":""},{"$f":"'MEW nonplant'!AC3","v":""},{"$f":"IF('MEW nonplant'!H8=\"\",\"\",'MEW nonplant'!H8)","v":""},{"$f":"'MEW nonplant'!AF3","v":""},{"$f":"'MEW nonplant'!AI3","v":""},{"$f":"'MEW nonplant'!AL3","v":""},{"$f":"'MEW nonplant'!AO3","v":""},{"$f":"'MEW nonplant'!AR3","v":""},{"$f":"'MEW nonplant'!AU3","v":""},{"$f":"'MEW nonplant'!AX3","v":""},{"$f":"'MEW nonplant'!BA3","v":""},{"$f":"IF('MEW nonplant'!E4=\"\", \"\",'MEW nonplant'!E4)","v":""},{"$f":"IF('MEW nonplant'!H2=\"\", \"\",'MEW nonplant'!H2)","v":0}]
[{"$f":"'MEW plant'!B11","v":"No."},{"$f":"'MEW plant'!B13","v":1},{"$f":"'MEW plant'!B16","v":2},{"$f":"'MEW plant'!B19","v":3},{"$f":"'MEW plant'!B21","v":4},{"$f":"'MEW plant'!B23","v":5},{"$f":"'MEW plant'!B26","v":6},{"$f":"'MEW plant'!B29","v":7},{"$f":"'MEW plant'!B32","v":8},{"$f":"'MEW plant'!B35","v":9},{"$f":"'MEW plant'!B39","v":10},{"$f":"'MEW plant'!B42","v":11},{"$f":"'MEW plant'!B45","v":12},{"$f":"'MEW plant'!B48","v":13},{"$f":"'MEW plant'!B51","v":14},{"$f":"'MEW plant'!B53","v":15},{"$f":"'MEW plant'!B57","v":16.100000000000001},{"$f":"'MEW plant'!B61","v":16.2},{"$f":"'MEW plant'!B64","v":17},{"$f":"'MEW plant'!B67","v":18},{"$f":"'MEW plant'!C72","v":"Total score"},{"$f":"'MEW plant'!C74","v":"Quality Score"}]
[{"$f":"'MEW plant'!C2","v":"Category"},{"$f":"'MEW plant'!E2","v":"MEW_plant"},{"$f":"'MEW plant'!C3","v":"Paper and data unique identifier(eg. 1-1,10-150)"},{"$f":"'MEW plant'!E3","v":"1084-1-OK"}]
[{"$f":"'MEW plant'!G11","v":"Scores"},{"$f":"'MEW plant'!G12","v":10},{"$f":"'MEW plant'!G15","v":5},{"$f":"'MEW plant'!G18","v":0},{"$f":"'MEW plant'!G21","v":5},{"$f":"'MEW plant'!G23","v":5},{"$f":"'MEW plant'!G26","v":0},{"$f":"'MEW plant'!G29","v":0},{"$f":"'MEW plant'!G32","v":5},{"$f":"'MEW plant'!G35","v":5},{"$f":"'MEW plant'!G38","v":0},{"$f":"'MEW plant'!G41","v":4},{"$f":"'MEW plant'!G44","v":0},{"$f":"'MEW plant'!G47","v":0},{"$f":"'MEW plant'!G50","v":4},{"$f":"'MEW plant'!G53","v":4},{"$f":"'MEW plant'!G57","v":3},{"$f":"'MEW plant'!G61","v":0},{"$f":"'MEW plant'!G64","v":0},{"$f":"'MEW plant'!G67","v":0},{"$f":"'MEW plant'!G72","v":59},{"$f":"'MEW plant'!G74","v":0.64835164835164838},{"$f":"'MEW plant'!H74","v":""}]
[{"$f":"'MEW plant'!H11","v":"Answers"},{"$f":"IF('MEW plant'!H12=\"\",\"\",'MEW plant'!H12)","v":"45 days"},{"$f":"IF('MEW plant'!H15=\"\",\"\",'MEW plant'!H15)","v":"Decrease of adult survival"},{"$f":"IF('MEW plant'!H18=\"\",\"\",'MEW plant'!H18)","v":""},{"$f":"IF('MEW plant'!H21=\"\",\"\",'MEW plant'!H21)","v":"19.6% relative to controls"},{"$f":"IF('MEW plant'!H23=\"\",\"\",'MEW plant'!H23)","v":"Acetone control"},{"$f":"IF('MEW plant'!H26=\"\",\"\",'MEW plant'!H26)","v":"Not stated"},{"$f":"IF('MEW plant'!H29=\"\",\"\",'MEW plant'!H29)","v":"Not stated"},{"$f":"IF('MEW plant'!H32=\"\",\"\",'MEW plant'!H32)","v":"17 males and 17 females from the same initial hatched cohort."},{"$f":"IF('MEW plant'!H35=\"\",\"\",'MEW plant'!H35)","v":"20%. Seawater"},{"$f":"IF('MEW plant'!H38=\"\",\"\",'MEW plant'!H38)","v":"Not stated"},{"$f":"IF('MEW plant'!H41=\"\",\"\",'MEW plant'!H41)","v":"Nominal (0 ng/L (acetone control), 100 ng/L and 200 ng/L). Actual concentrations are 97.90 ± 20.84 ng/L and 142.98 ± 40.52 ng/L."},{"$f":"IF('MEW plant'!H44=\"\",\"\",'MEW plant'!H44)","v":""},{"$f":"IF('MEW plant'!H47=\"\",\"\",'MEW plant'!H47)","v":""},{"$f":"IF('MEW plant'!H50=\"\",\"\",'MEW plant'!H50)","v":"ANOVA and multiple comparison procedures"},{"$f":"IF('MEW plant'!H53=\"\",\"\",'MEW plant'!H53)","v":"Standard error includes (95% CI)"},{"$f":"IF('MEW plant'!H60=\"\",\"\",'MEW plant'!H60)","v":"8 ± 0.2"},{"$f":"IF('MEW plant'!#REF!=\"\",\"\",'MEW plant'!#REF!)","v":{"$error":"#REF!"}},{"$f":"IF('MEW plant'!H63=\"\",\"\",'MEW plant'!H63)","v":"23.2 ± 0.4°C"},{"$f":"IF('MEW plant'!H66=\"\",\"\",'MEW plant'!H66)","v":"Technical grade 98.0% purity"}]
[{"$f":"'MEW plant'!G3","v":"Species (Scientific name)"},{"$f":"'MEW plant'!G4","v":"Lifestage"},{"$f":"'MEW plant'!G5","v":"Exposure duration"},{"$f":"'MEW plant'!G6","v":"Measure of toxicity"},{"$f":"'MEW plant'!G7","v":"Toxicity endpoint"},{"$f":"'MEW plant'!G8","v":"Toxicity value"},{"$f":"'MEW plant'!J2","v":"Taxonomic group"},{"$f":"'MEW plant'!J3","v":"Phylum"},{"$f":"'MEW plant'!J4","v":"Class"},{"$f":"'MEW plant'!J5","v":"Media"},{"$f":"'MEW plant'!J6","v":"Temperature "},{"$f":"'MEW plant'!J7","v":"Acute Or Chronic "},{"$f":"'MEW plant'!J8","v":"PH"},{"$f":"'MEW plant'!J9","v":"Salinity/Conductivity"},{"$f":"'MEW plant'!C4","v":"Citation"},{"$f":"'MEW plant'!G2","v":"Citation No."}]
[{"$f":"'MEW plant'!Q3","v":"Dunaliella tertiolecta"},{"$f":"'MEW plant'!T3","v":"log phase growth"},{"$f":"'MEW plant'!W3","v":"96 hrs"},{"$f":"'MEW plant'!Z3","v":"LOEC"},{"$f":"'MEW plant'!AC3","v":"Cell density, biovolume"},{"$f":"IF('MEW plant'!H8=\"\",\"\",'MEW plant'!H8)","v":"500ug/L"},{"$f":"'MEW plant'!AF3","v":"Microalga"},{"$f":"'MEW plant'!AI3","v":"Chlorophyta"},{"$f":"'MEW plant'!AL3","v":"Chlorophyceae"},{"$f":"'MEW plant'!AO3","v":"F/2 marine media"},{"$f":"'MEW plant'!AR3","v":25},{"$f":"'MEW plant'!AU3","v":"Chronic"},{"$f":"'MEW plant'!AX3","v":"Not stated"},{"$f":"'MEW plant'!BA3","v":20},{"$f":"IF('MEW plant'!E4=\"\",\"\",'MEW plant'!E4)","v":"Volz,D.C., E.F. Wirth, M.H. Fulton, G.I. Scott, E. Strozier, D.S. Block, J.L. Ferry, S.S. Walse, and G.T. Chandler (2003) Effects of Fipronil and Chlorpyrifos on Endocrine-Related Endpoints in Female Grass Shrimp (Palaemonetes pugio) Bull. Environ. Contam. Toxicol.71(3): 497-503"},{"$f":"IF('MEW plant'!H2=\"\",\"\",'MEW plant'!H2)","v":"1084"}]

{"sheet":"FW metal nonplant","index":5,"n_rows":90,"n_cols":54,"rows_kept":90,"cut":false,"hidden":false,"merged":[[3,4,7,4],[9,2,9,4],[11,2,13,2],[11,7,13,7],[14,2,16,2],[14,7,16,7],[17,2,19,2],[17,7,19,7],[20,2,21,2],[20,7,21,7],[22,2,24,2],[22,7,24,7],[25,2,27,2],[25,7,27,7],[28,2,30,2],[28,7,30,7],[31,2,33,2],[31,7,33,7],[34,2,36,2],[34,7,36,7],[37,2,39,2],[37,7,39,7],[40,2,42,2],[40,7,42,7],[43,2,45,2],[43,7,45,7],[46,2,48,2],[46,7,48,7],[49,2,51,2],[49,7,51,7],[62,7,64,7],[74,2,77,2],[74,7,77,7],[52,2,54,2],[52,7,54,7],[56,7,58,7],[65,7,67,7],[68,7,70,7],[71,2,73,2],[71,7,73,7],[59,7,61,7]]}
[null,1,"Fill in the blank cells below, based on information provided in the paper being assessed. You can either pick an option from the dropdown list or add the appropriate detail using the 'Add to list' button. ",null,null,null,null,null,null,null,null,null,null,null,"* All the text in RED are used for drop down list ,make changes with caution."]
[null,null,"Category",{"$f":"IF(AF3=\"\",0,1)","v":1},"Freshwater/metal/non- plant",{"$f":"IF(E3=\"\",0,1)","v":1},"Citation No.",{"$f":"IF(ISERROR(FIND(\"-\",E3)),E3,LEFT(E3,FIND(\"-\",E3)-1))","v":"1024"},null,"Taxonomic group",null,null,null,null,"Species",null,null,"Lifestage",null,null,"Exposure duration",null,null,"Measure of toxicity",null,null,"Toxicity endpoint",null,null,"Taxonomic group",null,null,"Phylum",null,null,"Class",null,null,"Media",null,null,"Temperature ",null,null,"Acute Or Chronic",null,null,"PH",null,null,"Salinity/Comdictivity"]
[null,null,"Paper and data unique identifier(eg. 1-1,10-150)",{"$f":"IF(AI3=\"\",0,1)","v":1},"1024-1",{"$f":"IF(E4=\"\",0,1)","v":1},"Species (Scientific name)",null,null,"Phylum",null,null,null,null,"Aedes albopictus",1,{"$f":"IF(P3=0,\"\",INDEX(O3:O111,P3))","v":"Aedes albopictus"},"1 month",1,{"$f":"IF(S3=0,\"\",INDEX(R3:R111,S3))","v":"1 month"},"11 hour",2,{"$f":"IF(V3=0,\"\",INDEX(U3:U111,V3))","v":"13 days"},"LC50",3,{"$f":"IF(Y3=0,\"\",INDEX(X3:X111,Y3))","v":"NOEC"},"Mortality",1,{"$f":"IF(AB3=0,\"\",INDEX(AA3:AA111,AB3))","v":"Mortality"},"Fish",1,{"$f":"IF(AE3=0,\"\",INDEX(AD3:AD111,AE3))","v":"Fish"},"Chlorophyta",2,{"$f":"IF(AH3=0,\"\",INDEX(AG3:AG111,AH3))","v":"N.A."},"Branchiopoda",2,{"$f":"IF(AK3=0,\"\",INDEX(AJ3:AJ111,AK3))","v":"Chlorophyceae"},"Freshwater",3,{"$f":"IF(AN3=0,\"\",INDEX(AM3:AM111,AN3))","v":"N.A."},"15°C",1,{"$f":"IF(AQ3=0,\"\",INDEX(AP3:AP111,AQ3))","v":"15°C"},"Acute ",1,{"$f":"IF(AT3=0,\"\",INDEX(AS3:AS111,AT3))","v":"Acute "},"N.A.",1,{"$f":"IF(AW3=0,\"\",INDEX(AV3:AV111,AW3))","v":"N.A."},null,null,"N.A.",1]
[null,null,"Citation",{"$f":"IF(AL3=\"\",0,1)","v":1},"Davies,P.E., and R.W.G. White (1985) The Toxicology and Metabolism of Chlorothalonil in Fish. I. Lethal Levels for Salmo gairdneri, Galaxias maculatus, G. truttaceus and G. auratus and the Fate of 14C-TCIN in S. gairdneri Aquat. Toxicol.7(1/2): 93-105 ",{"$f":"IF(H8=\"\",0,1)","v":1},"Lifestage",null,null,"Class",null,null,null,null,"Australian Bass",null,null,"1 year old",null,null,"13 days",null,null,"N.A.",null,null,"N.A.",null,null,"Microalga",null,null,"N.A.",null,null,"Chlorophyceae",null,null,"Marinewater",null,null,"25°C",null,null,"Chronic",null,null,"PH11"]
[null,null,null,{"$f":"IF(AO3=\"\",0,1)","v":1},null,{"$f":"IF(AX3=\"\",0,1)","v":1},"Exposure duration",null,null,"Media",null,null,null,null,"N.A.",null,null,"N.A.",null,null,"N.A.",null,null,"NOEC",null,null,"Reproduction",null,null,"N.A.",null,null,"Tracheophyta",null,null,"N.A.",null,null,"N.A.",null,null,"N.A.",null,null,"N.A.",null,null,"PH7.0"]
[null,null,null,{"$f":"IF(AR3=\"\",0,1)","v":1},null,{"$f":"IF(Q3=\"\",0,1)","v":1},"Measure of toxicity",null,null,"Temperature "]
[null,null,null,{"$f":"IF(AU3=\"\",0,1)","v":1},null,{"$f":"IF(T3=\"\",0,1)","v":1},"Toxicity endpoint",null,null,"Acute Or Chronic "]
[null,null,null,null,null,{"$f":"IF(W3=\"\",0,1)","v":1},"Toxicity value",1,null,"PH"]
[null,2,"Select the appropriate answer option to each question. Comments can be added to the cells in column H.",null,null,{"$f":"IF(Z3=\"\",0,1)","v":1},null,null,null,"Salinity/Conductivity","N.A."]
[null,"*","If the selected answer option does not work try clicking on any other cell first and then click back on the answer option again.",null,null,{"$f":"IF(AC3=\"\",0,1)","v":1}]
[null,"No.","Question","Marks Awarded","Answer Options","Option References","Scores","Answers"]
[null,null,"Was the duration of the exposure stated (e.g. 48 or 96 h)?",10,null,1,{"$f":"IF(F15=0,0,INDEX($D12:$D13,F12,1))","v":10}]
[null,1,null,0]
[]
[null,null,"Was the biological endpoint (e.g. immobilization or population growth) stated and defined (10 marks)? Award 5 marks if the biological endpoint is only stated.",10,null,1,{"$f":"IF(F15=0,0,INDEX($D15:$D17,F15,1))","v":10}]
[null,2,null,5]
[null,null,null,0]
[null,null,"Was the biological effect stated (e.g. LC or NOEC)?",5,null,1,{"$f":"IF(F18=0,0,INDEX($D18:$D19,F18,1))","v":5}]
[null,3,null,0]
[]
[null,4,"Was the biological effect quantified (e.g. 50% effect, 25% effect)? \nNote: The effect for NOEC and LOEC data must be quantified.",5,null,1,{"$f":"IF(F21=0,0,INDEX($D21:$D22,F21,1))","v":5}]
[null,null,null,0]
[null,5,"Were appropriate controls (e.g. a no-toxicant control and/or solvent control) used?",5,null,1,{"$f":"IF(F23=0,0,INDEX($D23:$D24,F23,1))","v":5}]
[null,null,null,0]
[]
[null,6,"Was each control and contaminant concentration at least duplicated?",5,null,1,{"$f":"IF(F26=0,0,INDEX($D26:$D27,F26,1))","v":5}]
[null,null,null,0]
[]
[null,7,"Were test acceptability criteria stated (e.g. mortality in controls must not exceed a certain percentage) (5 marks)?\nOR Were test acceptability criteria inferred (e.g. test method used [USEPA, OECD, ASTM etc.]) (award 2 marks). \nNote: Data that fail the acceptability criteria are automatically deemed to be of unacceptable quality and must not be used. ",5,null,1,{"$f":"IF(F29=0,0,INDEX($D29:$D31,F29,1))","v":5}]
[null,null,null,2]
[null,null,null,0]
[null,8,"Were the characteristics of the test organism (e.g. length, mass, age) stated?",5,null,1,{"$f":"IF(F32=0,0,INDEX($D32:$D34,F32,1))","v":5}]
[null,null,null,0]
[]
[null,9,"Was the type of test media used stated?",5,null,1,{"$f":"IF(F35=0,0,INDEX($D35:$D37,F35,1))","v":5}]
[null,null,null,0]
[]
[null,null,"Was the type of exposure (e.g. static, flow through) stated? ",4,null,1,{"$f":"IF(F38=0,0,INDEX($D38:$D40,F38,1))","v":4}]
[null,10,null,0]
[]
[null,null,"Were the contaminant concentrations measured at the beginning and end of the exposure (4 marks)? Award 2 marks if they were measured only once during the test.\nNote: If the concentrations were not measured then automatically the data cannot be high quality. ",4,null,1,{"$f":"IF(F41=0,0,INDEX($D41:$D43,F41,1))","v":4}]
[null,11,null,2]
[null,null,null,0]
[null,null,"Were parallel reference toxicant toxicity tests conducted?",4,null,1,{"$f":"IF(F44=0,0,INDEX($D44:$D46,F44,1))","v":4}]
[null,12,null,0]
[]
[null,null,"Was there a concentration–response relationship either observable or stated?",4,null,1,{"$f":"IF(F47=0,0,INDEX($D47:$D49,F47,1))","v":4}]
[null,13,null,0]
[]
[null,null,"Was an appropriate statistical method or model used to determine the toxicity?\nNote: They should be accepted by a recognised national or international regulatory body (e.g. USEPA, OECD, ASTM). ",4,null,1,{"$f":"IF(F50=0,0,INDEX($D50:$D52,F50,1))","v":4}]
[null,14,null,0]
[]
[null,15,"For LC/EC/BEC data was an estimate of variability provided? \nOR \nFor NO EC/LOEC data was the significance level 0.05 or less?  \n\n",4,null,1,{"$f":"IF(F53=0,0,INDEX($D53:$D55,F53,1))","v":4}]
[null,null,null,0]
[]
[null,16,"Were the following parameters measured and stated? (3 marks if measured and stated, 1 mark if just measured)."]
[null,null,null,3,null,1,{"$f":"IF(F57=0,0,INDEX($D57:$D59,F57,1))","v":3}]
[null,16.100000000000001,"pH",1]
[null,null,null,0]
[null,null,null,3,null,1,{"$f":"IF(F60=0,0,INDEX($D60:$D62,F60,1))","v":3}]
[null,16.2,"Hardness",1]
[null,null,null,0]
[null,null,null,3,null,1,{"$f":"IF(F63=0,0,INDEX($D63:$D65,F63,1))","v":3}]
[null,16.3,"Alkalinity",1]
[null,null,null,0]
[null,null,null,3,null,1,{"$f":"IF(F66=0,0,INDEX($D66:$D68,F66,1))","v":3}]
[null,16.399999999999999,"Organic carbon concentration",1]
[null,null,null,0]
[null,null,null,3,null,1,{"$f":"IF(F69=0,0,INDEX($D69:$D71,F69,1))","v":3}]
[null,16.5,"Dissolved Oxygen",1]
[null,null,null,0]
[null,null,"Was the temperature measured and stated (3 marks)? Award 1 mark if the temperature was measured but not stated or if only the temperature settings of the room or chamber are stated.",3,null,1,{"$f":"IF(F72=0,0,INDEX($D72:$D74,F72,1))","v":3}]
[null,17,null,1]
[null,null,null,0]
[null,null,"Were test solutions, blanks and/or controls tested for contamination OR were analytical reagent grade chemicals used or the highest possible purity chemicals used for the experiment? (3 marks).",3,null,1,{"$f":"IF(F75=0,0,INDEX($D75:$D76,F75,1))","v":3}]
[null,18,null,0]
[]
[null,null,null,null,null,null,null,null,{"$f":"(COUNTIF(F12:F76,\"=0\"))+COUNTIF(F2:F10,\"=0\")+COUNTIF(D2:D7,\"=0\")","v":0}]
[]
[]
[null,null,"Total score",null,null,null,{"$f":"IF(SUM(G12:G75)=0,\"\",SUM(G12:G75))","v":100}]
[null,null,"Total Max. possible score for the various types of data and contaminants ",null,{"$f":"D12+D15+D18+D21+D23+D26+D29+D32+D35+D38+D41+D44+D47+D50+D53+D57+D66+D69+D72+D75+D63+D60","v":100}]
[null,null,"Quality Score",null,{"$f":"\"= [Total score / Total possible score] * 100 = \"","v":"= [Total score / Total possible score] * 100 = "},null,{"$f":"IF(ISERROR(G81/E82),#N/A,G81/E82)","v":1},{"$f":"IF(F41=3,\"The highest possible grade for this datum is acceptable.\",\"\")","v":""}]
[]
[null,null,"H = high quality                           Quality score ≥ 80%     "]
[null,null,"A = acceptable quality         > 50% Quality score < 80%  "]
[null,null,"U = unacceptable quality              Quality score ≤ 50% "]
[]
[3,null,"Click the 'Save & Update' button to save and export the answers to the 'All results' worksheet. "]
[null,null,"Select the 'Reset Answers' button if you wish to clear all answers."]

{"sheet":"FW metal nonplant_WS","index":6,"n_rows":8,"n_cols":26,"rows_kept":8,"cut":false,"hidden":false,"merged":[]}
[]
["Question No.",1,2,3,4,5,6,7,8,9,10,11,12,13,14,15,16.100000000000001,16.2,16.3,16.399999999999999,16.600000000000001,17,18,"Total Score","Quality Score"]
["Short Questions","Duration of the exposure ","Biological endpoint","Biological effect stated or not","Biological effect quantified or not","Appropriate controls","Control & contaminant concentration","Test acceptability criteria","Characteristics of the test organism"," Type of test media","Type of exposure","Contaminant concentrations","Parallel reference toxicant toxicity tests","Concentration–response relationship","Determine the toxicity","NOEC/LOEC or LC/EC/BEC","pH","Hardness","Alkalinity","Organic carbon concentration","Dissolved Oxygen","Temperature","Grade or purity"]
["Marks Awarded ","10 or 0","10,5 or 0","5 or 0 ","5 or 0 ","5 or 0 ","5 or 0 ","5 or 0 ","5 or 0 ","5 or 0 ","4 or 0","4 or 2 or 0","4 or 2","4 or 2","4 or 2","4 or 2","3 or 1 or 0","3 or 1 or 0","3 or 1 or 0","3 or 1 or 0","3 or 1 or 0","3 or 0","3 or 0 "]
["Max. Possible Score",10,10,5,5,5,5,5,5,5,4,4,4,4,4,4,3,3,3,3,3,3,3,{"$f":"SUM(B5:W5)","v":100}]
["Category","Freshwater/metal/non- plant","Paper and data unique identifier(eg. 1-1,10-150)","1"]
["Scores",10,10,5,5,5,5,5,5,5,4,4,4,4,4,4,3,3,3,3,3,3,3,100,1,""]
["Answers","","","","","","","","","","","","","","","","","","","","","",""]

{"sheet":"FW nonmetal nonplant","index":7,"n_rows":94,"n_cols":53,"rows_kept":94,"cut":false,"hidden":false,"merged":[[3,4,7,4],[9,2,9,4],[11,2,13,2],[11,7,13,7],[14,2,16,2],[14,7,16,7],[17,2,19,2],[17,7,19,7],[20,2,21,2],[20,7,21,7],[22,2,24,2],[22,7,24,7],[25,2,27,2],[25,7,27,7],[28,2,30,2],[28,7,30,7],[31,2,33,2],[31,7,33,7],[34,2,36,2],[34,7,36,7],[37,2,39,2],[37,7,39,7],[40,2,42,2],[40,7,42,7],[43,2,45,2],[43,7,45,7],[46,2,48,2],[46,7,48,7],[49,2,51,2],[49,7,51,7],[65,2,68,2],[65,7,68,7],[59,7,61,7],[52,2,54,2],[52,7,54,7],[56,7,58,7],[62,2,64,2],[62,7,64,7]]}
[null,1,"Fill in the blank cells below, based on information provided in the paper being assessed. You can either pick an option from the dropdown list or add the appropriate detail using the 'Add to list' button. ",null,null,null,null,null,null,null,null,null,null,null,"* All the text in RED are used for drop down list ,make changes with caution."]
[null,null,"Category",{"$f":"IF(AF3=\"\",0,1)","v":1},"Freshwater/non-metal/non- plant",{"$f":"IF(E3=\"\",0,1)","v":1},"Citation No.",{"$f":"IF(ISERROR(FIND(\"-\",E3)),E3,LEFT(E3,FIND(\"-\",E3)-1))","v":"yyyy"},null,"Taxonomic group",null,null,null,null,"Species",null,null,"Lifestage",null,null,"Exposure duration",null,null,"Measure of toxicity",null,null,"Toxicity endpoint",null,null,"Taxonomic group",null,null,"Phylum",null,null,"Class",null,null,"Media",null,null,"Temperature ",null,null,"Acute Or Chronic",null,null,"PH",null,null,"Salinity/Comdictivity"]
[null,null,"Paper and data unique identifier(eg. 1-1,10-150)",{"$f":"IF(AI3=\"\",0,1)","v":1},"yyyy-2",{"$f":"IF(E4=\"\",0,1)","v":1},"Species (Scientific name)",null,null,"Phylum",null,null,null,null,"Acanthocyclops robustus",25,{"$f":"IF(P3=0,\"\",INDEX(O3:O102,P3))","v":"Culex quinqefasciatus"},"<120 days post h atch",58,{"$f":"IF(S3=0,\"\",INDEX(R3:R102,S3))","v":"Larvae (late 4th instar)"},"10 day",26,{"$f":"IF(V3=0,\"\",INDEX(U3:U102,V3))","v":"48hr"},"EC10",11,{"$f":"IF(Y3=0,\"\",INDEX(X3:X102,Y3))","v":"LC90"},"ability to cling",34,{"$f":"IF(AB3=0,\"\",INDEX(AA3:AA102,AB3))","v":"Mortality"},"Amphibian",10,{"$f":"IF(AE3=0,\"\",INDEX(AD3:AD102,AE3))","v":"Macroinvertebrate"},"\tChytridiomycota",5,{"$f":"IF(AH3=0,\"\",INDEX(AG3:AG102,AH3))","v":"Arthropoda"},"\tOstracoda",12,{"$f":"IF(AK3=0,\"\",INDEX(AJ3:AJ102,AK3))","v":"Insecta"},"algaltoxkit",49,{"$f":"IF(AN3=0,\"\",INDEX(AM3:AM102,AN3))","v":"Tap water"},8,63,{"$f":"IF(AQ3=0,\"\",INDEX(AP3:AP102,AQ3))","v":"28 + 3"},"7.378-8.33",3,{"$f":"IF(AT3=0,\"\",INDEX(AS3:AS102,AT3))","v":"Acute "},7,34,{"$f":"IF(AW3=0,\"\",INDEX(AV3:AV102,AW3))","v":"Not stated"},null,null,"N.A."]
[null,null,"Citation",{"$f":"IF(AL3=\"\",0,1)","v":1},"Ali A, Chowdhury MA, Hossain MI, Ameen MU, Habiba DB and Aslam AFM (1999). Laboratory evaluation of selected larvicides and insect growth regulators against field-collected Culex quinquefasciatus larvae from urban Dhaka, Bangladesh, Journal of the American Mosquito Control Association, 15(1), 43-47.",{"$f":"IF(H8=\"\",0,1)","v":1},"Lifestage",null,null,"Class",null,null,null,null,"Aedes aegypti",null,null,"<24h neonate f2 ",null,null,"11 hour",null,null,"EC50",null,null,"ability to swim",null,null,"Bacteria",null,null,"\tOomycota",null,null,"\tSordariomycetes",null,null,"artificial system water",null,null,10,null,null,"7.78-8.33",null,null,7.5]
[null,null,null,{"$f":"IF(AO3=\"\",0,1)","v":1},null,{"$f":"IF(W3=\"\",0,1)","v":1},"Exposure duration",null,null,"Media",null,null,null,null,"Aedes albopictus",null,null,"<24hr neonate",null,null,"1-2 weeks",null,null,"EC50",null,null,"ability to thrash when prodded",null,null,"Chordata",null,null,"\tRotifera",null,null,"Actinopterygii",null,null,"ATSM hardwater",null,null,12,null,null,"Acute ",null,null,7.5]
[null,null,null,{"$f":"IF(AR3=\"\",0,1)","v":1},null,{"$f":"IF(Q3=\"\",0,1)","v":1},"Measure of toxicity",null,null,"Temperature ",null,null,null,null,"Aedes albopictus",null,null,">23 days",null,null,"120hpf",null,null,"hatchability",null,null,"ability to walk/crawl",null,null,"Chromista",null,null,"Actinopterygii",null,null,"Amphibia",null,null,"Bore water",null,null,12,null,null,"Chronic",null,null,7.66]
[null,null,null,{"$f":"IF(AU3=\"\",0,1)","v":1},null,{"$f":"IF(T3=\"\",0,1)","v":1},"Toxicity endpoint",null,null,"Acute Or Chronic ",null,null,null,null,"Aedes albopictus HAmAal strain",null,null,">6 month ",null,null,"13 days",null,null,"IC25",null,null,"activity",null,null,"Fish",null,null,"Arthropoda",null,null,"Bivalvia",null,null,"CBS culture collection",null,null,12,null,null,"N.A.",null,null,7.67]
[null,null,null,null,null,{"$f":"IF(W3=\"\",0,1)","v":1},"Toxicity value","0.000896 PPM",null,"PH",null,null,null,null,"Aedes albopictus Ikaken strain",null,null,"1 month",null,null,"14 days",null,null,"LC10",null,null,"Body length",null,null,"Fish",null,null,"Ascomycota",null,null,"Branchiopoda",null,null,"Clean river water",null,null,13,null,null,null,null,null,7.8]
[null,2,"Select the appropriate answer option to each question. Comments can be added to the cells in column H.",null,null,{"$f":"IF(Z3=\"\",0,1)","v":1},null,null,null,"Salinity/Conductivity","N.A.",null,null,null,"Aedes albopictus MAmAal strain",null,null,"1 year old",null,null,"19 days",null,null,"LC100",null,null,"Body weight",null,null,"Flagellate",null,null,"Basidiomycota",null,null,"Chlorophyceae  ",null,null,"Clean river watrer",null,null,13,null,null,null,null,null,8.1]
[null,"*","If the selected answer option does not work try clicking on any other cell first and then click back on the answer option again.",null,null,{"$f":"IF(AC3=\"\",0,1)","v":1},null,null,null,null,null,null,null,null,"Aedes albopictus SFmAal strain",null,null,"1st instar larvae",null,null,"21 day",null,null,"LC50",null,null,"Brood size",null,null,"Fungi",null,null,"Chlorophyta",null,null,"Chytridiomycetes",null,null,"Daphtoxkit",null,null,13,null,null,null,null,null,"6.5-7"]
[null,"No.","Question","Marks Awarded","Answer Options","Option References","Scores","Answers",null,null,null,null,null,null,"Aedes albopictus VBFmAal strain",null,null,"3rd brood",null,null,"24 hrs",null,null,"LC50",null,null,"brood survival",null,null,"Macroinvertebrate",null,null,"Chordata",null,null,"Cryptophyceae",null,null,"Dechlorinated tap water",null,null,14,null,null,null,null,null,"6.5-7.4"]
[null,null,"Was the duration of the exposure stated (e.g. 48 or 96 h)?",10,null,1,{"$f":"IF(F12=0,0,INDEX($D12:$D13,F12,1))","v":10},"48-hours",null,null,null,null,null,null,"Aedes taeniorhynchus",null,null,"3rd brood neonate",null,null,"24h",null,null,"LC90",null,null,"Cell viability",null,null,"Macroinvertebrate",null,null,"Chordata",null,null,"Eurotatoria",null,null,"dechlorinated water",null,null,16,null,null,null,null,null,"6.6-7.2"]
[null,1,null,0,null,null,null,null,null,null,null,null,null,null,"AnopheIes quadrimaculatus",null,null,"3rd brood neonate <24hr",null,null,"24hr",null,null,"LC90",null,null,"Colour change",null,null,"Microalga",null,null,"Ciliophora",null,null,"Gammaproteobacteria",null,null,"deinonised reconstituted water",null,null,16,null,null,null,null,null,"6.8-7.5"]
[null,null,null,null,null,null,null,null,null,null,null,null,null,null,"Australian Bass",null,null,"4-5th instar larvae",null,null,"24hr",null,null,"LC95",null,null,"development",null,null,"Microinvertebrate",null,null,"Cryptophyta",null,null,"Insecta",null,null,"deionised sterile water",null,null,17,null,null,null,null,null,"7.1 ± 0.5"]
[null,null,"Was the biological endpoint (e.g. immobilization or population growth) stated and defined (10 marks)? Award 5 marks if the biological endpoint is only stated.",10,null,2,{"$f":"IF(F15=0,0,INDEX($D15:$D17,F15,1))","v":5},"Larval mortality",null,null,null,null,null,null,"Baetis tricaudatus",null,null,"4th instar larvae",null,null,"25hr",null,null,"LD50",null,null,"Development",null,null,"N.A.",null,null,"Mollusca",null,null,"Malacostraca",null,null,"Deionised water",null,null,18,null,null,null,null,null,"7.3 ± 0.2"]
[null,2,null,5,null,null,null,null,null,null,null,null,null,null,"Batrachochytrium dendrobatidis",null,null,"5-7d adult",null,null,"26 days",null,null,"LOEC",null,null,"Developmental",null,null,"Rotifer",null,null,"N.A.",null,null,"N.A.",null,null,"Deionised water with added salts",null,null,18,null,null,null,null,null,"7.35-7.6"]
[null,null,null,0,null,null,null,null,null,null,null,null,null,null,"Batrachochytrium dendrobatidis",null,null,"5th instar larvae",null,null,"28 day",null,null,"LOEC",null,null,"Developmental",null,null,null,null,null,"Proteobacteria",null,null,"Not assigned",null,null,"Distilled water",null,null,19,null,null,null,null,null,"7.3-8.0"]
[null,null,"Was the biological effect stated (e.g. LC or NOEC)?",5,null,1,{"$f":"IF(F18=0,0,INDEX($D18:$D19,F18,1))","v":5},"LC",null,null,null,null,null,null,"Ceriodaphnia dubia",null,null,"6-11 g",null,null,"28 days",null,null,"LOEC",null,null,"Fecundity",null,null,null,null,null,"Tracheophyta",null,null,"Prostomatea",null,null,"essential medium",null,null,20,null,null,null,null,null,"7.51 ± 0.19"]
[null,3,null,0,null,null,null,null,null,null,null,null,null,null,"Chaoborus crystallinus",null,null,"6-9cm length",null,null,"28 days",null,null,"N.A.",null,null,"Feed assimilation",null,null,null,null,null,"Zygomycota",null,null,"Tremellomycetes",null,null,"Filtered natural lake water",null,null,20,null,null,null,null,null,"7.6-7.75"]
[null,null,null,null,null,null,null,null,null,null,null,null,null,null,"Cheumatopsyche brevilineata",null,null,"7-11g",null,null,"28 dyas",null,null,"NOEC",null,null,"Foraging success",null,null,null,null,null,null,null,null,null,null,null,"Freshwater",null,null,20,null,null,null,null,null,"7.6-8.2"]
[null,4,"Was the biological effect quantified (e.g. 50% effect, 25% effect)? \nNote: The effect for NOEC and LOEC data must be quantified.",5,null,1,{"$f":"IF(F21=0,0,INDEX($D21:$D22,F21,1))","v":5},"50% and 90%",null,null,null,null,null,null,"Chironomus crassicaudatus",null,null,"adult",null,null,"32 day",null,null,"NOEC",null,null,"Gonad mass",null,null,null,null,null,null,null,null,null,null,null,"grown on tadpoles in freshwater",null,null,20,null,null,null,null,null,"7.78-8.33"]
[null,null,null,0,null,null,null,null,null,null,null,null,null,null,"Chironomus dilutus",null,null,"Adult",null,null,"35 day",null,null,"NOEC",null,null,"Gonadosomatic index",null,null,null,null,null,null,null,null,null,null,null,"growth culture",null,null,20,null,null,null,null,null,"7.8 -+ 0.2"]
[null,5,"Were appropriate controls (e.g. a no-toxicant control and/or solvent control) used?",5,null,1,{"$f":"IF(F23=0,0,INDEX($D23:$D24,F23,1))","v":5},"Each concentration was replicated 3\ntimes, and 3 untreated controls receiving only 1 ml of acetone",null,null,null,null,null,null,"Colubotelson chiltoni minor",null,null,"Adult (5-7 days)",null,null,"4 day",null,null,"NOEL",null,null,"granulocyte count",null,null,null,null,null,null,null,null,null,null,null,"Lab water",null,null,21,null,null,null,null,null,"7.8-8.1"]
[null,null,null,0,null,null,null,null,null,null,null,null,null,null,"Cryptococcus flavescens",null,null,"Adult (7.1-10.5cm length)",null,null,"42 day",null,null,"NOEL",null,null,"Growth",null,null,null,null,null,null,null,null,null,null,null,"malt extract broth",null,null,23,null,null,null,null,null,"7-7.2"]
[null,null,null,null,null,null,null,null,null,null,null,null,null,null,"Cryptomonas sp.",null,null,"adult female",null,null,"45 days",null,null,null,null,null,"growth",null,null,null,null,null,null,null,null,null,null,null,"Marinewater",null,null,23,null,null,null,null,null,"8 ± 0.2"]
[null,6,"Was each control and contaminant concentration at least duplicated?",5,null,1,{"$f":"IF(F26=0,0,INDEX($D26:$D27,F26,1))","v":5},"Untreated controls receiving only 1 ml of acetone",null,null,null,null,null,null,"Culex nigripalpus",null,null,"embryo",null,null,"48 hr",null,null,null,null,null,"growth inhibition",null,null,null,null,null,null,null,null,null,null,null,"Martins rearing solution",null,null,23,null,null,null,null,null,"8.16-8.36"]
[null,null,null,0,null,null,null,null,null,null,null,null,null,null,"Culex quinqefasciatus",null,null,"embryo",null,null,"48 hrs",null,null,null,null,null,"growth: length",null,null,null,null,null,null,null,null,null,null,null,"Milli-Q water",null,null,23,null,null,null,null,null,"8.32-8.61"]
[null,null,null,null,null,null,null,null,null,null,null,null,null,null,"Culex quinqefasciatus HAmCq strain",null,null,"Embryo 1-2 hpf; 8-64 cell stage",null,null,"48hr",null,null,null,null,null,"hatchability",null,null,null,null,null,null,null,null,null,null,null,"minimal medium",null,null,23,null,null,null,null,null,"8.32-8.61"]
[null,7,"Were test acceptability criteria stated (e.g. mortality in controls must not exceed a certain percentage) (5 marks)?\nOR Were test acceptability criteria inferred (e.g. test method used [USEPA, OECD, ASTM etc.]) (award 2 marks). \nNote: Data that fail the acceptability criteria are automatically deemed to be of unacceptable quality and must not be used. ",5,null,3,{"$f":"IF(F29=0,0,INDEX($D29:$D31,F29,1))","v":0},"Control mortality not stated or shown - methods say that treatments were corrected for control mortalities, but actual control mortalities are unknown.",null,null,null,null,null,null,"Culex quinqefasciatus S-Lab strain",null,null,"embryo to juvenile",null,null,"5 day",null,null,null,null,null,"hatching time",null,null,null,null,null,null,null,null,null,null,null,"moderate hard synthetic water",null,null,24,null,null,null,null,null,"N.A."]
[null,null,null,2,null,null,null,null,null,null,null,null,null,null,"Culex quinqefasciatus VBFmCq strain",null,null,"embryop",null,null,"5 months",null,null,null,null,null,"Immobilisation",null,null,null,null,null,null,null,null,null,null,null,"moderately hard reconstituted water",null,null,25,null,null,null,null,null,"N/A"]
[null,null,null,0,null,null,null,null,null,null,null,null,null,null,"Culex quinquefasciatus MAmCq strain",null,null,"First-instar larvae",null,null,"6 days",null,null,null,null,null,"lymphocyte count",null,null,null,null,null,null,null,null,null,null,null,"Moderately hard water",null,null,25,null,null,null,null,null,"N/A"]
[null,8,"Were the characteristics of the test organism (e.g. length, mass, age) stated?",5,null,1,{"$f":"IF(F32=0,0,INDEX($D32:$D34,F32,1))","v":5},"Larvae, late 4th instar",null,null,null,null,null,null,"Cyprinus carpio",null,null,"fry",null,null,"60 day",null,null,null,null,null,"Mass",null,null,null,null,null,null,null,null,null,null,null,"moderately hard water",null,null,25,null,null,null,null,null,"not stated"]
[null,null,null,0,null,null,null,null,null,null,null,null,null,null,"Danio rerio",null,null,"glochidia",null,null,"7 day",null,null,null,null,null,"Mobility",null,null,null,null,null,null,null,null,null,null,null,"moderately hard water",null,null,26,null,null,null,null,null,"Not stated"]
[null,null,null,null,null,null,null,null,null,null,null,null,null,null,"Daphnia magna",null,null,"glochidia",null,null,"7 day",null,null,null,null,null,"Mobility",null,null,null,null,null,null,null,null,null,null,null,"moderately hard water",null,null,26,null,null,null,null,null,"Not stated"]
[null,9,"Was the type of test media used stated?",5,null,1,{"$f":"IF(F35=0,0,INDEX($D35:$D37,F35,1))","v":5},"Tap water",null,null,null,null,null,null,"Daphnia pulex",null,null,"Glochidia",null,null,"7 day",null,null,null,null,null,"mobility: swim speed",null,null,null,null,null,null,null,null,null,null,null,"N.A.",null,null,27,null,null,null,null,null,"Not stated"]
[null,null,null,0,null,null,null,null,null,null,null,null,null,null,"Diaptomus castor",null,null,"juvenile",null,null,"7 days",null,null,null,null,null,"Mortality",null,null,null,null,null,null,null,null,null,null,null,"Not stated",null,null,28.5,null,null,null,null,null,"Not stated"]
[null,null,null,null,null,null,null,null,null,null,null,null,null,null,"Diphetor hageni",null,null,"juvenile",null,null,"7 days",null,null,null,null,null,"Mortality",null,null,null,null,null,null,null,null,null,null,null,"potato dextrose agar",null,null,"2016-12-15",null,null,null,null,null,"Not stated"]
[null,null,"Was the type of exposure (e.g. static, flow through) stated? ",4,null,2,{"$f":"IF(F38=0,0,INDEX($D38:$D40,F38,1))","v":0},"Assumed static",null,null,null,null,null,null,"Dreissena polymorpha",null,null,"juvenile",null,null,"7 dyas",null,null,null,null,null,"Mortality: disease susceptibility L. anguillarum",null,null,null,null,null,null,null,null,null,null,null,"reconstituted hard water",null,null,"12 to 15",null,null,null,null,null,"PH11"]
[null,10,null,0,null,null,null,null,null,null,null,null,null,null,"Elliptio complananta",null,null,"juvenile",null,null,"7-14 days",null,null,null,null,null,"N.A.",null,null,null,null,null,null,null,null,null,null,null,"reconstituted hard water",null,null,"12.5-15.5",null,null,null,null,null,"PH7.0"]
[null,null,null,null,null,null,null,null,null,null,null,null,null,null,"Elliptio complanata",null,null,"Juvenile",null,null,"72 hrs",null,null,null,null,null,"number of broods",null,null,null,null,null,null,null,null,null,null,null,"reconstituted water",null,null,"12.6±0.03"]
[null,null,"Were the contaminant concentrations measured at the beginning and end of the exposure (4 marks)? Award 2 marks if they were measured only once during the test.\nNote: If the concentrations were not measured then automatically the data cannot be high quality. ",4,null,3,{"$f":"IF(F41=0,0,INDEX($D41:$D43,F41,1))","v":0},"Not stated that they were measured",null,null,null,null,null,null,"Elliptio complanata",null,null,"Juvenile",null,null,"7-8 days",null,null,null,null,null,"number of broods",null,null,null,null,null,null,null,null,null,null,null,"reoncstituted water",null,null,"15°C"]
[null,11,null,2,null,null,null,null,null,null,null,null,null,null,"Ephemeralla excrucians",null,null,"Juvenile",null,null,"8 days",null,null,null,null,null,"number of broods",null,null,null,null,null,null,null,null,null,null,null,"Seawater",null,null,"18-22"]
[null,null,null,0,null,null,null,null,null,null,null,null,null,null,"Eucypris virens",null,null,"larvae",null,null,"8 days",null,null,null,null,null,"Nutrient assimilation",null,null,null,null,null,null,null,null,null,null,null,"standard reference water",null,null,"19.6-23.1"]
[null,null,"Were parallel reference toxicant toxicity tests conducted?",4,null,2,{"$f":"IF(F44=0,0,INDEX($D44:$D46,F44,1))","v":0},"Not stated",null,null,null,null,null,null,"Fallceon quilleri",null,null,"larvae",null,null,"96 hour",null,null,null,null,null,"phagocytic cell count",null,null,null,null,null,null,null,null,null,null,null,"system water",null,null,"20 ± 1 "]
[null,12,null,0,null,null,null,null,null,null,null,null,null,null,"Fusarium sporotrichioides",null,null,"Larvae (96 hours post fertilisation)",null,null,"96 hrs",null,null,null,null,null,"Reproduction",null,null,null,null,null,null,null,null,null,null,null,"tannic acid aqueous solution",null,null,"20 ± 2"]
[null,null,null,null,null,null,null,null,null,null,null,null,null,null,"Galaxias auratus",null,null,"Larval",null,null,"96hr",null,null,null,null,null,"reproduction impairment",null,null,null,null,null,null,null,null,null,null,null,"Tap water",null,null,"20.1-21.9"]
[null,null,"Was there a concentration–response relationship either observable or stated?",4,null,1,{"$f":"IF(F47=0,0,INDEX($D47:$D49,F47,1))","v":4},"Not observable , but stated in statistical analysis",null,null,null,null,null,null,"Galaxias maculatus",null,null,"larval (7-d post hatch)",null,null,"N.A.",null,null,null,null,null,"respiratory burst",null,null,null,null,null,null,null,null,null,null,null,"Tap water",null,null,"20.1-21.9"]
[null,13,null,0,null,null,null,null,null,null,null,null,null,null,"Galaxias maculatus",null,null,"lochidia",null,null,"NOEL",null,null,null,null,null,"Secondary sexual characteristics",null,null,null,null,null,null,null,null,null,null,null,"Tap water",null,null,"20.2 ± 0.1"]
[null,null,null,null,null,null,null,null,null,null,null,null,null,null,"Galaxias truttaceus ",null,null,"N.A.",null,null,"Not stated (test went until 120 hours post fertilisation)",null,null,null,null,null,"serum lysozyme activity",null,null,null,null,null,null,null,null,null,null,null,"tap water",null,null,"20-22"]
[null,null,"Was an appropriate statistical method or model used to determine the toxicity?\nNote: They should be accepted by a recognised national or international regulatory body (e.g. USEPA, OECD, ASTM). ",4,null,1,{"$f":"IF(F50=0,0,INDEX($D50:$D52,F50,1))","v":4},"Log dose probit regression analysis",null,null,null,null,null,null,"Glyptotendipes paripes",null,null,"Neonate",null,null,null,null,null,null,null,null,"sex ratio",null,null,null,null,null,null,null,null,null,null,null,"unfiltered river water",null,null,"21-24"]
[null,14,null,0,null,null,null,null,null,null,null,null,null,null,"Helicopsyche sp. ",null,null,"neonate",null,null,null,null,null,null,null,null,"Survival",null,null,null,null,null,null,null,null,null,null,null,"Tap water",null,null,"22.0-22.4"]
[null,null,null,null,null,null,null,null,null,null,null,null,null,null,"Hexagenia sp.",null,null,"neonate fed",null,null,null,null,null,null,null,null,"Swim ability",null,null,null,null,null,null,null,null,null,null,null,null,null,null,"22-23"]
[null,15,"For LC/EC/BEC data was an estimate of variability provided? \nOR \nFor NO EC/LOEC data was the significance level 0.05 or less?  \n\n",4,null,1,{"$f":"IF(F53=0,0,INDEX($D53:$D55,F53,1))","v":4},"95% CL",null,null,null,null,null,null,"Hyalella azteca",null,null,"neonate unfed",null,null,null,null,null,null,null,null,"time taken to release brood",null,null,null,null,null,null,null,null,null,null,null,null,null,null,"22-24"]
[null,null,null,0,null,null,null,null,null,null,null,null,null,null,"Hydropsyche sp. ",null,null,"Not stated",null,null,null,null,null,null,null,null,"time until brood release",null,null,null,null,null,null,null,null,null,null,null,null,null,null,"23 ± 0.3"]
[null,null,null,null,null,null,null,null,null,null,null,null,null,null,"Hyla cinerea",null,null,"Not stated",null,null,null,null,null,null,null,null,"viability",null,null,null,null,null,null,null,null,null,null,null,null,null,null,"23.1 ± 0.3"]
[null,16,"Were the following parameters measured and stated? (3 marks if measured and stated, 1 mark if just measured).",null,null,null,null,null,null,null,null,null,null,null,"Hyla squirella",null,null,"Not stated",null,null,null,null,null,null,null,null,"viability",null,null,null,null,null,null,null,null,null,null,null,null,null,null,"23.2 ± 0.4°C"]
[null,null,null,3,null,3,{"$f":"IF(F57=0,0,INDEX($D57:$D59,F57,1))","v":0},"Not stated",null,null,null,null,null,null,"Ictalurus punctatus",null,null,"Not stated",null,null,null,null,null,null,null,null,"viability",null,null,null,null,null,null,null,null,null,null,null,null,null,null,"23-25"]
[null,16.100000000000001,"pH",1,null,null,null,null,null,null,null,null,null,null,"Isoperla quinquepunctata",null,null,"tadpole",null,null,null,null,null,null,null,null,"Viability: ability to attach to host",null,null,null,null,null,null,null,null,null,null,null,null,null,null,"24-26"]
[null,null,null,0,null,null,null,null,null,null,null,null,null,null,"Lampsilis fasciola",null,null,"tadpole",null,null,null,null,null,null,null,null,"Viability: ability to attach to host",null,null,null,null,null,null,null,null,null,null,null,null,null,null,"24-26"]
[null,null,null,3,null,3,{"$f":"IF(F60=0,0,INDEX($D60:$D62,F60,1))","v":0},"Not stated",null,null,null,null,null,null,"Lampsilis siliquoidea",null,null,"Larvae (late 4th instar)",null,null,null,null,null,null,null,null,null,null,null,null,null,null,null,null,null,null,null,null,null,null,null,"25 ± 1"]
[null,16.2,"Dissolved Oxygen",1,null,null,null,null,null,null,null,null,null,null,"Lampsilis siliquoidea",null,null,null,null,null,null,null,null,null,null,null,null,null,null,null,null,null,null,null,null,null,null,null,null,null,null,"25.8–28.2"]
[null,null,null,0,null,null,null,null,null,null,null,null,null,null,"Mucor hiemalis",null,null,null,null,null,null,null,null,null,null,null,null,null,null,null,null,null,null,null,null,null,null,null,null,null,null,"25±1"]
[null,null,"Was the temperature measured and stated (3 marks)? Award 1 mark if the temperature was measured but not stated or if only the temperature settings of the room or chamber are stated.",3,null,1,{"$f":"IF(F63=0,0,INDEX(D63:D65,F63,1))","v":3},"28 +/- 3*C",null,null,null,null,null,null,"N.A.",null,null,null,null,null,null,null,null,null,null,null,null,null,null,null,null,null,null,null,null,null,null,null,null,null,null,"25°C"]
[null,17,null,1,null,null,null,null,null,null,null,null,null,null,"Nectopsyche sp.",null,null,null,null,null,null,null,null,null,null,null,null,null,null,null,null,null,null,null,null,null,null,null,null,null,null,"26 ± 2"]
[null,null,null,0,null,null,null,null,null,null,null,null,null,null,"Neoniphargus sp.",null,null,null,null,null,null,null,null,null,null,null,null,null,null,null,null,null,null,null,null,null,null,null,null,null,null,"28 + 3"]
[null,null,"Were test solutions, blanks and/or controls tested for contamination OR were analytical reagent grade chemicals used or the highest possible purity chemicals used for the experiment? (3 marks).",3,null,1,{"$f":"IF(F66=0,0,INDEX($D66:$D67,F66,1))","v":3},"Fipronil (97.l%),",null,null,null,null,null,null,"Oncorhynchus mykiss",null,null,null,null,null,null,null,null,null,null,null,null,null,null,null,null,null,null,null,null,null,null,null,null,null,null,"28 ± 1"]
[null,18,null,0,null,null,null,null,null,null,null,null,null,null,"Oryzias latipes",null,null,null,null,null,null,null,null,null,null,null,null,null,null,null,null,null,null,null,null,null,null,null,null,null,null,"28-30"]
[null,null,null,null,null,null,null,null,null,null,null,null,null,null,"Osteopilus septentrionalis",null,null,null,null,null,null,null,null,null,null,null,null,null,null,null,null,null,null,null,null,null,null,null,null,null,null,"N.A."]
[null,null,null,null,null,null,null,null,{"$f":"(COUNTIF(F12:F67,\"=0\"))+COUNTIF(F2:F10,\"=0\")+COUNTIF(D2:D7,\"=0\")","v":0},null,null,null,null,null,"Pacifastacus leniusculus",null,null,null,null,null,null,null,null,null,null,null,null,null,null,null,null,null,null,null,null,null,null,null,null,null,null,"N/A"]
[null,null,null,null,null,null,null,null,null,null,null,null,null,null,"Palaemonetes pugio",null,null,null,null,null,null,null,null,null,null,null,null,null,null,null,null,null,null,null,null,null,null,null,null,null,null,"Not stated"]
[null,null,null,null,null,null,null,null,null,null,null,null,null,null,"Parutya austruliensis"]
[null,null,"Total score",null,null,null,{"$f":"IF(SUM(G12:G66)=0,\"\",SUM(G12:G66))","v":63},null,null,null,null,null,null,null,"Philodina acuticornis odiosa"]
[null,null,"Total Max. possible score for the various types of data and contaminants ",null,{"$f":"D12+D15+D18+D21+D23+D26+D29+D32+D35+D38+D41+D44+D47+D50+D53+D57+D60+D63+D66","v":91},null,null,null,null,null,null,null,null,null,"Pimephales promelas"]
[null,null,"Quality Score",null,{"$f":"\"= [Total score / Total possible score] * 100 = \"","v":"= [Total score / Total possible score] * 100 = "},null,{"$f":"IF(ISERROR(G72/E73),#N/A,G72/E73)","v":0.69230769230769229},{"$f":"IF(F41=3,\"The highest possible grade for this datum is acceptable.\",\"\")","v":"The highest possible grade for this datum is acceptable."},null,null,null,null,null,null,"Polypedilum nubiferum"]
[null,null,null,null,null,null,null,null,null,null,null,null,null,null,"Procambarus clarkii"]
[null,null,"H = high quality                           Quality score ≥ 80%      ",null,null,null,null,null,null,null,null,null,null,null,"Procambarus zonangulus"]
[null,null,"A = acceptable quality         > 50% Quality score < 80%        ",null,null,null,null,null,null,null,null,null,null,null,"Pseudaphritis urvillir"]
[null,null,"U = unacceptable quality              Quality score ≤ 50%  ",null,null,null,null,null,null,null,null,null,null,null,"Pythium spp"]
[null,null,null,null,null,null,null,null,null,null,null,null,null,null,"Rana sphenocephala"]
[3,null,"Click the 'Save & Update' button to save and export the answers to the 'All results' worksheet. ",null,null,null,null,null,null,null,null,null,null,null,"Salmo gairdneri"]
[null,null,"Select the 'Reset Answers' button if you wish to clear all answers.",null,null,null,null,null,null,null,null,null,null,null,"Selenastrum capricornutum"]
[null,null,null,null,null,null,null,null,null,null,null,null,null,null,"Serratella micheneri"]
[null,null,null,null,null,null,null,null,null,null,null,null,null,null,"Simocephalus elizabethae"]
[null,null,null,null,null,null,null,null,null,null,null,null,null,null,"Simulium vittatum"]
[null,null,null,null,null,null,null,null,null,null,null,null,null,null,"Simulium vittatum IS-7"]
[null,null,null,null,null,null,null,null,null,null,null,null,null,null,"Spea multiplicata"]
[null,null,null,null,null,null,null,null,null,null,null,null,null,null,"Taenionema sp."]
[null,null,null,null,null,null,null,null,null,null,null,null,null,null,"Trichoderma hamatum"]
[null,null,null,null,null,null,null,null,null,null,null,null,null,null,"Tricorythodes sp. "]
[null,null,null,null,null,null,null,null,null,null,null,null,null,null,"Unio elongatulus"]
[null,null,null,null,null,null,null,null,null,null,null,null,null,null,"Urotricha furcata"]
[null,null,null,null,null,null,null,null,null,null,null,null,null,null,"Villosa constricta"]
[null,null,null,null,null,null,null,null,null,null,null,null,null,null,"Villosa delumbis"]
[null,null,null,null,null,null,null,null,null,null,null,null,null,null,"Xenopus laevis"]

{"sheet":"FW nonmetal nonplant_WS","index":8,"n_rows":720,"n_cols":24,"rows_kept":720,"cut":false,"hidden":false,"merged":[]}
[]
["Question No.",1,2,3,4,5,6,7,8,9,10,11,12,13,14,15,16.100000000000001,16.600000000000001,17,18,"Total Score","Quality Score",null,"Comment "]
["Short Questions","Duration of the exposure ","Biological endpoint","Biological effect stated or not","Biological effect quantified or not","Appropriate controls","Control & contaminant concentration","Test acceptability criteria","Characteristics of the test organism"," Type of test media","Type of exposure","Contaminant concentrations","Parallel reference toxicant toxicity tests","Concentration–response relationship","Determine the toxicity","NOEC/LOEC or LC/EC/BEC","pH","Dissolved oxygen","Temperature","Grade or purity"]
["Category","Freshwater/non-metal/non- plant","Paper and data unique identifier(eg. 1-1,10-150)","1020-1"]
["Scores",10,10,5,5,5,0,0,0,5,4,2,0,0,4,4,1,1,1,3,60,0.65934065934065933,null,""]
["Answers","","Death was indicated by failure of the fish to respond to prodding by a glass rod.","","","","","","","","static","","","","","95% CI (30-90ug/L)","","","","technical grade "]
["Category","Freshwater/non-metal/non- plant","Paper and data unique identifier(eg. 1-1,10-150)","1020-2"]
["Scores",10,10,5,5,5,0,0,0,5,4,2,0,0,4,4,1,1,1,3,60,0.65934065934065933,null,""]
["Answers","","Death was indicated by failure of the fish to respond to prodding by a glass rod.","","","","","","","","static","","","","","95% CI (42-92ug/L)","","","","technical grade "]
["Category","Freshwater/non-metal/non- plant","Paper and data unique identifier(eg. 1-1,10-150)","1020-3"]
["Scores",10,10,5,5,5,0,0,0,5,4,2,0,0,4,4,1,1,1,3,60,0.65934065934065933,null,""]
["Answers","","Death was indicated by failure of the fish to respond to prodding by a glass rod.","","","","","","","","static","","","","","95% CI (53-152ug/L)","","","","technical grade "]
["Category","Freshwater/non-metal/non- plant","Paper and data unique identifier(eg. 1-1,10-150)","1021-1"]
["Scores",10,10,5,5,5,0,0,5,5,4,2,0,4,4,4,1,1,1,3,69,0.75824175824175821,null,""]
["Answers","","","","","","","","juvenile","","","","","","","95% CI  (79-194)","","","","technical grade "]
["Category","Freshwater/non-metal/non- plant","Paper and data unique identifier(eg. 1-1,10-150)","1021-2"]
["Scores",10,10,5,5,5,0,0,5,5,4,2,0,4,4,4,1,1,1,3,69,0.75824175824175821,null,""]
["Answers","","","","","","","","juvenile","","","","","","","95% CI (78-183)","","","","technical grade "]
["Category","Freshwater/non-metal/non- plant","Paper and data unique identifier(eg. 1-1,10-150)","1022-1"]
["Scores",10,10,5,5,5,0,2,5,5,4,2,0,4,4,4,1,1,1,3,71,0.78021978021978022,null,""]
["Answers","","Criterion for death was cessation of\ngill opercular movement, even after gentle prodding of the fish. ","","","","","compared to control"," length ranged from\n6.7 to 7.0 cm and average wet weight 3.5 to 4.0 g","","","","","","","95% CI (0.054-0.10)","","","","technical grade "]
["Category","Freshwater/non-metal/non- plant","Paper and data unique identifier(eg. 1-1,10-150)","697-1"]
["Scores",10,10,5,5,5,5,5,0,5,4,4,0,0,4,4,0,1,1,3,71,0.78021978021978022,null,""]
["Answers","","","","","","","not more than 10 per cent of the Daphnia should have been immobilised or\ntrapped at the surface of the water","","","","beginning and during","","","","95% CI (0.005)","","","",""]
["Category","Freshwater/non-metal/non- plant","Paper and data unique identifier(eg. 1-1,10-150)","697-2"]
["Scores",10,10,5,5,5,5,5,0,5,4,4,0,0,4,4,0,1,1,3,71,0.78021978021978022,null,""]
["Answers","","","","","","","not more than 10 per cent of the Daphnia should have been immobilised or\ntrapped at the surface of the water","","","","beginning and during","","","","95% CI (0.0018)","","","",""]
["Category","Freshwater/non-metal/non- plant","Paper and data unique identifier(eg. 1-1,10-150)","697-3"]
["Scores",10,10,5,5,5,5,5,0,5,4,4,0,0,4,4,0,1,1,3,71,0.78021978021978022,null,""]
["Answers","","","","","","","OECD","","","","","","","","95% CI (0.001)","","","",""]
["Category","Freshwater/non-metal/non- plant","Paper and data unique identifier(eg. 1-1,10-150)","1024-1"]
["Scores",10,10,5,5,5,5,2,5,5,4,2,0,0,4,4,0,3,1,3,71,0.78021978021978022,null,""]
["Answers","","","","","","","OECD","mass","","flow through","","","","","95% CI (0.001)","","80%, 8.03mg/L","",""]
["Category","Freshwater/non-metal/non- plant","Paper and data unique identifier(eg. 1-1,10-150)","1024-2"]
["Scores",10,10,5,5,5,5,2,5,5,4,2,0,0,4,4,0,3,1,3,71,0.78021978021978022,null,""]
["Answers","","","","","","","OECD","mass","","flow through","","","","","95% CI (0.001)","","80%, 8.03mg/L","",""]
["Category","Freshwater/non-metal/non- plant","Paper and data unique identifier(eg. 1-1,10-150)","1024-3"]
["Scores",10,10,5,5,5,5,2,5,5,4,2,0,0,4,4,0,3,1,3,71,0.78021978021978022,null,""]
["Answers","","","","","","","OECD","mass","","flow through","","","","","","","80%, 8.03mg/L","",""]
["Category","Freshwater/non-metal/non- plant","Paper and data unique identifier(eg. 1-1,10-150)","1024-4"]
["Scores",10,10,5,5,5,5,2,5,5,4,2,0,0,4,4,0,3,1,3,71,0.78021978021978022,null,""]
["Answers","","","","","","","OECD","mass","","flow through","","","","","","","53, 5.12mg/L","",""]
["Category","Freshwater/non-metal/non- plant","Paper and data unique identifier(eg. 1-1,10-150)","1024-5"]
["Scores",10,10,5,5,5,5,2,5,5,4,2,0,0,4,4,0,3,1,3,71,0.78021978021978022,null,""]
["Answers","","","","","","","OECD","mass","","flow through","","","","","","","53, 5.12mg/L","",""]
["Category","Freshwater/non-metal/non- plant","Paper and data unique identifier(eg. 1-1,10-150)","1024-6"]
["Scores",10,10,5,5,5,5,2,5,5,4,2,0,0,4,4,0,3,1,3,71,0.78021978021978022,null,""]
["Answers","","","","","","","OECD","mass","","static","","","","","","","9.0mg/L 90%","",""]
["Category","Freshwater/non-metal/non- plant","Paper and data unique identifier(eg. 1-1,10-150)","1024-7"]
["Scores",10,10,5,5,5,5,2,5,5,4,2,0,0,4,4,0,3,1,3,71,0.78021978021978022,null,""]
["Answers","","","","","","","OECD","mass","","flow through","","","","","","","8.0-9.0mg/L 75%","",""]
["Category","Freshwater/non-metal/non- plant","Paper and data unique identifier(eg. 1-1,10-150)","1024-8"]
["Scores",10,10,5,5,5,5,2,5,5,4,2,0,0,4,4,0,3,1,3,71,0.78021978021978022,null,""]
["Answers","","","","","","","OECD","mass","","flow through","","","","","","","8.0-9.0mg/L 75%","",""]
["Category","Freshwater/non-metal/non- plant","Paper and data unique identifier(eg. 1-1,10-150)","1024-9"]
["Scores",10,10,5,5,5,5,2,5,5,4,2,0,0,4,4,0,3,1,3,71,0.78021978021978022,null,""]
["Answers","","","","","","","OECD","mass","","flow through","","","","","","","8.0-9.0mg/L 75%","",""]
["Category","Freshwater/non-metal/non- plant","Paper and data unique identifier(eg. 1-1,10-150)","1024-10"]
["Scores",10,10,5,5,5,5,2,5,5,4,2,0,0,4,4,0,3,1,3,71,0.78021978021978022,null,""]
["Answers","","","","","","","OECD","mass","","flow through","","","","","","","8.0-9.0mg/L 75%","",""]
["Category","Freshwater/non-metal/non- plant","Paper and data unique identifier(eg. 1-1,10-150)","1024-11"]
["Scores",10,10,5,5,5,5,2,5,5,4,2,0,0,4,4,0,3,1,3,71,0.78021978021978022,null,""]
["Answers","","","","","","","OECD","mass","","flow through","","","","","","","8.0-9.0mg/L 75%","",""]
["Category","Freshwater/non-metal/non- plant","Paper and data unique identifier(eg. 1-1,10-150)","1024-12"]
["Scores",10,10,5,5,5,5,2,5,5,4,2,0,0,4,4,0,3,1,3,71,0.78021978021978022,null,""]
["Answers","","","","","","","OECD","mass","","flow through","","","","","","","8.0-9.0mg/L 75%","",""]
["Category","Freshwater/non-metal/non- plant","Paper and data unique identifier(eg. 1-1,10-150)","1024-13"]
["Scores",10,10,5,5,5,5,2,5,5,4,2,0,0,4,4,0,3,1,3,71,0.78021978021978022,null,""]
["Answers","","","","","","","OECD","mass","","flow through","","","","","","","8.0-9.0mg/L 75%","",""]
["Category","Freshwater/non-metal/non- plant","Paper and data unique identifier(eg. 1-1,10-150)","1026-1"]
["Scores",10,5,0,5,5,0,0,5,5,0,4,0,0,4,4,0,0,0,3,50,0.5494505494505495,null,""]
["Answers","","","","","","","","","","","","","","","","","","",""]
["Category","Freshwater/non-metal/non- plant","Paper and data unique identifier(eg. 1-1,10-150)","1026-2"]
["Scores",10,5,0,5,5,0,0,5,5,0,4,0,0,4,4,0,0,0,3,50,0.5494505494505495,null,""]
["Answers","","","","","","","","","","","","","","","","","","",""]
["Category","Freshwater/non-metal/non- plant","Paper and data unique identifier(eg. 1-1,10-150)","1026-3"]
["Scores",10,5,0,5,5,0,0,5,5,0,4,0,0,4,4,0,0,0,3,50,0.5494505494505495,null,""]
["Answers","","","","","","","","","","","","","","","","","","",""]
["Category","Freshwater/non-metal/non- plant","Paper and data unique identifier(eg. 1-1,10-150)","1026-4"]
["Scores",10,5,0,5,5,0,0,5,5,0,4,0,0,4,4,0,0,0,3,50,0.5494505494505495,null,""]
["Answers","","","","","","","","","","","","","","","","","","",""]
["Category","Freshwater/non-metal/non- plant","Paper and data unique identifier(eg. 1-1,10-150)","1026-5"]
["Scores",10,5,0,5,5,0,0,5,5,0,4,0,0,4,4,0,0,0,3,50,0.5494505494505495,null,""]
["Answers","","","","","","","","","","","","","","","","","","",""]
["Category","Freshwater/non-metal/non- plant","Paper and data unique identifier(eg. 1-1,10-150)","1026-6"]
["Scores",10,5,0,5,5,0,0,5,5,0,4,0,0,4,4,0,0,0,3,50,0.5494505494505495,null,""]
["Answers","","","","","","","","","","","","","","","","","","",""]
["Category","Freshwater/non-metal/non- plant","Paper and data unique identifier(eg. 1-1,10-150)","1029-1"]
["Scores",10,10,5,5,5,5,5,5,5,0,4,4,0,4,4,3,3,3,3,83,0.91208791208791207,null,""]
["Answers","24h","gill movement","ec50",50,"","duplicates and replicates",">90% control survival","age","","","","","","","(0.06-0.15) 95%","","","","98% purity and controls tested for contamination"]
["Category","Freshwater/non-metal/non- plant","Paper and data unique identifier(eg. 1-1,10-150)","1029-2"]
["Scores",10,10,5,5,5,5,5,5,5,0,4,4,0,4,4,3,3,3,3,83,0.91208791208791207,null,""]
["Answers","48h","gill movement","ec50",50,"","duplicates and replicates",">90% control survival","age","","","","","","","(0.02-0.11) 95%","","","","98% purity and controls tested for contamination"]
["Category","Freshwater/non-metal/non- plant","Paper and data unique identifier(eg. 1-1,10-150)","1029-3"]
["Scores",10,10,5,5,5,5,5,5,5,0,4,4,0,4,4,3,3,3,3,83,0.91208791208791207,null,""]
["Answers","96h","movement","ec50",50,"","duplicates and replicates",">90% control survival","age","","","","","","","(0.19-0.41) 95%","","","","98% purity and controls tested for contamination"]
["Category","Freshwater/non-metal/non- plant","Paper and data unique identifier(eg. 1-1,10-150)","1030-1 "]
["Scores",10,5,0,0,5,5,0,5,5,4,2,0,4,0,4,0,0,1,3,53,0.58241758241758246,null,""]
["Answers","28 days","","","","","","","29.83±0.188 g","","flow","nominal ","","","","","","","",">95% purity"]
["Category","Freshwater/non-metal/non- plant","Paper and data unique identifier(eg. 1-1,10-150)","1030-2"]
["Scores",10,5,0,0,5,5,0,5,5,4,2,0,4,0,4,0,0,1,3,53,0.58241758241758246,null,""]
["Answers","28 days","","","","","","","29.83±0.188 g","","flow","nominal ","","","","","","","",">95% purity"]
["Category","Freshwater/non-metal/non- plant","Paper and data unique identifier(eg. 1-1,10-150)","1030-3"]
["Scores",10,5,0,0,5,5,0,5,5,4,2,0,4,0,4,0,0,1,3,53,0.58241758241758246,null,""]
["Answers","28 days","","","","","","","29.83±0.188 g","","flow","nominal ","","","","","","","",">95% purity"]
["Category","Freshwater/non-metal/non- plant","Paper and data unique identifier(eg. 1-1,10-150)","1030-4"]
["Scores",10,5,0,0,5,5,0,5,5,4,2,0,4,0,4,0,0,1,3,53,0.58241758241758246,null,""]
["Answers","28 days","","","","","","","29.83±0.188 g","","flow","nominal ","","","","","","","",">95% purity"]
["Category","Freshwater/non-metal/non- plant","Paper and data unique identifier(eg. 1-1,10-150)","1030-5"]
["Scores",10,5,0,0,5,5,0,5,5,4,2,0,4,0,4,0,0,1,3,53,0.58241758241758246,null,""]
["Answers","28 days","","","","","","","29.83±0.188 g","","flow","nominal ","","","","","","","",">95% purity"]
["Category","Freshwater/non-metal/non- plant","Paper and data unique identifier(eg. 1-1,10-150)","1030-6"]
["Scores",10,5,0,0,5,5,0,5,5,4,2,0,4,0,4,0,0,1,3,53,0.58241758241758246,null,""]
["Answers","28 days","","","","","","","29.83±0.188 g","","flow","nominal ","","","","","","","",">95% purity"]
["Category","Freshwater/non-metal/non- plant","Paper and data unique identifier(eg. 1-1,10-150)","1030-7"]
["Scores",10,5,0,0,5,5,0,5,5,4,2,0,4,0,4,0,0,1,3,53,0.58241758241758246,null,""]
["Answers","28 days","","","","","","","29.83±0.188 g","","flow","nominal ","","","","","","","",">95% purity"]
["Category","Freshwater/non-metal/non- plant","Paper and data unique identifier(eg. 1-1,10-150)","1032-3"]
["Scores",10,10,5,5,5,0,2,5,5,0,2,0,0,4,4,1,1,1,3,63,0.69230769230769229,null,""]
["Answers","","","","","","","","age","","","","","","","","","","",""]
["Category","Freshwater/non-metal/non- plant","Paper and data unique identifier(eg. 1-1,10-150)","1032-4"]
["Scores",10,10,5,5,5,0,2,5,5,0,2,0,0,4,4,1,1,1,3,63,0.69230769230769229,null,""]
["Answers","","","","","","","","age","","","","","","","","","","",""]
["Category","Freshwater/non-metal/non- plant","Paper and data unique identifier(eg. 1-1,10-150)","1037-1"]
["Scores",10,5,5,5,5,5,2,5,5,0,2,0,0,4,4,1,1,1,3,63,0.69230769230769229,null,""]
["Answers","","","","","","","ATSM Tests were accepted if there was at least 90% survival in the negative controls.","age","","","","","","probit","95% CI","","","",0.99]
["Category","Freshwater/non-metal/non- plant","Paper and data unique identifier(eg. 1-1,10-150)","1041-1"]
["Scores",10,10,5,5,5,5,2,5,5,0,2,0,4,4,4,3,3,1,3,76,0.8351648351648352,null,""]
["Answers","","compared to control eggs","","","","","","age","","","","","","","95% CI","","","",0.99]
["Category","Freshwater/non-metal/non- plant","Paper and data unique identifier(eg. 1-1,10-150)","1041-2"]
["Scores",10,10,5,5,5,5,2,5,5,0,2,0,4,4,4,3,3,1,3,76,0.8351648351648352,null,""]
["Answers","","viable when gills open","","","","","","age","","","","","","","95% CI","","","",""]
["Category","Freshwater/non-metal/non- plant","Paper and data unique identifier(eg. 1-1,10-150)","1043-1"]
["Scores",10,10,5,5,0,5,0,0,5,0,2,0,0,4,0,0,1,1,0,48,0.52747252747252749,null,""]
["Answers","large range stated","Growth was\nqualitatively assessed using four categories (no growth at all; some growth; medium growth; no inhibition of growth).","","","","","","","","","","","","","","","","",""]
["Category","Freshwater/non-metal/non- plant","Paper and data unique identifier(eg. 1-1,10-150)","1043-2"]
["Scores",10,10,5,5,0,5,0,0,5,0,2,0,0,4,0,0,1,1,0,48,0.52747252747252749,null,""]
["Answers","large range stated","Growth was\nqualitatively assessed using four categories (no growth at all; some growth; medium growth; no inhibition of growth).","","","","","","","","","","","","","","","","",""]
["Category","Freshwater/non-metal/non- plant","Paper and data unique identifier(eg. 1-1,10-150)","1043-3"]
["Scores",10,10,5,5,0,5,0,0,5,0,2,0,0,4,0,0,1,1,0,48,0.52747252747252749,null,""]
["Answers","large range stated","Growth was\nqualitatively assessed using four categories (no growth at all; some growth; medium growth; no inhibition of growth).","","","","","","","","","","","","","","","","",""]
["Category","Freshwater/non-metal/non- plant","Paper and data unique identifier(eg. 1-1,10-150)","1043-4"]
["Scores",10,10,5,5,0,5,0,0,5,0,2,0,0,4,0,0,1,1,0,48,0.52747252747252749,null,""]
["Answers","large range stated","Growth was\nqualitatively assessed using four categories (no growth at all; some growth; medium growth; no inhibition of growth).","","","","","","","","","","","","","","","","",""]
["Category","Freshwater/non-metal/non- plant","Paper and data unique identifier(eg. 1-1,10-150)","1043-5"]
["Scores",10,10,5,5,0,5,0,0,5,0,2,0,0,4,0,0,1,1,0,48,0.52747252747252749,null,""]
["Answers","large range stated","Growth was\nqualitatively assessed using four categories (no growth at all; some growth; medium growth; no inhibition of growth).","","","","","","","","","","","","","","","","",""]
["Category","Freshwater/non-metal/non- plant","Paper and data unique identifier(eg. 1-1,10-150)","1043-6"]
["Scores",10,10,5,5,0,5,0,0,5,0,2,0,0,4,0,0,1,1,0,48,0.52747252747252749,null,""]
["Answers","large range stated","Growth was\nqualitatively assessed using four categories (no growth at all; some growth; medium growth; no inhibition of growth).","","","","","","","","","","","","","","","","",""]
["Category","Freshwater/non-metal/non- plant","Paper and data unique identifier(eg. 1-1,10-150)","1043-7"]
["Scores",10,10,5,5,0,5,0,0,5,0,2,0,0,4,0,0,1,1,0,48,0.52747252747252749,null,""]
["Answers","large range stated","Growth was\nqualitatively assessed using four categories (no growth at all; some growth; medium growth; no inhibition of growth).","","","","","","","","","","","","","","","","",""]
["Category","Freshwater/non-metal/non- plant","Paper and data unique identifier(eg. 1-1,10-150)","1043-8"]
["Scores",10,10,5,5,0,5,0,0,5,0,2,0,0,4,0,0,1,1,0,48,0.52747252747252749,null,""]
["Answers","large range stated","Growth was\nqualitatively assessed using four categories (no growth at all; some growth; medium growth; no inhibition of growth).","","","","","","","","","","","","","","","","",""]
["Category","Freshwater/non-metal/non- plant","Paper and data unique identifier(eg. 1-1,10-150)","1043-9"]
["Scores",10,10,5,5,0,5,0,0,5,0,2,0,0,4,0,0,1,1,0,48,0.52747252747252749,null,""]
["Answers","large range stated","Growth was\nqualitatively assessed using four categories (no growth at all; some growth; medium growth; no inhibition of growth).","","","","","","","","","","","","","","","","",""]
["Category","Freshwater/non-metal/non- plant","Paper and data unique identifier(eg. 1-1,10-150)","1044-1"]
["Scores",10,10,5,5,5,5,2,5,5,0,4,0,0,4,4,1,3,3,3,74,0.81318681318681318,null,""]
["Answers","Each test was terminated when 60 % of female adult animals\nfrom the diluent water and solvent control(s) had\nproduced a third brood (an average of at least 15 neonates\nproduced/female cladoceran).","","","","","","USEPA methods","","","","","","","","95% CI (49.4–83.4)","only measured","","",""]
["Category","Freshwater/non-metal/non- plant","Paper and data unique identifier(eg. 1-1,10-150)","1044-2"]
["Scores",10,10,5,5,5,5,2,5,5,0,4,0,0,4,4,1,3,3,3,74,0.81318681318681318,null,""]
["Answers","Each test was terminated when 60 % of female adult animals\nfrom the diluent water and solvent control(s) had\nproduced a third brood (an average of at least 15 neonates\nproduced/female cladoceran).","","","","","","USEPA methods","","","","","","","","95% CI ","only measured","","",""]
["Category","Freshwater/non-metal/non- plant","Paper and data unique identifier(eg. 1-1,10-150)","1044-3"]
["Scores",10,10,5,5,5,5,2,5,5,0,4,0,0,4,4,1,3,3,3,74,0.81318681318681318,null,""]
["Answers","Each test was terminated when 60 % of female adult animals\nfrom the diluent water and solvent control(s) had\nproduced a third brood (an average of at least 15 neonates\nproduced/female cladoceran).","","","","","","USEPA methods","","","","","","","","95% CI ","only measured","","",""]
["Category","Freshwater/non-metal/non- plant","Paper and data unique identifier(eg. 1-1,10-150)","1044-4"]
["Scores",10,10,5,5,5,5,2,5,5,0,4,0,0,4,4,1,3,3,3,74,0.81318681318681318,null,""]
["Answers","Each test was terminated when 60 % of female adult animals\nfrom the diluent water and solvent control(s) had\nproduced a third brood (an average of at least 15 neonates\nproduced/female cladoceran).","","","","","","USEPA methods","","","","","","","","95% CI (0–116)","only measured","","",""]
["Category","Freshwater/non-metal/non- plant","Paper and data unique identifier(eg. 1-1,10-150)","1044-5"]
["Scores",10,10,5,5,5,5,2,5,5,0,4,0,0,4,4,1,3,3,3,74,0.81318681318681318,null,""]
["Answers","Each test was terminated when 60 % of female adult animals\nfrom the diluent water and solvent control(s) had\nproduced a third brood (an average of at least 15 neonates\nproduced/female cladoceran).","","","","","","USEPA methods","","","","","","","","95% CI","only measured","","",""]
["Category","Freshwater/non-metal/non- plant","Paper and data unique identifier(eg. 1-1,10-150)","1044-6"]
["Scores",10,10,5,5,5,5,2,5,5,0,4,0,0,4,4,1,3,3,3,74,0.81318681318681318,null,""]
["Answers","Each test was terminated when 60 % of female adult animals\nfrom the diluent water and solvent control(s) had\nproduced a third brood (an average of at least 15 neonates\nproduced/female cladoceran).","","","","","","USEPA methods","","","","","","","","95% CI","only measured","","",""]
["Category","Freshwater/non-metal/non- plant","Paper and data unique identifier(eg. 1-1,10-150)","1046-1"]
["Scores",10,5,0,5,5,5,0,5,5,4,2,0,0,0,0,3,3,3,3,58,0.63736263736263732,null,""]
["Answers","","","","","","","","age","","","","","","","","","","","98 percent"]
["Category","Freshwater/non-metal/non- plant","Paper and data unique identifier(eg. 1-1,10-150)","1046-2"]
["Scores",10,5,0,5,5,5,0,5,5,4,2,0,0,0,0,3,3,3,3,58,0.63736263736263732,null,""]
["Answers","","","","","","","","age","","","","","","","","","","","98 percent"]
["Category","Freshwater/non-metal/non- plant","Paper and data unique identifier(eg. 1-1,10-150)","1046-3"]
["Scores",10,5,0,5,5,5,0,5,5,4,2,0,0,0,0,3,3,3,3,58,0.63736263736263732,null,""]
["Answers","","","","","","","","age","","","","","","","","","","","98 percent"]
["Category","Freshwater/non-metal/non- plant","Paper and data unique identifier(eg. 1-1,10-150)","1046-4"]
["Scores",10,5,0,5,5,5,0,5,5,4,2,0,0,0,0,3,3,3,3,58,0.63736263736263732,null,""]
["Answers","","","","","","","","age","","","","","","","","","","","98 percent"]
["Category","Freshwater/non-metal/non- plant","Paper and data unique identifier(eg. 1-1,10-150)","1046-5"]
["Scores",10,5,0,5,5,5,0,5,5,4,2,0,0,0,0,3,3,3,3,58,0.63736263736263732,null,""]
["Answers","","","","","","","","age","","","","","","","","","","","98 percent"]
["Category","Freshwater/non-metal/non- plant","Paper and data unique identifier(eg. 1-1,10-150)","1046-6"]
["Scores",10,5,0,5,5,5,0,5,5,4,2,0,0,0,0,3,3,3,3,58,0.63736263736263732,null,""]
["Answers","","","","","","","","age","","","","","","","","","","","98 percent"]
["Category","Freshwater/non-metal/non- plant","Paper and data unique identifier(eg. 1-1,10-150)","1047-1"]
["Scores",10,10,0,5,5,5,0,0,5,0,2,0,4,0,0,0,0,1,3,50,0.5494505494505495,null,""]
["Answers","large range of incubation","","","","","","","","","","","","","","","","","",""]
["Category","Freshwater/non-metal/non- plant","Paper and data unique identifier(eg. 1-1,10-150)","1047-2"]
["Scores",10,10,0,5,5,5,0,0,5,0,2,0,4,0,0,0,0,1,3,50,0.5494505494505495,null,""]
["Answers","large range of incubation","","","","","","","","","","","","","","","","","",""]
["Category","Freshwater/non-metal/non- plant","Paper and data unique identifier(eg. 1-1,10-150)","1049-1"]
["Scores",10,10,5,5,5,5,2,5,5,4,2,4,4,4,4,0,0,1,0,75,0.82417582417582413,null,""]
["Answers","","","","","","","ATSM","","","static","","","","","95% CI (39.8-45.3)","","","",""]
["Category","Freshwater/non-metal/non- plant","Paper and data unique identifier(eg. 1-1,10-150)","1049-2"]
["Scores",10,10,5,5,5,5,2,5,5,4,2,4,4,4,4,0,0,1,0,75,0.82417582417582413,null,""]
["Answers","","","","","","","ATSM","","","static","","","","","95% CI (21.4-24.6)","","","",""]
["Category","Freshwater/non-metal/non- plant","Paper and data unique identifier(eg. 1-1,10-150)","1049-3"]
["Scores",10,10,5,5,5,5,2,5,5,4,2,4,4,4,4,0,0,1,0,75,0.82417582417582413,null,""]
["Answers","","","","","","","ATSM","","","static","","","","","95% CI (7.1-9.2)","","","",""]
["Category","Freshwater/non-metal/non- plant","Paper and data unique identifier(eg. 1-1,10-150)","1049-4"]
["Scores",10,10,5,5,5,5,2,5,5,4,2,4,4,4,4,0,0,1,0,75,0.82417582417582413,null,""]
["Answers","","","","","","","ATSM","","","static","","","","","95% CI (13.6-15.4)","","","",""]
["Category","Freshwater/non-metal/non- plant","Paper and data unique identifier(eg. 1-1,10-150)","1049-5"]
["Scores",10,10,5,5,5,5,2,5,5,4,2,4,4,4,4,0,0,1,0,75,0.82417582417582413,null,""]
["Answers","","","","","","","ATSM","","","static","","","","","95% CI (9.7-12.2)","","","",""]
["Category","Freshwater/non-metal/non- plant","Paper and data unique identifier(eg. 1-1,10-150)","1049-6"]
["Scores",10,10,5,5,5,5,2,5,5,4,2,4,4,4,4,0,0,1,0,75,0.82417582417582413,null,""]
["Answers","","","","","","","ATSM","","","static","","","","","95% CI ","","","",""]
["Category","Freshwater/non-metal/non- plant","Paper and data unique identifier(eg. 1-1,10-150)","1049-7"]
["Scores",10,10,5,5,5,5,2,5,5,4,2,4,4,4,4,0,0,1,0,75,0.82417582417582413,null,""]
["Answers","","","","","","","ATSM","","","static","","","","","95% CI ","","","",""]
["Category","Freshwater/non-metal/non- plant","Paper and data unique identifier(eg. 1-1,10-150)","1050-1"]
["Scores",10,5,5,5,5,5,2,5,5,4,2,0,4,4,0,0,1,1,0,63,0.69230769230769229,null,""]
["Answers","","","","","","","","age","","flow","","","","","","","","",""]
["Category","Freshwater/non-metal/non- plant","Paper and data unique identifier(eg. 1-1,10-150)","1052-1"]
["Scores",10,5,5,5,5,5,2,5,5,4,2,0,0,4,4,3,3,1,3,71,0.78021978021978022,null,""]
["Answers","","","","","","","","1.1-2.5 g, 45-60 mm or 10-30 g, 100-150 mm","","flow-through","","","","","","","","",">98% "]
["Category","Freshwater/non-metal/non- plant","Paper and data unique identifier(eg. 1-1,10-150)","1052-2"]
["Scores",10,5,5,5,5,5,2,5,5,4,2,0,0,4,4,3,3,1,3,71,0.78021978021978022,null,""]
["Answers","","","","","","","","1.1-2.5 g, 45-60 mm or 10-30 g, 100-150 mm","","flow-through","","","","","","","","",">98% "]
["Category","Freshwater/non-metal/non- plant","Paper and data unique identifier(eg. 1-1,10-150)","1052-3"]
["Scores",10,5,5,5,5,5,2,5,5,4,2,0,0,4,4,3,3,1,3,71,0.78021978021978022,null,""]
["Answers","","","","","","","","1.1-2.5 g, 45-60 mm or 10-30 g, 100-150 mm","","flow-through","","","","","","","","",">98% "]
["Category","Freshwater/non-metal/non- plant","Paper and data unique identifier(eg. 1-1,10-150)","1052-4"]
["Scores",10,5,5,5,5,5,2,5,5,4,2,0,0,4,4,3,3,1,3,71,0.78021978021978022,null,""]
["Answers","","","","","","","","1.1-2.5 g, 45-60 mm or 10-30 g, 100-150 mm","","flow-through","","","","","95% CI (14.4-17.9)","","","",">98% "]
["Category","Freshwater/non-metal/non- plant","Paper and data unique identifier(eg. 1-1,10-150)","1052-5"]
["Scores",10,5,5,5,5,5,2,5,5,4,2,0,0,4,4,3,3,1,3,71,0.78021978021978022,null,""]
["Answers","","","","","","","","1.1-2.5 g, 45-60 mm or 10-30 g, 100-150 mm","","flow-through","","","","","95% CI (9.0-13.1)","","","",">98% "]
["Category","Freshwater/non-metal/non- plant","Paper and data unique identifier(eg. 1-1,10-150)","1052-6"]
["Scores",10,5,5,5,5,5,2,5,5,4,2,0,0,4,4,3,3,1,3,71,0.78021978021978022,null,""]
["Answers","","","","","","","","1.1-2.5 g, 45-60 mm or 10-30 g, 100-150 mm","","flow-through","","","","","95% CI (7.9-18.1)","","","",">98% "]
["Category","Freshwater/non-metal/non- plant","Paper and data unique identifier(eg. 1-1,10-150)","1052-7"]
["Scores",10,5,5,5,5,5,2,5,5,4,2,0,0,4,4,3,3,1,3,71,0.78021978021978022,null,""]
["Answers","","","","","","","","1.1-2.5 g, 45-60 mm or 10-30 g, 100-150 mm","","flow-through","","","","","95% CI  (2.1-6.0)","","","",">98% "]
["Category","Freshwater/non-metal/non- plant","Paper and data unique identifier(eg. 1-1,10-150)","1052-8"]
["Scores",10,5,5,5,5,5,2,5,5,4,2,0,0,4,4,3,3,1,3,71,0.78021978021978022,null,""]
["Answers","","","","","","","","","","flow-through","","","","","95% CI  ","","","",">98% "]
["Category","Freshwater/non-metal/non- plant","Paper and data unique identifier(eg. 1-1,10-150)","1052-9"]
["Scores",10,5,5,5,5,5,2,5,5,4,2,0,0,4,4,3,3,1,3,71,0.78021978021978022,null,""]
["Answers","","","","","","","","","","flow-through","","","","","95% CI  ","","","",">98% "]
["Category","Freshwater/non-metal/non- plant","Paper and data unique identifier(eg. 1-1,10-150)","1052-10"]
["Scores",10,5,5,5,5,5,2,5,5,4,2,0,0,4,4,3,3,1,3,71,0.78021978021978022,null,""]
["Answers","","","","","","","","","","flow-through","","","","","95% CI  ","","","",">98% "]
["Category","Freshwater/non-metal/non- plant","Paper and data unique identifier(eg. 1-1,10-150)","1052-11"]
["Scores",10,5,5,5,5,5,2,5,5,4,2,0,0,4,4,3,3,1,3,71,0.78021978021978022,null,""]
["Answers","","","","","","","","","","flow-through","","","","","95% CI  ","","","",">98% "]
["Category","Freshwater/non-metal/non- plant","Paper and data unique identifier(eg. 1-1,10-150)","1056-1"]
["Scores",10,5,5,5,5,5,2,5,5,0,2,0,4,4,4,0,0,1,3,65,0.7142857142857143,null,""]
["Answers","","","","","","","USEPA","","","","","","slope noted","log-probit analysis as per USEPA (1994)","95% CL","","","test room temperature maintained but not test temperature","97.1% purity"]
["Category","Freshwater/non-metal/non- plant","Paper and data unique identifier(eg. 1-1,10-150)","1056-2"]
["Scores",10,5,5,5,5,5,2,5,5,0,2,0,4,4,4,0,0,1,3,65,0.7142857142857143,null,""]
["Answers","","","","","","","USEPA","","","","","","slope noted","log-probit analysis as per USEPA (1994)","95% CL 0.015--0.032","","","test room temperature maintained but not test temperature","97.1% purity"]
["Category","Freshwater/non-metal/non- plant","Paper and data unique identifier(eg. 1-1,10-150)","1056-3"]
["Scores",10,5,5,5,5,5,2,5,5,0,2,0,4,4,4,0,0,1,3,65,0.7142857142857143,null,""]
["Answers","","","","","","","USEPA","","","","","","slope noted","log-probit analysis as per USEPA (1994)","95% CL 0.00034--0.0005","","","test room temperature maintained but not test temperature","97.1% purity"]
["Category","Freshwater/non-metal/non- plant","Paper and data unique identifier(eg. 1-1,10-150)","1056-4"]
["Scores",10,5,5,5,5,5,2,5,5,0,2,0,4,4,4,0,0,1,3,65,0.7142857142857143,null,""]
["Answers","","","","","","","USEPA","","","","","","slope noted","log-probit analysis as per USEPA (1994)","95% CL 0.00119-0.00163","","","test room temperature maintained but not test temperature","97.1% purity"]
["Category","Freshwater/non-metal/non- plant","Paper and data unique identifier(eg. 1-1,10-150)","1056-5"]
["Scores",10,5,5,5,5,5,2,5,5,0,2,0,4,4,4,0,0,1,3,65,0.7142857142857143,null,""]
["Answers","","","","","","","USEPA","","","","","","slope noted","log-probit analysis as per USEPA (1994)","95% CL 0.00009-0.0081","","","test room temperature maintained but not test temperature","97.1% purity"]
["Category","Freshwater/non-metal/non- plant","Paper and data unique identifier(eg. 1-1,10-150)","1056-6"]
["Scores",10,5,5,5,5,5,2,5,5,0,2,0,4,4,4,0,0,1,3,65,0.7142857142857143,null,""]
["Answers","","","","","","","USEPA","","","","","","slope noted","log-probit analysis as per USEPA (1994)","95% CL 0.00042-0.00147","","","test room temperature maintained but not test temperature","97.1% purity"]
["Category","Freshwater/non-metal/non- plant","Paper and data unique identifier(eg. 1-1,10-150)","1056-7"]
["Scores",10,5,5,5,5,5,2,5,5,0,2,0,4,4,4,0,0,1,3,65,0.7142857142857143,null,""]
["Answers","","","","","","","USEPA","","","","","","slope noted","log-probit analysis as per USEPA (1994)","95% CL  0.00134-0.00152","","","test room temperature maintained but not test temperature","97.1% purity"]
["Category","Freshwater/non-metal/non- plant","Paper and data unique identifier(eg. 1-1,10-150)","1056-8"]
["Scores",10,5,5,5,5,5,2,5,5,0,2,0,4,4,4,0,0,1,3,65,0.7142857142857143,null,""]
["Answers","","","","","","","USEPA","","","","","","slope noted","log-probit analysis as per USEPA (1994)","95% CL 0.0069-0.0077","","","test room temperature maintained but not test temperature","97.1% purity"]
["Category","Freshwater/non-metal/non- plant","Paper and data unique identifier(eg. 1-1,10-150)","1056-9"]
["Scores",10,5,5,5,5,5,2,5,5,0,2,0,4,4,4,0,0,1,3,65,0.7142857142857143,null,""]
["Answers","","","","","","","USEPA","","","","","","slope noted","log-probit analysis as per USEPA (1994)","95% CL  0.00004-0.0087","","","test room temperature maintained but not test temperature","97.1% purity"]
["Category","Freshwater/non-metal/non- plant","Paper and data unique identifier(eg. 1-1,10-150)","1056-10"]
["Scores",10,5,5,5,5,5,2,5,5,0,2,0,4,4,4,0,0,1,3,65,0.7142857142857143,null,""]
["Answers","","","","","","","USEPA","","","","","","slope noted","log-probit analysis as per USEPA (1994)","95% CL 0.0071-0.009","","","test room temperature maintained but not test temperature","97.1% purity"]
["Category","Freshwater/non-metal/non- plant","Paper and data unique identifier(eg. 1-1,10-150)","1056-11"]
["Scores",10,5,5,5,5,5,2,5,5,0,2,0,4,4,4,0,0,1,3,65,0.7142857142857143,null,""]
["Answers","","","","","","","USEPA","","","","","","slope noted","log-probit analysis as per USEPA (1994)","95% CL 0.00032-0.00052","","","test room temperature maintained but not test temperature","97.1% purity"]
["Category","Freshwater/non-metal/non- plant","Paper and data unique identifier(eg. 1-1,10-150)","1056-12"]
["Scores",10,5,5,5,5,5,2,5,5,0,2,0,4,4,4,0,0,1,3,65,0.7142857142857143,null,""]
["Answers","","","","","","","USEPA","","","","","","slope noted","log-probit analysis as per USEPA (1994)","95% CL 0.00016--0.0008","","","test room temperature maintained but not test temperature","97.1% purity"]
["Category","Freshwater/non-metal/non- plant","Paper and data unique identifier(eg. 1-1,10-150)","1056-12"]
["Scores",10,5,5,5,5,5,2,5,5,0,2,0,4,4,4,0,0,1,3,65,0.7142857142857143,null,""]
["Answers","","","","","","","USEPA","","","","","","slope noted","log-probit analysis as per USEPA (1994)","95% CL 0.00055-0.00141","","","test room temperature maintained but not test temperature","97.1% purity"]
["Category","Freshwater/non-metal/non- plant","Paper and data unique identifier(eg. 1-1,10-150)","1057-1"]
["Scores",10,5,5,5,5,5,2,5,5,0,2,0,4,4,4,0,0,1,3,65,0.7142857142857143,null,""]
["Answers","","","","","","","USEPA","","","","","","slope noted","log-probit analysis as per USEPA (1994)","95% CL 0.00004-0.00066","","","test room temperature maintained but not test temperature","97.1% purity"]
["Category","Freshwater/non-metal/non- plant","Paper and data unique identifier(eg. 1-1,10-150)","1057-2"]
["Scores",10,5,5,5,5,5,2,5,5,0,2,0,4,4,4,0,0,1,3,65,0.7142857142857143,null,""]
["Answers","","","","","","","USEPA","","","","","","slope noted","log-probit analysis as per USEPA (1994)","95% CL 0.0005-0.0052","","","test room temperature maintained but not test temperature","97.1% purity"]
["Category","Freshwater/non-metal/non- plant","Paper and data unique identifier(eg. 1-1,10-150)","1058-1"]
["Scores",10,5,5,5,5,5,2,5,5,0,4,0,4,4,4,3,3,3,3,75,0.82417582417582413,null,""]
["Answers","","","","","","","USEPA std methods","age","","","","","","","95% CL","","","","analytical grade"]
["Category","Freshwater/non-metal/non- plant","Paper and data unique identifier(eg. 1-1,10-150)","1058-2"]
["Scores",10,5,5,5,5,5,2,5,5,0,4,0,4,4,4,3,3,3,3,75,0.82417582417582413,null,""]
["Answers","","","","","","","USEPA std methods","age","","","","","","","95% CL (191–224)","","","","analytical grade"]
["Category","Freshwater/non-metal/non- plant","Paper and data unique identifier(eg. 1-1,10-150)","1058-3"]
["Scores",10,5,5,5,5,5,2,5,5,0,4,0,4,4,4,3,3,3,3,75,0.82417582417582413,null,""]
["Answers","","","","","","","USEPA std methods","age 101-120 day old","","","","","","","","","","","analytical grade"]
["Category","Freshwater/non-metal/non- plant","Paper and data unique identifier(eg. 1-1,10-150)","1059-1"]
["Scores",10,5,5,5,5,5,2,5,5,0,2,4,4,4,4,3,3,3,3,77,0.84615384615384615,null,""]
["Answers","","","","","","","","age","","","nominal ","NaCl reference tests","","","95% CL (376.27–438.79)","measured but not stated","","","98.5% purity"]
["Category","Freshwater/non-metal/non- plant","Paper and data unique identifier(eg. 1-1,10-150)","1059-2"]
["Scores",10,5,5,5,5,5,2,5,5,0,2,4,4,4,4,3,3,3,3,77,0.84615384615384615,null,""]
["Answers","","","","","","","","age","","","nominal ","NaCl reference tests","","","95% CL (275.56–324.12)","measured but not stated","","","98.5% purity"]
["Category","Freshwater/non-metal/non- plant","Paper and data unique identifier(eg. 1-1,10-150)","1059-3"]
["Scores",10,5,5,5,5,5,2,5,5,0,2,4,4,4,4,3,3,3,3,77,0.84615384615384615,null,""]
["Answers","","","","","","","","age","","","nominal ","NaCl reference tests","","","95% CL (275.56–324.12)","measured but not stated","","","98.5% purity"]
["Category","Freshwater/non-metal/non- plant","Paper and data unique identifier(eg. 1-1,10-150)","1059-4"]
["Scores",10,5,5,5,5,5,2,5,5,0,2,4,4,4,4,3,3,3,3,77,0.84615384615384615,null,""]
["Answers","","","","","","","","age","","","nominal ","NaCl reference tests","","","95% CL (275.56–324.12)","measured but not stated","","","98.5% purity"]
["Category","Freshwater/non-metal/non- plant","Paper and data unique identifier(eg. 1-1,10-150)","1059-5"]
["Scores",10,5,5,5,5,5,2,5,5,0,2,4,4,4,4,3,3,3,3,77,0.84615384615384615,null,""]
["Answers","","","","","","","","age","","","nominal ","NaCl reference tests","","","95% CL (275.56–324.12)","measured but not stated","","","98.5% purity"]
["Category","Freshwater/non-metal/non- plant","Paper and data unique identifier(eg. 1-1,10-150)","1059-6"]
["Scores",10,5,5,5,5,5,2,5,5,0,2,4,4,4,4,3,3,3,3,77,0.84615384615384615,null,""]
["Answers","","","","","","","","age","","","nominal ","NaCl reference tests","","","95% CL (275.56–324.12)","measured but not stated","","","98.5% purity"]
["Category","Freshwater/non-metal/non- plant","Paper and data unique identifier(eg. 1-1,10-150)","1060-1"]
["Scores",10,10,0,5,5,5,2,5,5,4,2,0,4,0,0,0,0,1,3,61,0.67032967032967028,null,""]
["Answers","","","","","","","","","","flow-through","","","","","","","","","98% purity"]
["Category","Freshwater/non-metal/non- plant","Paper and data unique identifier(eg. 1-1,10-150)","1060-2"]
["Scores",10,10,0,5,5,5,2,5,5,4,2,0,4,0,0,0,0,1,3,61,0.67032967032967028,null,""]
["Answers","","","","","","","","","","flow-through","","","","","","","","","98% purity"]
["Category","Freshwater/non-metal/non- plant","Paper and data unique identifier(eg. 1-1,10-150)","1060-2"]
["Scores",10,10,0,5,5,5,2,5,5,4,2,0,4,0,0,0,0,1,3,61,0.67032967032967028,null,""]
["Answers","","","","","","","","","","flow-through","","","","","","","","","98% purity"]
["Category","Freshwater/non-metal/non- plant","Paper and data unique identifier(eg. 1-1,10-150)","1060-3"]
["Scores",10,10,0,5,5,5,2,5,5,4,2,0,4,0,0,0,0,1,3,61,0.67032967032967028,null,""]
["Answers","","","","","","","","","","flow-through","","","","","","","","","98% purity"]
["Category","Freshwater/non-metal/non- plant","Paper and data unique identifier(eg. 1-1,10-150)","1060-4"]
["Scores",10,10,0,5,5,5,2,5,5,4,2,0,4,0,0,0,0,1,3,61,0.67032967032967028,null,""]
["Answers","","","","","","","","","","flow-through","","","","","","","","","98% purity"]
["Category","Freshwater/non-metal/non- plant","Paper and data unique identifier(eg. 1-1,10-150)","1060-5"]
["Scores",10,10,0,5,5,5,2,5,5,4,2,0,4,0,0,0,0,1,3,61,0.67032967032967028,null,""]
["Answers","","","","","","","","","","flow-through","","","","","","","","","98% purity"]
["Category","Freshwater/non-metal/non- plant","Paper and data unique identifier(eg. 1-1,10-150)","1029-4"]
["Scores",10,10,5,5,5,5,5,5,5,0,4,4,0,4,4,3,3,3,3,83,0.91208791208791207,null,""]
["Answers","","","","","","","","","","","","","","","","","","",""]
["Category","Freshwater/non-metal/non- plant","Paper and data unique identifier(eg. 1-1,10-150)","1029-5"]
["Scores",10,10,5,5,5,5,5,5,5,0,4,4,0,4,4,3,3,3,3,83,0.91208791208791207,null,""]
["Answers","","","","","","","","","","","","","","","","","","",""]
["Category","Freshwater/non-metal/non- plant","Paper and data unique identifier(eg. 1-1,10-150)","1029-6"]
["Scores",10,10,5,5,5,5,5,5,5,0,4,4,0,4,4,3,3,3,3,83,0.91208791208791207,null,""]
["Answers","","","","","","","","","","","","","","","","","","",""]
["Category","Freshwater/non-metal/non- plant","Paper and data unique identifier(eg. 1-1,10-150)","1029-7"]
["Scores",10,10,5,5,5,5,5,5,5,0,4,4,0,4,4,3,3,3,3,83,0.91208791208791207,null,""]
["Answers","","","","","","","","","","","","","","","","","","",""]
["Category","Freshwater/non-metal/non- plant","Paper and data unique identifier(eg. 1-1,10-150)","1029-8"]
["Scores",10,10,5,5,5,5,5,5,5,0,4,4,0,4,4,3,3,3,3,83,0.91208791208791207,null,""]
["Answers","","","","","","","","","","","","","","","","","","",""]
["Category","Freshwater/non-metal/non- plant","Paper and data unique identifier(eg. 1-1,10-150)","1029-9"]
["Scores",10,10,5,5,5,5,5,5,5,0,4,4,0,4,4,3,3,3,3,83,0.91208791208791207,null,""]
["Answers","","","","","","","","","","","","","","","","","","",""]
["Category","Freshwater/non-metal/non- plant","Paper and data unique identifier(eg. 1-1,10-150)","1029-10"]
["Scores",10,10,5,5,5,5,5,5,5,0,4,4,0,4,4,3,3,3,3,83,0.91208791208791207,null,""]
["Answers","","","","","","","","","","","","","","","","","","",""]
["Category","Freshwater/non-metal/non- plant","Paper and data unique identifier(eg. 1-1,10-150)","1029-11"]
["Scores",10,10,5,5,5,5,5,5,5,0,4,4,0,4,4,3,3,3,3,83,0.91208791208791207,null,""]
["Answers","","","","","","","","","","","","","","","","","","",""]
["Category","Freshwater/non-metal/non- plant","Paper and data unique identifier(eg. 1-1,10-150)","1029-12"]
["Scores",10,10,5,5,5,5,5,5,5,0,4,4,0,4,4,3,3,3,3,83,0.91208791208791207,null,""]
["Answers","","","","","","","","","","","","","","","","","","",""]
["Category","Freshwater/non-metal/non- plant","Paper and data unique identifier(eg. 1-1,10-150)","1065-1"]
["Scores",10,10,5,5,5,5,2,5,5,0,2,0,4,4,0,0,0,3,3,68,0.74725274725274726,null,""]
["Answers","","","","","","triplicate","WHO guidelines","4th instar larvae","tap water","","","","","log probit analysis","","","","","99.9% purity"]
["Category","Freshwater/non-metal/non- plant","Paper and data unique identifier(eg. 1-1,10-150)","1065-2"]
["Scores",10,10,5,5,5,5,2,5,5,0,2,0,4,4,0,0,0,3,3,68,0.74725274725274726,null,""]
["Answers","","","","","","triplicate","WHO guidelines","4th instar larvae","tap water","","","","","log probit analysis","","","","","99.9% purity"]
["Category","Freshwater/non-metal/non- plant","Paper and data unique identifier(eg. 1-1,10-150)","1065-3"]
["Scores",10,10,5,5,5,5,2,5,5,0,2,0,4,4,0,0,0,3,3,68,0.74725274725274726,null,""]
["Answers","","","","","","triplicate","WHO guidelines","4th instar larvae","tap water","","","","","log probit analysis","","","","","99.9% purity"]
["Category","Freshwater/non-metal/non- plant","Paper and data unique identifier(eg. 1-1,10-150)","1066-1"]
["Scores",10,5,5,5,5,5,2,0,5,0,2,0,4,4,4,1,0,1,3,61,0.67032967032967028,null,""]
["Answers","","","","","","triplicate","","","","","","","","","","","","","99.9% pure"]
["Category","Freshwater/non-metal/non- plant","Paper and data unique identifier(eg. 1-1,10-150)","1066-2"]
["Scores",10,5,5,5,5,5,2,0,5,0,2,0,4,4,4,1,0,1,3,61,0.67032967032967028,null,""]
["Answers","","","","","","triplicate","","","","","","","","","95% CL (143.9-262.1)","","","","99.9% pure"]
["Category","Freshwater/non-metal/non- plant","Paper and data unique identifier(eg. 1-1,10-150)","1066-3"]
["Scores",10,5,5,5,5,5,2,0,5,0,2,0,4,4,4,1,0,1,3,61,0.67032967032967028,null,""]
["Answers","","","","","","triplicate","","","","","","","","","95% CL (6.4-9.9)","","","","99.9% pure"]
["Category","Freshwater/non-metal/non- plant","Paper and data unique identifier(eg. 1-1,10-150)","1066-4"]
["Scores",10,5,5,5,5,5,2,0,5,0,2,0,4,4,4,1,0,1,3,61,0.67032967032967028,null,""]
["Answers","","","","","","triplicate","","","","","","","","","","","","","99.9% pure"]
["Category","Freshwater/non-metal/non- plant","Paper and data unique identifier(eg. 1-1,10-150)","1066-5"]
["Scores",10,5,5,5,5,5,2,0,5,0,2,0,4,4,4,1,0,1,3,61,0.67032967032967028,null,""]
["Answers","","","","","","triplicate","","","","","","","","","95% CL (1056.2-H562096.3)","","","","99.9% pure"]
["Category","Freshwater/non-metal/non- plant","Paper and data unique identifier(eg. 1-1,10-150)","1066-6"]
["Scores",10,5,5,5,5,5,2,0,5,0,2,0,4,4,4,1,0,1,3,61,0.67032967032967028,null,""]
["Answers","","","","","","triplicate","","","","","","","","","95% CL (3.6-24.5)","","","","99.9% pure"]
["Category","Freshwater/non-metal/non- plant","Paper and data unique identifier(eg. 1-1,10-150)","1067-1"]
["Scores",10,5,5,5,5,5,2,5,5,4,2,0,0,4,4,1,1,3,3,69,0.75824175824175821,null,""]
["Answers","","","","","","triplicate","","3.26 ± 0.43 g","","static","","","","","","","","","99.1% pure"]
["Category","Freshwater/non-metal/non- plant","Paper and data unique identifier(eg. 1-1,10-150)","1067-2"]
["Scores",10,5,5,5,5,5,2,5,5,4,2,0,0,4,4,1,1,3,3,69,0.75824175824175821,null,""]
["Answers","","","","","","triplicate","","3.26 ± 0.43 g","","static","","","","","","","","","99.1% pure"]
["Category","Freshwater/non-metal/non- plant","Paper and data unique identifier(eg. 1-1,10-150)","1067-3"]
["Scores",10,5,5,5,5,5,2,5,5,4,2,0,0,4,4,1,1,3,3,69,0.75824175824175821,null,""]
["Answers","","","","","","triplicate","","3.26 ± 0.43 g","","static","","","","","","","","","99.1% pure"]
["Category","Freshwater/non-metal/non- plant","Paper and data unique identifier(eg. 1-1,10-150)","1069-1"]
["Scores",10,5,5,5,5,5,2,5,5,0,4,0,4,4,4,3,3,3,3,75,0.82417582417582413,null,""]
["Answers","","","","","","","","3rd brood neonate <24hr old","","","","","","","","","","","97.8% pure"]
["Category","Freshwater/non-metal/non- plant","Paper and data unique identifier(eg. 1-1,10-150)","1070-1"]
["Scores",10,5,0,0,5,5,2,5,5,0,2,0,4,0,0,0,0,1,3,47,0.51648351648351654,null,""]
["Answers","","","","","","","","","","","","","","","","","","",">98% pure"]
["Category","Freshwater/non-metal/non- plant","Paper and data unique identifier(eg. 1-1,10-150)","1070-2"]
["Scores",10,5,0,0,5,5,2,5,5,0,2,0,4,0,0,0,0,1,3,47,0.51648351648351654,null,""]
["Answers","","","","","","","","","","","","","","","","","","",">98% pure"]
["Category","Freshwater/non-metal/non- plant","Paper and data unique identifier(eg. 1-1,10-150)","1071-1"]
["Scores",10,5,5,5,5,5,2,5,5,0,2,0,4,4,4,0,0,1,3,65,0.7142857142857143,null,""]
["Answers","","","","","","","","","","","","","","","95% CL (0.04-0.07)","","","","98% pure"]
["Category","Freshwater/non-metal/non- plant","Paper and data unique identifier(eg. 1-1,10-150)","1071-2"]
["Scores",10,5,5,5,5,5,2,5,5,0,2,0,4,4,4,0,0,1,3,65,0.7142857142857143,null,""]
["Answers","","","","","","","","","","","","","","","95% CL  (0.1-0.2)","","","","98% pure"]
["Category","Freshwater/non-metal/non- plant","Paper and data unique identifier(eg. 1-1,10-150)","1071-3"]
["Scores",10,5,5,5,5,5,2,5,5,0,2,0,4,4,4,0,0,1,3,65,0.7142857142857143,null,""]
["Answers","","","","","","","","","","","","","","","95% CL  (0.03-0.2)","","","","98% pure"]
["Category","Freshwater/non-metal/non- plant","Paper and data unique identifier(eg. 1-1,10-150)","1071-4"]
["Scores",10,5,5,5,5,5,2,5,5,0,2,0,4,4,4,0,0,1,3,65,0.7142857142857143,null,""]
["Answers","","","","","","","","","","","","","","","95% CL (0.2-4.3)","","","","98% pure"]
["Category","Freshwater/non-metal/non- plant","Paper and data unique identifier(eg. 1-1,10-150)","1071-5"]
["Scores",10,5,5,5,5,5,2,5,5,0,2,0,4,4,4,0,0,1,3,65,0.7142857142857143,null,""]
["Answers","","","","","","","","","","","","","","","95% CL (0.1-0.2)","","","","98% pure"]
["Category","Freshwater/non-metal/non- plant","Paper and data unique identifier(eg. 1-1,10-150)","1071-6"]
["Scores",10,5,5,5,5,5,2,5,5,0,2,0,4,4,4,0,0,1,3,65,0.7142857142857143,null,""]
["Answers","","","","","","","","","","","","","","","95% CL  (0.3-1.0)","","","","98% pure"]
["Category","Freshwater/non-metal/non- plant","Paper and data unique identifier(eg. 1-1,10-150)","1071-7"]
["Scores",10,5,5,5,5,5,2,5,5,0,2,0,4,4,4,0,0,1,3,65,0.7142857142857143,null,""]
["Answers","","","","","","","","","","","","","","","95% CL  (0.08-0.1)","","","","98% pure"]
["Category","Freshwater/non-metal/non- plant","Paper and data unique identifier(eg. 1-1,10-150)","1071-8"]
["Scores",10,5,5,5,5,5,2,5,5,0,2,0,4,4,4,0,0,1,3,65,0.7142857142857143,null,""]
["Answers","","","","","","","","","","","","","","","95% CL  (0.2-0.5)","","","","98% pure"]
["Category","Freshwater/non-metal/non- plant","Paper and data unique identifier(eg. 1-1,10-150)","1071-9"]
["Scores",10,5,5,5,5,5,2,5,5,0,2,0,4,4,4,0,0,1,3,65,0.7142857142857143,null,""]
["Answers","","","","","","","","","","","","","","","95% CL (0.02-0.04)","","","","98% pure"]
["Category","Freshwater/non-metal/non- plant","Paper and data unique identifier(eg. 1-1,10-150)","1071-10"]
["Scores",10,5,5,5,5,5,2,5,5,0,2,0,4,4,4,0,0,1,3,65,0.7142857142857143,null,""]
["Answers","","","","","","","","","","","","","","","95% CL (0.07-0.1)","","","","98% pure"]
["Category","Freshwater/non-metal/non- plant","Paper and data unique identifier(eg. 1-1,10-150)","1072-1"]
["Scores",10,5,5,5,5,5,2,5,5,0,2,0,4,4,4,0,0,1,3,65,0.7142857142857143,null,""]
["Answers","","","","","","","","","","","","","","","95% CL  (0.03-0.05)","","","","98% pure"]
["Category","Freshwater/non-metal/non- plant","Paper and data unique identifier(eg. 1-1,10-150)","1072-2"]
["Scores",10,5,5,5,5,5,2,5,5,0,2,0,4,4,4,0,0,1,3,65,0.7142857142857143,null,""]
["Answers","","","","","","","","","","","","","","","95% CL   (0.1-0.3)","","","","98% pure"]
["Category","Freshwater/non-metal/non- plant","Paper and data unique identifier(eg. 1-1,10-150)","1072-3"]
["Scores",10,5,5,5,5,5,2,5,5,0,2,0,4,4,4,0,0,1,3,65,0.7142857142857143,null,""]
["Answers","","","","","","","","","","","","","","","95% CL  (0.008-0.03)","","","","98% pure"]
["Category","Freshwater/non-metal/non- plant","Paper and data unique identifier(eg. 1-1,10-150)","1072-4"]
["Scores",10,5,5,5,5,5,2,5,5,0,2,0,4,4,4,0,0,1,3,65,0.7142857142857143,null,""]
["Answers","","","","","","","","","","","","","","","95% CL  (0.07-0.3)","","","","98% pure"]
["Category","Freshwater/non-metal/non- plant","Paper and data unique identifier(eg. 1-1,10-150)","1072-5"]
["Scores",10,5,5,5,5,5,2,5,5,0,2,0,4,4,4,0,0,1,3,65,0.7142857142857143,null,""]
["Answers","","","","","","","","","","","","","","","95% CL   (0.03-0.08)","","","","98% pure"]
["Category","Freshwater/non-metal/non- plant","Paper and data unique identifier(eg. 1-1,10-150)","1072-6"]
["Scores",10,5,5,5,5,5,2,5,5,0,2,0,4,4,4,0,0,1,3,65,0.7142857142857143,null,""]
["Answers","","","","","","","","","","","","","","","95% CL  (0.1-0.5)","","","","98% pure"]
["Category","Freshwater/non-metal/non- plant","Paper and data unique identifier(eg. 1-1,10-150)","1072-7"]
["Scores",10,5,5,5,5,5,2,5,5,0,2,0,4,4,4,0,0,1,3,65,0.7142857142857143,null,""]
["Answers","","","","","","","","","","","","","","","95% CL  (0.002-0.006)","","","","98% pure"]
["Category","Freshwater/non-metal/non- plant","Paper and data unique identifier(eg. 1-1,10-150)","1072-8"]
["Scores",10,5,5,5,5,5,2,5,5,0,2,0,4,4,4,0,0,1,3,65,0.7142857142857143,null,""]
["Answers","","","","","","","","","","","","","","","95% CL  (0.01-0.05)","","","","98% pure"]
["Category","Freshwater/non-metal/non- plant","Paper and data unique identifier(eg. 1-1,10-150)","1073-1"]
["Scores",10,5,5,5,5,5,2,5,5,4,2,0,4,4,4,0,0,3,3,71,0.78021978021978022,null,""]
["Answers","","","","","","","","18.8mm, 64.8mg","","static non-renewal","","","","","95% CL 82.9-107.1","","","","98.9% pure"]
["Category","Freshwater/non-metal/non- plant","Paper and data unique identifier(eg. 1-1,10-150)","1073-2"]
["Scores",10,5,5,5,5,5,2,5,5,4,2,0,4,4,4,0,0,3,3,71,0.78021978021978022,null,""]
["Answers","","","","","","","","18.8mm, 64.8mg","","static non-renewal","","","","","95% CL 25.6-27.9","","","","98.9% pure"]
["Category","Freshwater/non-metal/non- plant","Paper and data unique identifier(eg. 1-1,10-150)","1074-1"]
["Scores",10,5,5,5,5,5,2,5,5,0,2,0,0,4,4,3,3,3,3,69,0.75824175824175821,null,""]
["Answers","","","","","","","","","","","","","","","95% CL ","","","",">98% pure"]
["Category","Freshwater/non-metal/non- plant","Paper and data unique identifier(eg. 1-1,10-150)","1075-1"]
["Scores",10,10,5,5,5,5,2,5,5,0,2,0,4,4,4,0,0,3,3,72,0.79120879120879117,null,""]
["Answers","","","","","","","","","","","","","","","","","","maintained",""]
["Category","Freshwater/non-metal/non- plant","Paper and data unique identifier(eg. 1-1,10-150)","1075-2"]
["Scores",10,10,5,5,5,5,2,5,5,0,2,0,4,4,4,0,0,3,3,72,0.79120879120879117,null,""]
["Answers","","","","","","","","","","","","","","","","","","maintained",""]
["Category","Freshwater/non-metal/non- plant","Paper and data unique identifier(eg. 1-1,10-150)","1075-3"]
["Scores",10,10,5,5,5,5,2,5,5,0,2,0,4,4,4,0,0,3,3,72,0.79120879120879117,null,""]
["Answers","","","","","","","","","","","","","","","","","","maintained",""]
["Category","Freshwater/non-metal/non- plant","Paper and data unique identifier(eg. 1-1,10-150)","1076-1"]
["Scores",10,10,5,5,5,5,2,0,5,0,2,0,4,4,4,3,3,3,3,73,0.80219780219780223,null,""]
["Answers","","","","","","","","","","","","","","","95% CL (126.40-163.43)","","","","98.7% pure"]
["Category","Freshwater/non-metal/non- plant","Paper and data unique identifier(eg. 1-1,10-150)","1079-1"]
["Scores",10,5,5,5,5,5,2,5,5,4,2,0,4,4,4,1,3,3,3,75,0.82417582417582413,null,""]
["Answers","","","","","","","","","","static","","","","","95% CL (5.1–23.4)","","","",">95% pure"]
["Category","Freshwater/non-metal/non- plant","Paper and data unique identifier(eg. 1-1,10-150)","1079-2"]
["Scores",10,5,5,5,5,5,2,5,5,4,2,0,4,4,4,1,3,3,3,75,0.82417582417582413,null,""]
["Answers","","","","","","","","","","static","","","","","95% CL (11.1–27.9)","","","",">95% pure"]
["Category","Freshwater/non-metal/non- plant","Paper and data unique identifier(eg. 1-1,10-150)","1080-1"]
["Scores",10,10,0,0,5,0,0,5,5,4,2,0,4,0,0,0,0,1,3,49,0.53846153846153844,null,""]
["Answers","","","","","","","","","","static","","","","","","","","","98.2% pure"]
["Category","Freshwater/non-metal/non- plant","Paper and data unique identifier(eg. 1-1,10-150)","1080-2"]
["Scores",10,10,0,0,5,0,0,5,5,4,2,0,4,0,0,0,0,1,3,49,0.53846153846153844,null,""]
["Answers","","","","","","","","","","static","","","","","","","","","98.2% pure"]
["Category","Freshwater/non-metal/non- plant","Paper and data unique identifier(eg. 1-1,10-150)","1080-3"]
["Scores",10,10,0,0,5,0,0,5,5,4,2,0,4,0,0,0,0,1,3,49,0.53846153846153844,null,""]
["Answers","","","","","","","","","","static","","","","","","","","","98.2% pure"]
["Category","Freshwater/non-metal/non- plant","Paper and data unique identifier(eg. 1-1,10-150)","1080-4"]
["Scores",10,10,0,0,5,0,0,5,5,4,2,0,4,0,0,0,0,1,3,49,0.53846153846153844,null,""]
["Answers","","","","","","","","","","static","","","","","","","","","98.2% pure"]
["Category","Freshwater/non-metal/non- plant","Paper and data unique identifier(eg. 1-1,10-150)","1081-1"]
["Scores",10,10,5,5,5,5,2,5,5,4,2,0,4,4,4,0,0,1,3,74,0.81318681318681318,null,""]
["Answers","","no movement when touched","","","","","","","","static","","","","","95% CL (7.97–15.14)","","","","95% pure"]
["Category","Freshwater/non-metal/non- plant","Paper and data unique identifier(eg. 1-1,10-150)","1081-2"]
["Scores",10,10,5,5,5,5,2,5,5,4,2,0,4,4,4,0,0,1,3,74,0.81318681318681318,null,""]
["Answers","","no movement when touched","","","","","","","","static","","","","","95% CL  (91.77–843.22)","","","","95% pure"]
["Category","Freshwater/non-metal/non- plant","Paper and data unique identifier(eg. 1-1,10-150)","1081-3"]
["Scores",10,10,5,5,5,5,2,5,5,4,2,0,4,4,4,0,0,1,3,74,0.81318681318681318,null,""]
["Answers","","no movement when touched","","","","","","","","static","","","","","95% CL (10.07–25.98)","","","","95% pure"]
["Category","Freshwater/non-metal/non- plant","Paper and data unique identifier(eg. 1-1,10-150)","1081-4"]
["Scores",10,10,5,5,5,5,2,5,5,4,2,0,4,4,4,0,0,1,3,74,0.81318681318681318,null,""]
["Answers","","no movement when touched","","","","","","","","static","","","","","95% CL (13.81–2415.94)","","","","95% pure"]
["Category","Freshwater/non-metal/non- plant","Paper and data unique identifier(eg. 1-1,10-150)","1081-5"]
["Scores",10,10,5,5,5,5,2,5,5,4,2,0,4,4,4,0,0,1,3,74,0.81318681318681318,null,""]
["Answers","","no movement when touched","","","","","","","","static","","","","","95% CL (0.51–1.33)","","","","95% pure"]
["Category","Freshwater/non-metal/non- plant","Paper and data unique identifier(eg. 1-1,10-150)","1081-6"]
["Scores",10,10,5,5,5,5,2,5,5,4,2,0,4,4,4,0,0,1,3,74,0.81318681318681318,null,""]
["Answers","","no movement when touched","","","","","","","","static","","","","","95% CL (2.89–4.66)","","","","95% pure"]
["Category","Freshwater/non-metal/non- plant","Paper and data unique identifier(eg. 1-1,10-150)","1081-7"]
["Scores",10,10,5,5,5,5,2,5,5,4,2,0,4,4,4,0,0,1,3,74,0.81318681318681318,null,""]
["Answers","","no movement when touched","","","","","","","","static","","","","","95% CL (1.70–2.49)","","","","95% pure"]
["Category","Freshwater/non-metal/non- plant","Paper and data unique identifier(eg. 1-1,10-150)","1081-8"]
["Scores",10,10,5,5,5,5,2,5,5,4,2,0,4,4,4,0,0,1,3,74,0.81318681318681318,null,""]
["Answers","","no movement when touched","","","","","","","","static","","","","","95% CL (3.87–4.90)","","","","95% pure"]
["Category","Freshwater/non-metal/non- plant","Paper and data unique identifier(eg. 1-1,10-150)","1082-1"]
["Scores",10,10,0,0,5,5,2,5,5,0,2,0,4,4,4,0,0,1,3,60,0.65934065934065933,null,""]
["Answers","","","","","","","","","","","","","","","","","","","98% pure"]
["Category","Freshwater/non-metal/non- plant","Paper and data unique identifier(eg. 1-1,10-150)","1083-1"]
["Scores",10,5,0,0,5,5,0,5,5,0,2,0,0,0,0,0,0,0,3,40,0.43956043956043955,null,""]
["Answers","","","","","","","","","","","","","","","","","","","97.5% pure"]
["Category","Freshwater/non-metal/non- plant","Paper and data unique identifier(eg. 1-1,10-150)","1083-2"]
["Scores",10,5,0,0,5,5,0,5,5,0,2,0,0,0,0,0,0,0,3,40,0.43956043956043955,null,""]
["Answers","","","","","","","","","","","","","","","","","","","97.5% pure"]
["Category","Freshwater/non-metal/non- plant","Paper and data unique identifier(eg. 1-1,10-150)","1083-3"]
["Scores",10,5,0,0,5,5,0,5,5,0,2,0,0,0,0,0,0,0,3,40,0.43956043956043955,null,""]
["Answers","","","","","","","","","","","","","","","","","","","97.5% pure"]
["Category","Freshwater/non-metal/non- plant","Paper and data unique identifier(eg. 1-1,10-150)","1083-4"]
["Scores",10,5,5,5,5,5,0,5,5,0,2,0,0,4,4,0,0,0,3,58,0.63736263736263732,null,""]
["Answers","","","","","","","","","","","","","","","95% CL (0.685–0.903 x 10–4)","","","","97.5% pure"]
["Category","Freshwater/non-metal/non- plant","Paper and data unique identifier(eg. 1-1,10-150)","1083-5"]
["Scores",10,5,5,5,5,5,0,5,5,0,2,0,4,4,4,0,0,0,3,62,0.68131868131868134,null,""]
["Answers","","","","","","","","","","","","","","","95% CL  (12.75–14.26)","","","","97.5% pure"]
["Category","Freshwater/non-metal/non- plant","Paper and data unique identifier(eg. 1-1,10-150)","1085-1"]
["Scores",10,10,0,0,5,5,2,5,5,0,2,0,4,0,0,0,0,1,0,49,0.53846153846153844,null,""]
["Answers","","","","","","","","","","","","","","","","","","",""]
["Category","Freshwater/non-metal/non- plant","Paper and data unique identifier(eg. 1-1,10-150)","1085-2"]
["Scores",10,10,0,0,5,5,2,5,5,0,2,0,4,0,0,0,0,1,0,49,0.53846153846153844,null,""]
["Answers","","","","","","","","","","","","","","","","","","",""]
["Category","Freshwater/non-metal/non- plant","Paper and data unique identifier(eg. 1-1,10-150)","1085-3"]
["Scores",10,10,0,0,5,5,2,5,5,0,2,0,4,0,0,0,0,1,0,49,0.53846153846153844,null,""]
["Answers","","","","","","","","","","","","","","","","","","",""]
["Category","Freshwater/non-metal/non- plant","Paper and data unique identifier(eg. 1-1,10-150)","1086-1"]
["Scores",10,5,5,5,5,5,5,0,5,0,2,0,4,4,4,0,0,3,3,65,0.7142857142857143,null,""]
["Answers","","","","","","","","","","","","","","","95% CL (1343-1889)","","","",""]
["Category","Freshwater/non-metal/non- plant","Paper and data unique identifier(eg. 1-1,10-150)","1086-2"]
["Scores",10,5,5,5,5,5,5,0,5,0,2,0,4,4,4,0,0,3,3,65,0.7142857142857143,null,""]
["Answers","","","","","","","","","","","","","","","95% CL (1461-2037)","","","",""]
["Category","Freshwater/non-metal/non- plant","Paper and data unique identifier(eg. 1-1,10-150)","1086-3"]
["Scores",10,5,5,5,5,5,5,0,5,0,2,0,4,4,4,0,0,3,3,65,0.7142857142857143,null,""]
["Answers","","","","","","","","","","","","","","","95% CL (646-829)","","","",""]
["Category","Freshwater/non-metal/non- plant","Paper and data unique identifier(eg. 1-1,10-150)","1086-4"]
["Scores",10,5,5,5,5,5,5,0,5,0,2,0,4,4,4,0,0,3,3,65,0.7142857142857143,null,""]
["Answers","","","","","","","","","","","","","","","95% CL (648-816)","","","",""]
["Category","Freshwater/non-metal/non- plant","Paper and data unique identifier(eg. 1-1,10-150)","1086-5"]
["Scores",10,5,5,5,5,5,5,0,5,0,2,0,4,4,4,0,0,3,3,65,0.7142857142857143,null,""]
["Answers","","","","","","","","","","","","","","","95% CL (23.3-36.0)","","","",""]
["Category","Freshwater/non-metal/non- plant","Paper and data unique identifier(eg. 1-1,10-150)","1086-6"]
["Scores",10,5,5,5,5,5,5,0,5,0,2,0,4,4,4,0,0,3,3,65,0.7142857142857143,null,""]
["Answers","","","","","","","","","","","","","","","95% CL (23.3-36.0)","","","",""]
["Category","Freshwater/non-metal/non- plant","Paper and data unique identifier(eg. 1-1,10-150)","1086-7"]
["Scores",10,5,5,5,5,5,5,0,5,0,2,0,4,4,4,0,0,3,3,65,0.7142857142857143,null,""]
["Answers","","","","","","","","","","","","","","","95% CL (23.3-36.0)","","","",""]
["Category","Freshwater/non-metal/non- plant","Paper and data unique identifier(eg. 1-1,10-150)","1086-8"]
["Scores",10,5,5,5,5,5,5,0,5,0,2,0,4,4,4,0,0,3,3,65,0.7142857142857143,null,""]
["Answers","","","","","","","","","","","","","","","95% CL (348-603)","","","",""]
["Category","Freshwater/non-metal/non- plant","Paper and data unique identifier(eg. 1-1,10-150)","1086-9"]
["Scores",10,5,5,5,5,5,5,0,5,0,2,0,4,4,4,0,0,3,3,65,0.7142857142857143,null,""]
["Answers","","","","","","","","","","","","","","","95% CL (769-1667)","","","",""]
["Category","Freshwater/non-metal/non- plant","Paper and data unique identifier(eg. 1-1,10-150)","1086-10"]
["Scores",10,5,5,5,5,5,5,0,5,0,2,0,4,4,4,0,0,3,3,65,0.7142857142857143,null,""]
["Answers","","","","","","","","","","","","","","","95% CL (37.3-72.0)","","","",""]
["Category","Freshwater/non-metal/non- plant","Paper and data unique identifier(eg. 1-1,10-150)","1086-11"]
["Scores",10,5,5,5,5,5,5,0,5,0,2,0,4,4,4,0,0,3,3,65,0.7142857142857143,null,""]
["Answers","","","","","","","","","","","","","","","95% CL (76.0-146)","","","",""]
["Category","Freshwater/non-metal/non- plant","Paper and data unique identifier(eg. 1-1,10-150)","1086-12"]
["Scores",10,5,5,5,5,5,5,0,5,0,2,0,4,4,4,0,0,3,3,65,0.7142857142857143,null,""]
["Answers","","","","","","","","","","","","","","","95% CL (107-208)","","","",""]
["Category","Freshwater/non-metal/non- plant","Paper and data unique identifier(eg. 1-1,10-150)","1086-13"]
["Scores",10,5,5,5,5,5,5,0,5,0,2,0,4,4,4,0,0,3,3,65,0.7142857142857143,null,""]
["Answers","","","","","","","","","","","","","","","95% CL (196-568)","","","",""]
["Category","Freshwater/non-metal/non- plant","Paper and data unique identifier(eg. 1-1,10-150)","1086-14"]
["Scores",10,5,5,5,5,5,5,0,5,0,2,0,4,4,4,0,0,3,3,65,0.7142857142857143,null,""]
["Answers","","","","","","","","","","","","","","","95% CL (36.5-93.5)","","","",""]
["Category","Freshwater/non-metal/non- plant","Paper and data unique identifier(eg. 1-1,10-150)","1086-15"]
["Scores",10,5,5,5,5,5,5,0,5,0,2,0,4,4,4,0,0,3,3,65,0.7142857142857143,null,""]
["Answers","","","","","","","","","","","","","","","95% CL ","","","",""]
["Category","Freshwater/non-metal/non- plant","Paper and data unique identifier(eg. 1-1,10-150)","1086-16"]
["Scores",10,5,5,5,5,5,5,0,5,0,2,0,4,4,4,0,0,3,3,65,0.7142857142857143,null,""]
["Answers","","","","","","","","","","","","","","","95% CL (478-742)","","","",""]
["Category","Freshwater/non-metal/non- plant","Paper and data unique identifier(eg. 1-1,10-150)","1086-17"]
["Scores",10,5,5,5,5,5,5,0,5,0,2,0,4,4,4,0,0,3,3,65,0.7142857142857143,null,""]
["Answers","","","","","","","","","","","","","","","95% CL","","","",""]
["Category","Freshwater/non-metal/non- plant","Paper and data unique identifier(eg. 1-1,10-150)","1086-18"]
["Scores",10,5,5,5,5,5,5,0,5,0,2,0,4,4,4,0,0,3,3,65,0.7142857142857143,null,""]
["Answers","","","","","","","","","","","","","","","95% CL","","","",""]
["Category","Freshwater/non-metal/non- plant","Paper and data unique identifier(eg. 1-1,10-150)","1086-19"]
["Scores",10,5,5,5,5,5,5,0,5,0,2,0,4,4,4,0,0,3,3,65,0.7142857142857143,null,""]
["Answers","","","","","","","","","","","","","","","95% CL","","","",""]
["Category","Freshwater/non-metal/non- plant","Paper and data unique identifier(eg. 1-1,10-150)","1086-20"]
["Scores",10,5,5,5,5,5,5,0,5,0,2,0,4,4,4,0,0,3,3,65,0.7142857142857143,null,""]
["Answers","","","","","","","","","","","","","","","95% CL","","","",""]
["Category","Freshwater/non-metal/non- plant","Paper and data unique identifier(eg. 1-1,10-150)","1086-21"]
["Scores",10,5,5,5,5,5,5,0,5,0,2,0,4,4,4,0,0,3,3,65,0.7142857142857143,null,""]
["Answers","","","","","","","","","","","","","","","95% CL","","","",""]
["Category","Freshwater/non-metal/non- plant","Paper and data unique identifier(eg. 1-1,10-150)","1086-22"]
["Scores",10,5,5,5,5,5,5,0,5,0,2,0,4,4,4,0,0,3,3,65,0.7142857142857143,null,""]
["Answers","","","","","","","","","","","","","","","95% CL (84.6-119)","","","",""]
["Category","Freshwater/non-metal/non- plant","Paper and data unique identifier(eg. 1-1,10-150)","1086-23"]
["Scores",10,5,5,5,5,5,5,0,5,0,2,0,4,4,4,0,0,3,3,65,0.7142857142857143,null,""]
["Answers","","","","","","","","","","","","","","","95% CL (94.2-135)","","","",""]
["Category","Freshwater/non-metal/non- plant","Paper and data unique identifier(eg. 1-1,10-150)","1086-24"]
["Scores",10,5,5,5,5,5,5,0,5,0,2,0,4,4,4,0,0,3,3,65,0.7142857142857143,null,""]
["Answers","","","","","","","","","","","","","","","95% CL ","","","",""]
["Category","Freshwater/non-metal/non- plant","Paper and data unique identifier(eg. 1-1,10-150)","1086-25"]
["Scores",10,5,5,5,5,5,5,0,5,0,2,0,4,4,4,0,0,3,3,65,0.7142857142857143,null,""]
["Answers","","","","","","","","","","","","","","","95% CL ","","","",""]
["Category","Freshwater/non-metal/non- plant","Paper and data unique identifier(eg. 1-1,10-150)","1086-26"]
["Scores",10,5,5,5,5,5,5,0,5,0,2,0,4,4,4,0,0,3,3,65,0.7142857142857143,null,""]
["Answers","","","","","","","","","","","","","","","95% CL (417-788)","","","",""]
["Category","Freshwater/non-metal/non- plant","Paper and data unique identifier(eg. 1-1,10-150)","1086-27"]
["Scores",10,5,5,5,5,5,5,0,5,0,2,0,4,4,4,0,0,3,3,65,0.7142857142857143,null,""]
["Answers","","","","","","","","","","","","","","","95% CL (1218-2668)","","","",""]
["Category","Freshwater/non-metal/non- plant","Paper and data unique identifier(eg. 1-1,10-150)","1086-28"]
["Scores",10,5,5,5,5,5,5,0,5,0,2,0,4,4,4,0,0,3,3,65,0.7142857142857143,null,""]
["Answers","","","","","","","","","","","","","","","95% CL  (531-756)","","","",""]
["Category","Freshwater/non-metal/non- plant","Paper and data unique identifier(eg. 1-1,10-150)","1086-29"]
["Scores",10,5,5,5,5,5,5,0,5,0,2,0,4,4,4,0,0,3,3,65,0.7142857142857143,null,""]
["Answers","","","","","","","","","","","","","","","95% CL","","","",""]
["Category","Freshwater/non-metal/non- plant","Paper and data unique identifier(eg. 1-1,10-150)","1086-30"]
["Scores",10,5,5,5,5,5,5,0,5,0,2,0,4,4,4,0,0,3,3,65,0.7142857142857143,null,""]
["Answers","","","","","","","","","","","","","","","95% CL (210-338)","","","",""]
["Category","Freshwater/non-metal/non- plant","Paper and data unique identifier(eg. 1-1,10-150)","1086-30"]
["Scores",10,5,5,5,5,5,5,0,5,0,2,0,4,4,4,0,0,3,3,65,0.7142857142857143,null,""]
["Answers","","","","","","","","","","","","","","","95% CL","","","",""]
["Category","Freshwater/non-metal/non- plant","Paper and data unique identifier(eg. 1-1,10-150)","1087-1"]
["Scores",10,10,5,5,5,5,2,5,5,0,2,0,0,4,0,3,3,3,3,70,0.76923076923076927,null,""]
["Answers","","","","","","","US EPA","age","","","","","","","","only measured not stated","above 7.0mg/L","","98% pure"]
["Category","Freshwater/non-metal/non- plant","Paper and data unique identifier(eg. 1-1,10-150)","1087-2"]
["Scores",10,10,5,5,5,5,2,5,5,0,2,0,0,4,0,3,3,3,3,70,0.76923076923076927,null,""]
["Answers","","","","","","","US EPA","age","","","","","","","","only measured not stated","above 7.0mg/L","","98% pure"]
["Category","Freshwater/non-metal/non- plant","Paper and data unique identifier(eg. 1-1,10-150)","1087-3"]
["Scores",10,10,5,5,5,5,2,5,5,0,2,0,0,4,0,3,3,3,3,70,0.76923076923076927,null,""]
["Answers","","","","","","","US EPA","age","","","","","","","","only measured not stated","above 7.0mg/L","","98% pure"]
["Category","Freshwater/non-metal/non- plant","Paper and data unique identifier(eg. 1-1,10-150)","1087-4"]
["Scores",10,10,5,5,5,5,2,5,5,0,2,0,0,4,0,3,3,3,3,70,0.76923076923076927,null,""]
["Answers","","","","","","","US EPA","age","","","","","","","","only measured not stated","above 7.0mg/L","","98% pure"]
["Category","Freshwater/non-metal/non- plant","Paper and data unique identifier(eg. 1-1,10-150)","1087-5"]
["Scores",10,10,5,5,5,5,2,5,5,0,2,0,0,4,4,3,3,3,3,74,0.81318681318681318,null,""]
["Answers","","","","","","","US EPA","age","","","","","","","","only measured not stated","above 7.0mg/L","","98% pure"]
["Category","Freshwater/non-metal/non- plant","Paper and data unique identifier(eg. 1-1,10-150)","1087-6"]
["Scores",10,10,5,5,5,5,2,5,5,0,2,0,0,4,4,3,3,3,3,74,0.81318681318681318,null,""]
["Answers","","","","","","","US EPA","age","","","","","","","","only measured not stated","above 7.0mg/L","","98% pure"]
["Category","Freshwater/non-metal/non- plant","Paper and data unique identifier(eg. 1-1,10-150)","1087-7"]
["Scores",10,10,5,5,5,5,2,5,5,0,2,0,0,4,4,3,3,3,3,74,0.81318681318681318,null,""]
["Answers","","","","","","","US EPA","age","","","","","","","","only measured not stated","above 7.0mg/L","","98% pure"]
["Category","Freshwater/non-metal/non- plant","Paper and data unique identifier(eg. 1-1,10-150)","1087-8"]
["Scores",10,10,5,5,5,5,2,5,5,0,2,0,0,4,0,3,3,3,3,70,0.76923076923076927,null,""]
["Answers","","","","","","","US EPA","age","","","","","","","","only measured not stated","above 7.0mg/L","","98% pure"]
["Category","Freshwater/non-metal/non- plant","Paper and data unique identifier(eg. 1-1,10-150)","1090-1"]
["Scores",10,10,5,5,5,5,0,5,5,4,2,0,0,4,4,3,3,3,3,76,0.8351648351648352,null,""]
["Answers","","","","","","","","","","","","","","","95% CL (173.7–272.4)","","","","97.6% pure"]
["Category","Freshwater/non-metal/non- plant","Paper and data unique identifier(eg. 1-1,10-150)","1093-1"]
["Scores",10,10,5,5,5,5,5,5,5,4,4,0,0,4,4,1,1,1,3,77,0.84615384615384615,null,""]
["Answers","","movements of the labral fans","","","","","Tests were considered valid if control mortality was<10%.","","","non renewal","once beginning, once ending","","","","95% CL (0.6-0.7)","only measured but not stated","only measured but not stated","","98% pure"]
["Category","Freshwater/non-metal/non- plant","Paper and data unique identifier(eg. 1-1,10-150)","1093-2"]
["Scores",10,10,5,5,5,5,5,5,5,4,4,0,0,4,4,1,1,1,3,77,0.84615384615384615,null,""]
["Answers","","Mortality (lack ofmovement after prodding)\nwas assessed at 24-h intervals over the course of the experiment.","","","","","Tests were considered valid if control mortality was<10%.","","","static non renewal","once beginning, once ending","","","","95% CL (87.2-179.24)","only measured but not stated","only measured but not stated","","98% pure"]
["Category","Freshwater/non-metal/non- plant","Paper and data unique identifier(eg. 1-1,10-150)","1093-3"]
["Scores",10,10,5,5,5,5,5,5,5,4,4,0,0,4,4,1,1,1,3,77,0.84615384615384615,null,""]
["Answers","","","","","","","Tests were considered valid if control mortality was<10%.","","","static renewed after 48hr","once beginning, once ending","","","","95% CL (660.0-1090.0)","only measured but not stated","only measured but not stated","","98% pure"]
["Category","Freshwater/non-metal/non- plant","Paper and data unique identifier(eg. 1-1,10-150)","1085-1-OK"]
["Scores",0,5,0,0,5,5,0,5,5,4,0,0,0,0,0,0,0,3,0,32,0.35164835164835168,null,"The highest possible grade for this datum is acceptable."]
["Answers","","Mortality","","","Ethanol negative control and no toxicant control","Triplicate","Not stated","96 hours post fertilisation larvae","Essential medium (EM)","Solutions renewed every 24 hours","Not stated","None","None","None","None","","","28 ± 1 °C","None"]
["Category","Freshwater/non-metal/non- plant","Paper and data unique identifier(eg. 1-1,10-150)","1080-1RS"]
["Scores",10,5,5,5,5,5,0,5,0,4,0,0,4,4,4,0,0,1,3,60,0.65934065934065933,null,"The highest possible grade for this datum is acceptable."]
["Answers","5 days","","EC50","EC50","","triplicates","","~ 1–2 h postfertilization (hpf; 8–64 cell stage).","","static renewal","","","observable","logistic regression","standard error","","","28.5 C in\na temperature-controlled incubator.",0.98199999999999998]
["Category","Freshwater/non-metal/non- plant","Paper and data unique identifier(eg. 1-1,10-150)","1080-1RS"]
["Scores",10,5,0,5,5,5,0,5,0,4,0,0,0,0,4,0,0,1,3,47,0.51648351648351654,null,"The highest possible grade for this datum is acceptable."]
["Answers","5 days","Survival","NOEC","73-100% Survival","","triplicates","","~ 1–2 h postfertilization (hpf; 8–64 cell stage).","","static renewal","","","","Kruskal Wallis","p > 0.05","","","28.5 C in\na temperature-controlled incubator.",0.98199999999999998]
["Category","Freshwater/non-metal/non- plant","Paper and data unique identifier(eg. 1-1,10-150)","1080-1RS"]
["Scores",10,5,5,5,5,5,0,5,0,4,0,0,0,0,4,0,0,1,3,52,0.5714285714285714,null,"The highest possible grade for this datum is acceptable."]
["Answers","5 days","Survival","LOEC","7% Survival","solvent control indicated in Figure 2","triplicates. Replication of controls not mentioned however results of controls with error bars are presented in Figure 2","","~ 1–2 h postfertilization (hpf; 8–64 cell stage).","","static renewal","","","","Kruskal Wallis","p > 0.05","","","28.5 C in\na temperature-controlled incubator.",0.98199999999999998]
["Category","Freshwater/non-metal/non- plant","Paper and data unique identifier(eg. 1-1,10-150)","??-1"]
["Scores",10,10,5,5,5,5,5,5,5,4,0,4,0,4,4,1,1,1,3,77,0.84615384615384615,null,"The highest possible grade for this datum is acceptable."]
["Answers","48 hours","Mobility of larvae was assessed. Larvae were defined as normal when it was swimming or crawling on the bottom. If a larva curled up or was inactive, it was also considered normal if it stretched its legs and abdomen shortly after the test solution was stirred gently with a glass pipette. The larva that did not exhibit the response could be equated as moribund on the basis of our temporal observations (data not shown).","EC",50,"Twenty larvae used for the control also","Twenty larvae used at each concentration","Immobility of the control larvae was less than 5% (mean SE: 0.4% 1.46%).","First-instar larvae","Dechlorinated tap water","The test solution was not changed or aerated during the test.","In the present study, we did not measure the concentration of insecticide in the test solutions. The ECx values were calculated on the basis of nominal concentrations.","To evaluate the reproducibility of this test method, toxicity tests for the organophosphate fenitrothion were replicated 6 times using newly hatched larvae from different egg masses in F10 to F12 generations.","Not for fipronil…","Using a logit model in the PROC PROBIT procedure of version 9.13 of SAS software","95% confidence limits","Was checked before and after each test.","Was checked before and after each test.","All examinations were conducted in a room at constant temperature (20°C).","All chemicals were of analytical grade - fipronil 98% pure"]
["Category","Freshwater/non-metal/non- plant","Paper and data unique identifier(eg. 1-1,10-150)","xxxx-1"]
["Scores",10,5,5,5,5,5,5,5,5,0,0,0,0,4,0,0,0,3,3,60,0.65934065934065933,null,"The highest possible grade for this datum is acceptable."]
["Answers","24-hours","Mortality","LC","50% and 95%","Control treatments with 0.5 uL of acetone alone.","Replicated three times","Control treatments with 0.5\u0001l of acetone alone which consistently gave control mortality rates of <10%.","First-instar larvae were used in all larval assays, and 5- to 7-d-old females were used for all adult assays.","Distilled water","Assumed static","Not stated that they were measured","Not stated","Not stated for adult tests","LD50/LD95 values were calculated using the PoloPlus program.","No estimate of variability provided.","Not stated","Not stated","26-27*C","Technical grade"]
["Category","Freshwater/non-metal/non- plant","Paper and data unique identifier(eg. 1-1,10-150)","xxxx-2"]
["Scores",10,10,5,5,5,5,0,5,5,0,0,0,4,4,4,0,0,3,3,68,0.74725274725274726,null,"The highest possible grade for this datum is acceptable."]
["Answers","24-hours","Mortality - larvae that showed no movement in the well after manual disturbance of water and food by a pipette tip were scored as dead.","LC","50% and 95%","Control treatments with 10 uL of acetone alone.","Two replicates were used in each larval assay","Not stated for larval tests","First-instar larvae (24-hours after hatch) were used in all larval assays, and 5- to 7-d-old females were used for all adult assays.","Deionised water","Assumed static","Not stated that they were measured","Not stated","Table 2","LC50/LC95 values were calculated using the PoloPlus program.","Estimate of variability provided in Table 3.","Not stated","Not stated","26-27*C","Technical grade"]
["Category","Freshwater/non-metal/non- plant","Paper and data unique identifier(eg. 1-1,10-150)","yyyy-1"]
["Scores",10,5,5,5,5,5,0,5,5,0,0,0,4,4,4,0,0,3,3,63,0.69230769230769229,null,"The highest possible grade for this datum is acceptable."]
["Answers","48-hours","Larval mortality","LC","50% and 90%","Each concentration was replicated 3\ntimes, and 3 untreated controls receiving only 1 ml of acetone","Untreated controls receiving only 1 ml of acetone","Control mortality not stated or shown - methods say that treatments were corrected for control mortalities, but actual control mortalities are unknown.","Larvae, late 4th instar","Tap water","Assumed static","Not stated that they were measured","Not stated","Not observable , but stated in statistical analysis","Log dose probit regression analysis","95% CL","Not stated","Not stated","28 +/- 3*C","Fipronil (97.l%),"]
["Category","Freshwater/non-metal/non- plant","Paper and data unique identifier(eg. 1-1,10-150)","yyyy-2"]
["Scores",10,5,5,5,5,5,0,5,5,0,0,0,4,4,4,0,0,3,3,63,0.69230769230769229,null,"The highest possible grade for this datum is acceptable."]
["Answers","48-hours","Larval mortality","LC","50% and 90%","Each concentration was replicated 3\ntimes, and 3 untreated controls receiving only 1 ml of acetone","Untreated controls receiving only 1 ml of acetone","Control mortality not stated or shown - methods say that treatments were corrected for control mortalities, but actual control mortalities are unknown.","Larvae, late 4th instar","Tap water","Assumed static","Not stated that they were measured","Not stated","Not observable , but stated in statistical analysis","Log dose probit regression analysis","95% CL","Not stated","Not stated","28 +/- 3*C","Fipronil (97.l%),"]

{"sheet":"FW metal plant","index":9,"n_rows":87,"n_cols":53,"rows_kept":87,"cut":false,"hidden":false,"merged":[[3,4,7,4],[9,2,9,4],[11,2,13,2],[11,7,13,7],[14,2,16,2],[14,7,16,7],[17,2,19,2],[17,7,19,7],[20,2,21,2],[20,7,21,7],[22,2,24,2],[22,7,24,7],[25,2,27,2],[25,7,27,7],[28,2,30,2],[28,7,30,7],[31,2,33,2],[31,7,33,7],[34,2,36,2],[34,7,36,7],[37,2,39,2],[37,7,39,7],[40,2,42,2],[40,7,42,7],[43,2,45,2],[43,7,45,7],[46,2,48,2],[46,7,48,7],[49,2,51,2],[49,7,51,7],[71,2,74,2],[71,7,74,7],[52,2,54,2],[52,7,54,7],[68,2,70,2],[68,7,70,7],[65,7,67,7],[56,7,58,7],[59,7,61,7],[62,7,64,7]]}
[null,1,"Fill in the blank cells below, based on information provided in the paper being assessed. You can either pick an option from the dropdown list or add the appropriate detail using the 'Add to list' button. ",null,null,null,null,null,null,null,null,null,null,null,"* All the text in RED are used for drop down list ,make changes with caution."]
[null,null,"Category",{"$f":"IF(AF3=\"\",0,1)","v":0},"Freshwater/metal/plant",{"$f":"IF(E3=\"\",0,1)","v":0},"Citation No.",{"$f":"IF(ISERROR(FIND(\"-\",E3)),E3,LEFT(E3,FIND(\"-\",E3)-1))","v":0},null,"Taxonomic group",null,null,null,null,"Species",null,null,"Lifestage",null,null,"Exposure duration",null,null,"Measure of toxicity",null,null,"Toxicity endpoint",null,null,"Taxonomic group",null,null,"Phylum",null,null,"Class",null,null,"Media",null,null,"Temperature ",null,null,"Acute Or Chronic",null,null,"PH",null,null,"Salinity/Comdictivity"]
[null,null,"Paper and data unique identifier(eg. 1-1,10-150)",{"$f":"IF(AI3=\"\",0,1)","v":0},null,{"$f":"IF(E4=\"\",0,1)","v":0},"Species (Scientific name)",null,null,"Phylum",null,null,null,null,"Aedes albopictus",0,{"$f":"IF(P3=0,\"\",INDEX(O3:O108,P3))","v":""},"1 month",0,{"$f":"IF(S3=0,\"\",INDEX(R3:R108,S3))","v":""},"11 hour",0,{"$f":"IF(V3=0,\"\",INDEX(U3:U108,V3))","v":""},"LC50",0,{"$f":"IF(Y3=0,\"\",INDEX(X3:X108,Y3))","v":""},"Mortality",0,{"$f":"IF(AB3=0,\"\",INDEX(AA3:AA108,AB3))","v":""},"Fish ",0,{"$f":"IF(AE3=0,\"\",INDEX(AD3:AD108,AE3))","v":""},"Chlorophyta",0,{"$f":"IF(AH3=0,\"\",INDEX(AG3:AG108,AH3))","v":""},"Branchiopoda",0,{"$f":"IF(AK3=0,\"\",INDEX(AJ3:AJ108,AK3))","v":""},"Freshwater",0,{"$f":"IF(AN3=0,\"\",INDEX(AM3:AM108,AN3))","v":""},"15°C",0,{"$f":"IF(AQ3=0,\"\",INDEX(AP3:AP108,AQ3))","v":""},"Acute ",0,{"$f":"IF(AT3=0,\"\",INDEX(AS3:AS108,AT3))","v":""},"N.A.",0,{"$f":"IF(AW3=0,\"\",INDEX(AV3:AV108,AW3))","v":""},"Salinity1",null,"N.A."]
[null,null,"Citation",{"$f":"IF(AL3=\"\",0,1)","v":0},null,{"$f":"IF(H8=\"\",0,1)","v":0},"Lifestage",null,null,"Class",null,null,null,null,"Australian Bass",null,null,"1 year old",null,null,"13 days",null,null,"N.A.",null,null,"N.A.",null,null,"Microalga",null,null,"N.A.",null,null,"Chlorophyceae",null,null,"Marinewater",null,null,"25°C",null,null,"Chronic",null,null,"PH11",null,null,"Salinity2"]
[null,null,null,{"$f":"IF(AO3=\"\",0,1)","v":0},null,{"$f":"IF(AX3=\"\",0,1)","v":0},"Exposure duration",null,null,"Media",null,null,null,null,"N.A.",null,null,"N.A.",null,null,"N.A.",null,null,"NOEC",null,null,"Reproduction",null,null,"N.A.",null,null,"Tracheophyta",null,null,"N.A.",null,null,"N.A.",null,null,"N.A.",null,null,"N.A.",null,null,"PH7.0 "]
[null,null,null,{"$f":"IF(AR3=\"\",0,1)","v":0},null,{"$f":"IF(Q3=\"\",0,1)","v":0},"Measure of toxicity",null,null,"Temperature "]
[null,null,null,{"$f":"IF(AU3=\"\",0,1)","v":0},null,{"$f":"IF(T3=\"\",0,1)","v":0},"Toxicity endpoint",null,null,"Acute Or Chronic "]
[null,null,null,null,null,{"$f":"IF(W3=\"\",0,1)","v":0},"Toxicity value",null,null,"PH"]
[null,2,"Select the appropriate answer option to each question. Comments can be added to the cells in column H.",null,null,{"$f":"IF(Z3=\"\",0,1)","v":0},null,null,null,"Salinity/Conductivity","N.A."]
[null,"*","If the selected answer option does not work try clicking on any other cell first and then click back on the answer option again.",null,null,{"$f":"IF(AC3=\"\",0,1)","v":0}]
[null,"No.","Question","Marks Awarded","Answer Options","Option References","Scores","Answers"]
[null,null,"Was the duration of the exposure stated (e.g. 48 or 96 h)?",10,null,0,{"$f":"IF(F15=0,0,INDEX($D12:$D13,F12,1))","v":0}]
[null,1,null,0]
[]
[null,null,"Was the biological endpoint (e.g., immobilization or population growth) stated and defined (10 marks)? Award 5 marks if the biological endpoint is only stated.",10,null,0,{"$f":"IF(F15=0,0,INDEX($D15:$D17,F15,1))","v":0}]
[null,2,null,5]
[null,null,null,0]
[null,null,"Was the biological effect stated (e.g. LC or NOEC)?",5,null,0,{"$f":"IF(F18=0,0,INDEX($D18:$D19,F18,1))","v":0}]
[null,3,null,0]
[]
[null,4,"Was the biological effect quantified (e.g. 50% effect, 25% effect)? \nNote: The effect for NOEC and LOEC data must be quantified.",5,null,0,{"$f":"IF(F21=0,0,INDEX($D21:$D22,F21,1))","v":0}]
[null,null,null,0]
[null,5,"Were appropriate controls (e.g. a no-toxicant control and/or solvent control) used?",5,null,0,{"$f":"IF(F23=0,0,INDEX($D23:$D24,F23,1))","v":0}]
[null,null,null,0]
[]
[null,6,"Was each control and contaminant concentration at least duplicated?",5,null,0,{"$f":"IF(F26=0,0,INDEX($D26:$D27,F26,1))","v":0}]
[null,null,null,0]
[]
[null,7,"Were test acceptability criteria stated (e.g. mortality in controls must not exceed a certain percentage) (5 marks)?\nOR Were test acceptability criteria inferred (e.g. test method used [USEPA, OECD, ASTM etc.]) (award 2 marks). \nNote: Data that fail the acceptability criteria are automatically deemed to be of unacceptable quality and must not be used. ",5,null,0,{"$f":"IF(F29=0,0,INDEX($D29:$D31,F29,1))","v":0}]
[null,null,null,2]
[null,null,null,0]
[null,8,"Were the characteristics of the test organism (e.g. length, mass, age) stated?",5,null,0,{"$f":"IF(F32=0,0,INDEX($D32:$D34,F32,1))","v":0}]
[null,null,null,0]
[]
[null,9,"Was the type of test media used stated?",5,null,0,{"$f":"IF(F35=0,0,INDEX($D35:$D37,F35,1))","v":0}]
[null,null,null,0]
[]
[null,null,"Was the type of exposure (e.g. static, flow through) stated? ",4,null,0,{"$f":"IF(F38=0,0,INDEX($D38:$D40,F38,1))","v":0}]
[null,10,null,0]
[]
[null,null,"Were the contaminant concentrations measured at the beginning and end of the exposure (4 marks)? Award 2 marks if they were measured only once during the test.\nNote: If the concentrations were not measured then automatically the data cannot be high quality. ",4,null,0,{"$f":"IF(F41=0,0,INDEX($D41:$D43,F41,1))","v":0}]
[null,11,null,2]
[null,null,null,0]
[null,null,"Were parallel reference toxicant toxicity tests conducted?",4,null,0,{"$f":"IF(F44=0,0,INDEX($D44:$D46,F44,1))","v":0}]
[null,12,null,0]
[]
[null,null,"Was there a concentration–response relationship either observable or stated?",4,null,0,{"$f":"IF(F47=0,0,INDEX($D47:$D49,F47,1))","v":0}]
[null,13,null,0]
[]
[null,null,"Was an appropriate statistical method or model used to determine the toxicity?\nNote: They should be accepted by a recognised national or international regulatory body (e.g. USEPA, OECD, ASTM). ",4,null,0,{"$f":"IF(F50=0,0,INDEX($D50:$D52,F50,1))","v":0}]
[null,14,null,0]
[]
[null,15,"For LC/EC/BEC data was an estimate of variability provided? \nOR \nFor NO EC/LOEC data was the significance level 0.05 or less?  \n\n",4,null,0,{"$f":"IF(F53=0,0,INDEX($D53:$D55,F53,1))","v":0}]
[null,null,null,0]
[]
[null,16,"Were the following parameters measured and stated? (3 marks if measured and stated, 1 mark if just measured)."]
[null,null,null,3,null,0,{"$f":"IF(F57=0,0,INDEX($D57:$D59,F57,1))","v":0}]
[null,16.100000000000001,"pH ",1]
[null,null,null,0]
[null,null,null,3,null,0,{"$f":"IF(F60=0,0,INDEX($D60:$D62,F60,1))","v":0}]
[null,16.2,"Hardness",1]
[null,null,null,0]
[null,null,null,3,null,0,{"$f":"IF(F63=0,0,INDEX($D63:$D65,F63,1))","v":0}]
[null,16.3,"Alkalinity ",1]
[null,null,null,0]
[null,null,null,3,null,0,{"$f":"IF(F66=0,0,INDEX($D66:$D68,F66,1))","v":0}]
[null,16.399999999999999,"Organic carbon concentration",1]
[null,null,null,0]
[null,null,"Was the temperature measured and stated (3 marks)? Award 1 mark if the temperature was measured but not stated or if only the temperature settings of the room or chamber are stated.",3,null,0,{"$f":"IF(F69=0,0,INDEX($D69:$D71,F69,1))","v":0}]
[null,17,null,1]
[null,null,null,0]
[null,null,"Were test solutions, blanks and/or controls tested for contamination OR were analytical reagent grade chemicals used or the highest possible purity chemicals used for the experiment? (3 marks).",3,null,0,{"$f":"IF(F72=0,0,INDEX($D72:$D73,F72,1))","v":0}]
[null,18,null,0]
[]
[null,null,null,null,null,null,null,null,{"$f":"(COUNTIF(F12:F73,\"=0\"))+COUNTIF(F2:F10,\"=0\")+COUNTIF(D2:D7,\"=0\")","v":36}]
[]
[]
[null,null,"Total score",null,null,null,{"$f":"IF(SUM(G12:G72)=0,\"\",SUM(G12:G72))","v":""}]
[null,null,"Total Max. possible score for the various types of data and contaminants ",null,{"$f":"D12+D15+D18+D21+D23+D26+D29+D32+D35+D38+D41+D44+D47+D50+D53+D57+D66+D69+D72+D60+D63","v":97}]
[null,null,"Quality Score",null,{"$f":"\"= [Total score / Total possible score] * 100 = \"","v":"= [Total score / Total possible score] * 100 = "},null,{"$f":"IF(ISERROR(G78/E79),#N/A,G78/E79)","v":{"$error":"#N/A"}},{"$f":"IF(F41=3,\"The highest possible grade for this datum is acceptable.\",\"\")","v":""}]
[]
[null,null,"H = high quality                           Quality score ≥ 80%      "]
[null,null,"A = acceptable quality         > 50% Quality score < 80%      "]
[null,null,"U = unacceptable quality              Quality score ≤ 50%  "]
[]
[3,null,"Click the 'Save & Update' button to save and export the answers to the 'All results' worksheet. "]
[null,null,"Select the 'Reset Answers' button if you wish to clear all answers."]

{"sheet":"FW metal plant_WS","index":10,"n_rows":5,"n_cols":24,"rows_kept":5,"cut":false,"hidden":false,"merged":[]}
[]
["Question No.",1,2,3,4,5,6,7,8,9,10,11,12,13,14,15,16.100000000000001,16.2,16.3,16.399999999999999,17,18,"Total Score","Quality Score"]
["Short Questions","Duration of the exposure ","Biological endpoint","Biological effect stated or not","Biological effect quantified or not","Appropriate controls","Control & contaminant concentration","Test acceptability criteria","Characteristics of the test organism"," Type of test media","Type of exposure","Contaminant concentrations","Parallel reference toxicant toxicity tests","Concentration–response relationship","Determine the toxicity","NOEC/LOEC or LC/EC/BEC","pH","Hardness","Alkalinity ","Organic carbon concentration","Temperature","Grade or purity"]
["Marks Awarded ","10 or 0","10,5 or 0","5 or 0 ","5 or 0 ","5 or 0 ","5 or 0 ","5 or 0 ","5 or 0 ","5 or 0 ","4 or 0","4 or 2 or 0","4 or 2","4 or 2","4 or 2","4 or 2","3 or 1 or 0","3 or 1 or 0","3 or 1 or 0","3 or 1 or 0","3 or 0","3 or 0 "]
["Max. Possible Score",10,10,5,5,5,5,5,5,5,4,4,4,4,4,4,3,3,3,3,3,3,{"$f":"SUM(B5:V5)","v":97}]

{"sheet":"FW nonmetal plant","index":11,"n_rows":79,"n_cols":53,"rows_kept":79,"cut":false,"hidden":false,"merged":[[3,4,7,4],[9,2,9,4],[11,2,13,2],[11,7,13,7],[14,2,16,2],[14,7,16,7],[17,2,19,2],[17,7,19,7],[20,2,21,2],[20,7,21,7],[22,2,24,2],[22,7,24,7],[25,2,27,2],[25,7,27,7],[28,2,30,2],[28,7,30,7],[31,2,33,2],[31,7,33,7],[34,2,36,2],[34,7,36,7],[37,2,39,2],[37,7,39,7],[40,2,42,2],[40,7,42,7],[43,2,45,2],[43,7,45,7],[46,2,48,2],[46,7,48,7],[49,2,51,2],[49,7,51,7],[60,2,62,2],[60,7,62,7],[63,2,66,2],[63,7,66,7],[52,2,54,2],[52,7,54,7],[56,2,59,2],[56,7,59,7]]}
[null,1,"Fill in the blank cells below, based on information provided in the paper being assessed. You can either pick an option from the dropdown list or add the appropriate detail using the 'Add to list' button. ",null,null,null,null,null,null,null,null,null,null,null,"* All the text in RED are used for drop down list ,make changes with caution."]
[null,null,"Category",{"$f":"IF(AF3=\"\",0,1)","v":1},"Freshwater/non-metal/plant",{"$f":"IF(E3=\"\",0,1)","v":1},"Citation No.",{"$f":"IF(ISERROR(FIND(\"-\",E3)),E3,LEFT(E3,FIND(\"-\",E3)-1))","v":"1077"},null,"Taxonomic group",null,null,null,null,"Species",null,null,"Lifestage",null,null,"Exposure duration",null,null,"Measure of toxicity",null,null,"Toxicity endpoint",null,null,"Taxonomic group",null,null,"Phylum",null,null,"Class",null,null,"Media",null,null,"Temperature ",null,null,"Acute Or Chronic",null,null,"PH",null,null,"Salinity/Conductivity"]
[null,null,"Paper and data unique identifier(eg. 1-1,10-150)",{"$f":"IF(AI3=\"\",0,1)","v":1},"1077-4",{"$f":"IF(E4=\"\",0,1)","v":1},"Species (Scientific name)",null,null,"Phylum",null,null,null,null,"Aedes albopictus",21,{"$f":"IF(P3=0,\"\",INDEX(O3:O100,P3))","v":"Scenedesmus obliguus"},"1 month",8,{"$f":"IF(S3=0,\"\",INDEX(R3:R100,S3))","v":"logarithmic growth phase"},"11 hours",7,{"$f":"IF(V3=0,\"\",INDEX(U3:U100,V3))","v":"72 hour"},"EC1",6,{"$f":"IF(Y3=0,\"\",INDEX(X3:X100,Y3))","v":"LOEC"},"Growth inhibition",14,{"$f":"IF(AB3=0,\"\",INDEX(AA3:AA100,AB3))","v":"cartenoid conc. "},"Cyano",4,{"$f":"IF(AE3=0,\"\",INDEX(AD3:AD100,AE3))","v":"Microalga"},"Chlorophyta",1,{"$f":"IF(AH3=0,\"\",INDEX(AG3:AG100,AH3))","v":"Chlorophyta"},"Branchiopoda",3,{"$f":"IF(AK3=0,\"\",INDEX(AJ3:AJ102,AK3))","v":"Chlorophyceae"},"algaltoxkit",12,{"$f":"IF(AN3=0,\"\",INDEX(AM3:AM100,AN3))","v":"AAP"},20,14,{"$f":"IF(AQ3=0,\"\",INDEX(AP3:AP100,AQ3))","v":"21-24 ± 2"},"Acute ",2,{"$f":"IF(AT3=0,\"\",INDEX(AS3:AS100,AT3))","v":"Chronic"},5.5,14,{"$f":"IF(AW3=0,\"\",INDEX(AV3:AV100,AW3))","v":7.5},"30 ppt",null,"N.A."]
[null,null,"Citation",{"$f":"IF(AL3=\"\",0,1)","v":1},"Qu,H., R.X. Ma, D.H. Liu, P. Wang, L.D. Huang, X.X. Qiu, and Z.Q. Zhou (2014) Enantioselective Toxicity and Degradation of the Chiral Insecticide Fipronil in Scenedesmus obliguus Suspension System Environ. Toxicol. Chem.33(11): 2516-2521",{"$f":"IF(AX3=\"\",0,1)","v":1},"Lifestage",null,null,"Class",null,null,null,null,"Anabaena flos-aquae",null,null,"1 year old",null,null,"13 days ",null,null,"EC20",null,null,"Growth Inhibition: Algal Biomass (cell counts)",null,null,"Fish",null,null,"Cyanobacteria",null,null,"Chlorophyceae",null,null,"Freshwater",null,null,21,null,null,"Chronic",null,null,6.7,null,null,"150 uS/cm"]
[null,null,null,{"$f":"IF(AO3=\"\",0,1)","v":1},null,{"$f":"IF(H8=\"\",0,1)","v":1},"Exposure duration",null,null,"Media",null,null,null,null,"Australian Bass",null,null,"Exponential growth phase",null,null,"24 hr",null,null,"EC50",null,null,"Growth inhibition: AUC",null,null,"Macrophyte",null,null,"N.A.",null,null,"Chlorophyceae",null,null,"HB4",null,null,22,null,null,"Chronic",null,null,6.9,null,null,"N.A."]
[null,null,null,{"$f":"IF(AR3=\"\",0,1)","v":1},null,{"$f":"IF(Q3=\"\",0,1)","v":1},"Measure of toxicity",null,null,"Temperature ",null,null,null,null,"Chlorella pyrenoidosa",null,null,"Exponential growth phase",null,null,"3 days",null,null,"EC80",null,null,"Growth inhibition: cell count",null,null,"Microalga",null,null,"Tracheophyta",null,null,"Liliopsida",null,null,"HGZ media",null,null,28,null,null,"N.A.",null,null,7.7]
[null,null,null,{"$f":"IF(AU3=\"\",0,1)","v":1},null,{"$f":"IF(T3=\"\",0,1)","v":1},"Toxicity endpoint",null,null,"Acute Or Chronic ",null,null,null,null,"Chlorella pyrenoidosa",null,null,"N.A.",null,null,"6 days",null,null,"LC50",null,null,"Growth inhibition: growth rate",null,null,"N.A.",null,null,"Tracheophyta",null,null,"N.A.",null,null,"Marinewater",null,null,"15°C",null,null,null,null,null,7.8]
[null,null,null,null,null,{"$f":"IF(W3=\"\",0,1)","v":1},"Toxicity value","0.2mg/L",null,"PH",null,null,null,null,"Chlorella vulgaris",null,null,"not stated",null,null,"7 days",null,null,"LOEC",null,null,"Mortality",null,null,"plantae",null,null,null,null,null,"Trebouxiophyceae",null,null,"Moderately hard standard water",null,null,"18-22",null,null,null,null,null,"7.5 - 8.3"]
[null,2,"Select the appropriate answer option to each question. Comments can be added to the cells in column H.",null,null,{"$f":"IF(Z3=\"\",0,1)","v":1},null,null,null,"Salinity/Conductivity","N.A.",null,null,null,"Chlorella vulgaris",null,null,"not stated",null,null,"72 hour",null,null,"N.A.",null,null,"N.A.",null,null,null,null,null,null,null,null,null,null,null,"N.A.",null,null,"20 ± 1°C",null,null,null,null,null,"7.7-7.9"]
[null,"*","If the selected answer option does not work try clicking on any other cell first and then click back on the answer option again.",null,null,{"$f":"IF(AC3=\"\",0,1)","v":1},null,null,null,null,null,null,null,null,"Dunaliella tertiolecta",null,null,"logarithmic growth phase",null,null,"96 hrs",null,null,"NOEC",null,null,"population growth",null,null,null,null,null,null,null,null,null,null,null,"not stated",null,null,"21-24",null,null,null,null,null,"N.A."]
[null,"No.","Question","Marks Awarded","Answer Options","Option References","Scores","Answers",null,null,null,null,null,null,"Lemna minor",null,null,null,null,null,"N.A.",null,null,"Population: Growth Rate: Frond count",null,null,"Population: Abundance: Biomass (Chl-a)",null,null,null,null,null,null,null,null,null,null,null,"Steinberg medium",null,null,"22 ± 1°C",null,null,null,null,null,"N.A."]
[null,null,"Was the duration of the exposure stated (e.g. 48 or 96 h)?",10,null,1,{"$f":"IF(F15=0,0,INDEX($D12:$D13,F12,1))","v":10},null,null,null,null,null,null,null,"Mirocystis aeruginosa",null,null,null,null,null,null,null,null,null,null,null,"Population: Growth Rate: Front count",null,null,null,null,null,null,null,null,null,null,null,"Sterilised and filtered offshore marine water",null,null,"25 ± 2°C",null,null,null,null,null,"not stated"]
[null,1,null,0,null,null,null,null,null,null,null,null,null,null,"Mycrocystis flos-aquae",null,null,null,null,null,null,null,null,null,null,null,"Reproduction",null,null,null,null,null,null,null,null,null,null,null,"Sterilised culture medium",null,null,"25°C",null,null,null,null,null,"not stated"]
[null,null,null,null,null,null,null,null,null,null,null,null,null,null,"N.A.",null,null,null,null,null,null,null,null,null,null,null,"Chlorophyll a conc. ",null,null,null,null,null,null,null,null,null,null,null,"AAP",null,null,"N.A.",null,null,null,null,null,"PH11"]
[null,null,"Was the biological endpoint (e.g., immobilization or population growth) stated and defined (10 marks)? Award 5 marks if the biological endpoint is only stated.",10,null,1,{"$f":"IF(F15=0,0,INDEX($D15:$D17,F15,1))","v":10},null,null,null,null,null,null,null,"raphidocelis subcapitata",null,null,null,null,null,null,null,null,null,null,null,"Chlorophyll b conc. ",null,null,null,null,null,null,null,null,null,null,null,null,null,null,"Not stated",null,null,null,null,null,"PH7.0"]
[null,2,null,5,null,null,null,null,null,null,null,null,null,null,"Scenedesmus obliquus",null,null,null,null,null,null,null,null,null,null,null,"cartenoid conc. ",null,null,null,null,null,null,null,null,null,null,null,null,null,null,"21-24 ± 2",null,null,null,null,null,7.5]
[null,null,null,0,null,null,null,null,null,null,null,null,null,null,"Scenedesmus obliquus"]
[null,null,"Was the biological effect stated (e.g. LC or NOEC)?",5,null,1,{"$f":"IF(F18=0,0,INDEX($D18:$D19,F18,1))","v":5},null,null,null,null,null,null,null,"Scenedesmus quadricauda"]
[null,3,null,0,null,null,null,null,null,null,null,null,null,null,"Scenedesmus quadricauda"]
[null,null,null,null,null,null,null,null,null,null,null,null,null,null,"Scenedesmus vacuolatus"]
[null,4,"Was the biological effect quantified (e.g. 50% effect, 25% effect)? \nNote: The effect for NOEC and LOEC data must be quantified.",5,null,1,{"$f":"IF(F21=0,0,INDEX($D21:$D22,F21,1))","v":5},null,null,null,null,null,null,null,"Selenastrum capricornutum"]
[null,null,null,0,null,null,null,null,null,null,null,null,null,null,"Selenastrum capricornutum"]
[null,5,"Were appropriate controls (e.g. a no-toxicant control and/or solvent control) used?",5,null,1,{"$f":"IF(F23=0,0,INDEX($D23:$D24,F23,1))","v":5},null,null,null,null,null,null,null,"Scenedesmus obliguus"]
[null,null,null,0]
[]
[null,6,"Was each control and contaminant concentration at least duplicated?",5,null,1,{"$f":"IF(F26=0,0,INDEX($D26:$D27,F26,1))","v":5}]
[null,null,null,0]
[]
[null,7,"Were test acceptability criteria stated (e.g. mortality in controls must not exceed a certain percentage) (5 marks)?\nOR Were test acceptability criteria inferred (e.g. test method used [USEPA, OECD, ASTM etc.]) (award 2 marks). \nNote: Data that fail the acceptability criteria are automatically deemed to be of unacceptable quality and must not be used. ",5,null,2,{"$f":"IF(F29=0,0,INDEX($D29:$D31,F29,1))","v":2}]
[null,null,null,2]
[null,null,null,0]
[null,8,"Were the characteristics of the test organism (e.g. length, mass, age) stated?",5,null,1,{"$f":"IF(F32=0,0,INDEX($D32:$D34,F32,1))","v":5}]
[null,null,null,0]
[]
[null,9,"Was the type of test media used stated?",5,null,1,{"$f":"IF(F35=0,0,INDEX($D35:$D37,F35,1))","v":5}]
[null,null,null,0]
[]
[null,null,"Was the type of exposure (e.g. static, flow through) stated? ",4,null,2,{"$f":"IF(F38=0,0,INDEX($D38:$D40,F38,1))","v":0}]
[null,10,null,0]
[]
[null,null,"Were the contaminant concentrations measured at the beginning and end of the exposure (4 marks)? Award 2 marks if they were measured only once during the test.\nNote: If the concentrations were not measured then automatically the data cannot be high quality. ",4,null,2,{"$f":"IF(F41=0,0,INDEX($D41:$D43,F41,1))","v":2}]
[null,11,null,2]
[null,null,null,0]
[null,null,"Were parallel reference toxicant toxicity tests conducted?",4,null,2,{"$f":"IF(F44=0,0,INDEX($D44:$D46,F44,1))","v":0}]
[null,12,null,0]
[]
[null,null,"Was there a concentration–response relationship either observable or stated?",4,null,1,{"$f":"IF(F47=0,0,INDEX($D47:$D49,F47,1))","v":4}]
[null,13,null,0]
[]
[null,null,"Was an appropriate statistical method or model used to determine the toxicity?\nNote: They should be accepted by a recognised national or international regulatory body (e.g. USEPA, OECD, ASTM). ",4,null,1,{"$f":"IF(F50=0,0,INDEX($D50:$D52,F50,1))","v":4}]
[null,14,null,0]
[]
[null,15,"For LC/EC/BEC data was an estimate of variability provided? \nOR \nFor NO EC/LOEC data was the significance level 0.05 or less?  \n\n",4,null,1,{"$f":"IF(F53=0,0,INDEX($D53:$D55,F53,1))","v":4},"95% CL "]
[null,null,null,0]
[]
[null,16,"Were the following parameters measured and stated? (3 marks if measured and stated, 1 mark if just measured)."]
[null,null,"pH",3,null,1,{"$f":"IF(F57=0,0,INDEX($D57:$D59,F57,1))","v":3}]
[null,16.100000000000001,null,1]
[null,null,null,0]
[]
[null,null,"Was the temperature measured and stated (3 marks)? Award 1 mark if the temperature was measured but not stated or if only the temperature settings of the room or chamber are stated.",3,null,1,{"$f":"IF(F61=0,0,INDEX($D61:$D63,F61,1))","v":3}]
[null,17,null,1]
[null,null,null,0]
[null,null,"Were test solutions, blanks and/or controls tested for contamination OR were analytical reagent grade chemicals used or the highest possible purity chemicals used for the experiment? (3 marks).",3,null,1,{"$f":"IF(F64=0,0,INDEX($D64:$D65,F64,1))","v":3},"96.5% pure"]
[null,18,null,0]
[]
[null,null,null,null,null,null,null,null,{"$f":"COUNTIF(D2:D7,\"=0\")+COUNTIF(F2:F10,\"=0\")+COUNTIF(F12:F64,\"=0\")","v":0}]
[]
[]
[null,null,"Total score",null,null,null,{"$f":"IF(SUM(G12:G67)=0,\"\",SUM(G12:G67))","v":75}]
[null,null,"Total Max. possible score for the various types of data and contaminants ",null,{"$f":"D12+D15+D18+D21+D23+D26+D29+D32+D35+D38+D41+D44+D47+D50+D53+D57+D61+D64","v":88}]
[null,null,"Quality Score",null,{"$f":"\"= [Total score / Total possible score] * 100 = \"","v":"= [Total score / Total possible score] * 100 = "},null,{"$f":"IF(ISERROR(G70/E71),#N/A,G70/E71)","v":0.85227272727272729},{"$f":"IF(F41=3,\"The highest possible grade for this datum is acceptable.\",\"\")","v":""}]
[]
[null,null,"H = high quality                           Quality score ≥ 80%  "]
[null,null,"A = acceptable quality         > 50% Quality score < 80%     "]
[null,null,"U = unacceptable quality              Quality score ≤ 50%"]
[]
[3,null,"Click the 'Save & Update' button to save and export the answers to the 'All results' worksheet. "]
[null,null,"Select the 'Reset Answers' button if you wish to clear all answers."]

{"sheet":"FW nonmetal plant_WS","index":12,"n_rows":111,"n_cols":22,"rows_kept":111,"cut":false,"hidden":false,"merged":[]}
[]
["Question No.",1,2,3,4,5,6,7,8,9,10,11,12,13,14,15,16.100000000000001,17,18,"Total Score","Quality Score","Comment "]
["Short Questions","Duration of the exposure ","Biological endpoint","Biological effect stated or not","Biological effect quantified or not","Appropriate controls","Control & contaminant concentration","Test acceptability criteria","Characteristics of the test organism"," Type of test media","Type of exposure","Contaminant concentrations","Parallel reference toxicant toxicity tests","Concentration–response relationship","Determine the toxicity","NOEC/LOEC or LC/EC/BEC","pH","Temperature","Grade or purity"]
["Category","Freshwater/non-metal/plant","Paper and data unique identifier(eg. 1-1,10-150)","1019-1"]
["Scores",10,5,5,5,5,5,2,0,5,0,2,0,4,4,4,1,1,3,61,0.69318181818181823,""]
["Answers","","","","","","","OECD","","filtered milli-Q water","only inferred ","","","","","","7.7-7.9","21C","fungicide sourced from Gasukuro kogyo inc. "]
["Category","Freshwater/non-metal/plant","Paper and data unique identifier(eg. 1-1,10-150)","1019-2"]
["Scores",10,5,5,5,5,5,2,0,5,0,2,0,4,4,4,1,1,3,61,0.69318181818181823,""]
["Answers","","","","","","","OECD","","filtered milli-Q water","only inferred ","","","","","","7.7-7.9","21C","fungicide sourced from Gasukuro kogyo inc. "]
["Category","Freshwater/non-metal/plant","Paper and data unique identifier(eg. 1-1,10-150)","1019-3"]
["Scores",10,5,5,5,5,5,2,0,5,0,2,0,4,4,4,1,1,3,61,0.69318181818181823,""]
["Answers","","","","","","","OECD","","filtered milli-Q water","only inferred ","","","","","","7.7-7.9","21C","fungicide sourced from Gasukuro kogyo inc. "]
["Category","Freshwater/non-metal/plant","Paper and data unique identifier(eg. 1-1,10-150)","1019-4"]
["Scores",10,5,5,5,5,5,2,0,5,0,2,0,4,4,4,1,1,3,61,0.69318181818181823,""]
["Answers","","","","","","","OECD","","filtered milli-Q water","only inferred ","","","","","","7.7-7.9","21C","fungicide sourced from Gasukuro kogyo inc. "]
["Category","Freshwater/non-metal/plant","Paper and data unique identifier(eg. 1-1,10-150)","697-1"]
["Scores",10,10,5,5,5,5,2,0,5,4,4,0,0,4,4,0,3,3,69,0.78409090909090906,""]
["Answers","","","","","","","","","","","","","","","","","",""]
["Category","Freshwater/non-metal/plant","Paper and data unique identifier(eg. 1-1,10-150)","697-4"]
["Scores",10,10,5,5,5,5,2,0,5,4,4,0,0,4,4,0,3,3,69,0.78409090909090906,""]
["Answers","","","","","","","","","","","","","","95% CI (0.00014)","95% CI (0.00014)","","",""]
["Category","Freshwater/non-metal/plant","Paper and data unique identifier(eg. 1-1,10-150)","1032-1"]
["Scores",10,10,5,5,5,5,2,0,5,0,2,0,0,4,4,1,1,3,62,0.70454545454545459,""]
["Answers","72 hours","The 72 h\nEC50 value in this test was calculated as the concentration of\nthe test substance which caused a 50% reduction in growth\nrelative to the control.","EC50",50,"","","European guideline","","","","","","","","","","",""]
["Category","Freshwater/non-metal/plant","Paper and data unique identifier(eg. 1-1,10-150)","1032-2"]
["Scores",10,10,5,5,5,5,2,0,5,0,2,0,0,4,4,1,1,3,62,0.70454545454545459,""]
["Answers","72 hours","The 72 h\nEC50 value in this test was calculated as the concentration of\nthe test substance which caused a 50% reduction in growth\nrelative to the control.","LOEC","","","","European guideline","","","","","","","","","","",""]
["Category","Freshwater/non-metal/plant","Paper and data unique identifier(eg. 1-1,10-150)","1033-1"]
["Scores",10,10,5,5,5,5,0,0,5,0,2,0,4,4,4,0,0,3,62,0.70454545454545459,""]
["Answers","","","","","","","","","","","","","","","","","",""]
["Category","Freshwater/non-metal/plant","Paper and data unique identifier(eg. 1-1,10-150)","1033-2"]
["Scores",10,10,5,5,5,5,0,0,5,0,2,0,4,4,4,0,0,3,62,0.70454545454545459,""]
["Answers","","","","","","","","","","","","","","","","","",""]
["Category","Freshwater/non-metal/plant","Paper and data unique identifier(eg. 1-1,10-150)","1033-3"]
["Scores",10,10,5,5,5,5,0,0,5,0,2,0,4,4,4,0,0,3,62,0.70454545454545459,""]
["Answers","","","","","","","","","","","","","","","","","",""]
["Category","Freshwater/non-metal/plant","Paper and data unique identifier(eg. 1-1,10-150)","1033-4"]
["Scores",10,10,5,5,5,5,0,0,5,0,2,0,4,4,4,0,0,3,62,0.70454545454545459,""]
["Answers","","","","","","","","","","","","","","","","","",""]
["Category","Freshwater/non-metal/plant","Paper and data unique identifier(eg. 1-1,10-150)","1033-5"]
["Scores",10,10,5,5,5,5,0,0,5,0,2,0,4,4,4,0,0,3,62,0.70454545454545459,""]
["Answers","","","","","","","","","","","","","","","","","",""]
["Category","Freshwater/non-metal/plant","Paper and data unique identifier(eg. 1-1,10-150)","1033-6"]
["Scores",10,10,5,5,5,5,0,0,5,0,2,0,4,4,4,0,0,3,62,0.70454545454545459,""]
["Answers","","","","","","","","","","","","","","","","","",""]
["Category","Freshwater/non-metal/plant","Paper and data unique identifier(eg. 1-1,10-150)","1033-7"]
["Scores",10,10,5,5,5,5,0,0,5,0,2,0,4,4,4,0,0,3,62,0.70454545454545459,""]
["Answers","","","","","","","","","","","","","","","","","",""]
["Category","Freshwater/non-metal/plant","Paper and data unique identifier(eg. 1-1,10-150)","1033-8"]
["Scores",10,10,5,5,5,5,0,0,5,0,2,0,4,4,4,0,0,3,62,0.70454545454545459,""]
["Answers","","","","","","","","","","","","","","","","","",""]
["Category","Freshwater/non-metal/plant","Paper and data unique identifier(eg. 1-1,10-150)","1033-9"]
["Scores",10,10,5,5,5,5,0,0,5,0,2,0,4,4,4,0,0,3,62,0.70454545454545459,""]
["Answers","","","","","","","","","","","","","","","","","",""]
["Category","Freshwater/non-metal/plant","Paper and data unique identifier(eg. 1-1,10-150)","1033-10"]
["Scores",10,10,5,5,5,5,0,0,5,0,2,0,4,4,4,0,0,3,62,0.70454545454545459,""]
["Answers","","","","","","","","","","","","","","","","","",""]
["Category","Freshwater/non-metal/plant","Paper and data unique identifier(eg. 1-1,10-150)","1033-11"]
["Scores",10,10,5,5,5,5,0,0,5,0,2,0,4,4,4,0,0,3,62,0.70454545454545459,""]
["Answers","","","","","","","","","","","","","","","","","",""]
["Category","Freshwater/non-metal/plant","Paper and data unique identifier(eg. 1-1,10-150)","1033-12"]
["Scores",10,10,5,5,5,5,0,0,5,0,2,0,4,4,4,0,0,3,62,0.70454545454545459,""]
["Answers","","","","","","","","","","","","","","","","","",""]
["Category","Freshwater/non-metal/plant","Paper and data unique identifier(eg. 1-1,10-150)","1033-13"]
["Scores",10,10,5,5,5,5,0,0,5,0,2,0,4,4,4,0,0,3,62,0.70454545454545459,""]
["Answers","","","","","","","","","","","","","","","","","",""]
["Category","Freshwater/non-metal/plant","Paper and data unique identifier(eg. 1-1,10-150)","1033-14"]
["Scores",10,10,5,5,5,5,0,0,5,0,2,0,4,4,4,0,0,3,62,0.70454545454545459,""]
["Answers","","","","","","","","","","","","","","","","","",""]
["Category","Freshwater/non-metal/plant","Paper and data unique identifier(eg. 1-1,10-150)","1033-15"]
["Scores",10,10,5,5,5,5,0,0,5,0,2,0,4,4,4,0,0,3,62,0.70454545454545459,""]
["Answers","","","","","","","","","","","","","","","","","",""]
["Category","Freshwater/non-metal/plant","Paper and data unique identifier(eg. 1-1,10-150)","1033-16"]
["Scores",10,10,5,5,5,5,0,0,5,0,2,0,4,4,4,0,0,3,62,0.70454545454545459,""]
["Answers","","","","","","","","","","","","","","","","","",""]
["Category","Freshwater/non-metal/plant","Paper and data unique identifier(eg. 1-1,10-150)","1033-17"]
["Scores",10,10,5,5,5,5,0,0,5,0,2,0,4,4,4,0,0,3,62,0.70454545454545459,""]
["Answers","","","","","","","","","","","","","","","","","",""]
["Category","Freshwater/non-metal/plant","Paper and data unique identifier(eg. 1-1,10-150)","1033-18"]
["Scores",10,10,5,5,5,5,0,0,5,0,2,0,4,4,4,0,0,3,62,0.70454545454545459,""]
["Answers","","","","","","","","","","","","","","","","","",""]
["Category","Freshwater/non-metal/plant","Paper and data unique identifier(eg. 1-1,10-150)","1033-19"]
["Scores",10,10,5,5,5,5,0,0,5,0,2,0,4,4,4,0,0,3,62,0.70454545454545459,""]
["Answers","","","","","","","","","","","","","","","","","",""]
["Category","Freshwater/non-metal/plant","Paper and data unique identifier(eg. 1-1,10-150)","1033-20"]
["Scores",10,10,5,5,5,5,0,0,5,0,2,0,4,4,4,0,0,3,62,0.70454545454545459,""]
["Answers","","","","","","","","","","","","","","","","","",""]
["Category","Freshwater/non-metal/plant","Paper and data unique identifier(eg. 1-1,10-150)","1033-21"]
["Scores",10,10,5,5,5,5,0,0,5,0,2,0,4,4,4,0,0,3,62,0.70454545454545459,""]
["Answers","","","","","","","","","","","","","","","","","",""]
["Category","Freshwater/non-metal/plant","Paper and data unique identifier(eg. 1-1,10-150)","1033-22"]
["Scores",10,10,5,5,5,5,0,0,5,0,2,0,4,4,4,0,0,3,62,0.70454545454545459,""]
["Answers","","","","","","","","","","","","","","","","","",""]
["Category","Freshwater/non-metal/plant","Paper and data unique identifier(eg. 1-1,10-150)","1033-23"]
["Scores",10,10,5,5,5,5,0,0,5,0,2,0,4,4,4,0,0,3,62,0.70454545454545459,""]
["Answers","","","","","","","","","","","","","","","","","",""]
["Category","Freshwater/non-metal/plant","Paper and data unique identifier(eg. 1-1,10-150)","1033-24"]
["Scores",10,10,5,5,5,5,0,0,5,0,2,0,4,4,4,0,0,3,62,0.70454545454545459,""]
["Answers","","","","","","","","","","","","","","","","","",""]
["Category","Freshwater/non-metal/plant","Paper and data unique identifier(eg. 1-1,10-150)","1077-1 "]
["Scores",10,10,5,5,5,5,2,5,5,0,2,0,4,4,4,3,3,3,75,0.85227272727272729,""]
["Answers","","","","","","","","","","","","","","95% CL (0.27–1.12)","95% CL (0.27–1.12)","","","96.5% pure"]
["Category","Freshwater/non-metal/plant","Paper and data unique identifier(eg. 1-1,10-150)","1077-2"]
["Scores",10,10,5,5,5,5,2,5,5,0,2,0,4,4,4,3,3,3,75,0.85227272727272729,""]
["Answers","","","","","","","","","","","","","","95% CL ","95% CL ","","","96.5% pure"]
["Category","Freshwater/non-metal/plant","Paper and data unique identifier(eg. 1-1,10-150)","1077-3"]
["Scores",10,10,5,5,5,5,2,5,5,0,2,0,4,4,4,3,3,3,75,0.85227272727272729,""]
["Answers","","","","","","","","","","","","","","95% CL ","95% CL ","","","96.5% pure"]
["Category","Freshwater/non-metal/plant","Paper and data unique identifier(eg. 1-1,10-150)","1077-4"]
["Scores",10,10,5,5,5,5,2,5,5,0,2,0,4,4,4,3,3,3,75,0.85227272727272729,""]
["Answers","","","","","","","","","","","","","","95% CL ","95% CL ","","","96.5% pure"]

{"sheet":"MEW nonplant","index":13,"n_rows":84,"n_cols":53,"rows_kept":84,"cut":false,"hidden":false,"merged":[[68,2,71,2],[68,7,71,7],[56,7,58,7],[65,7,67,7],[52,2,54,2],[52,7,54,7],[59,7,61,7],[65,2,67,2],[62,2,64,2],[62,7,64,7],[43,2,45,2],[43,7,45,7],[46,2,48,2],[46,7,48,7],[49,2,51,2],[49,7,51,7],[34,2,36,2],[34,7,36,7],[37,2,39,2],[37,7,39,7],[40,2,42,2],[40,7,42,7],[25,2,27,2],[25,7,27,7],[28,2,30,2],[28,7,30,7],[31,2,33,2],[31,7,33,7],[17,2,19,2],[17,7,19,7],[20,2,21,2],[20,7,21,7],[22,2,24,2],[22,7,24,7],[3,4,7,4],[9,2,9,4],[11,2,13,2],[11,7,13,7],[14,2,16,2],[14,7,16,7]]}
[null,1,"Fill in the blank cells below, based on information provided in the paper being assessed. You can either pick an option from the dropdown list or add the appropriate detail using the 'Add to list' button. ",null,null,{"$f":"IF(BA3=\"\",0,1)","v":0},null,null,null,null,null,null,null,null,"* All the text in RED are used for drop down list ,make changes with caution."]
[null,null,"Category",{"$f":"IF(AF3=\"\",0,1)","v":0},"MEW_nonplant",{"$f":"IF(E3=\"\",0,1)","v":0},"Citation No.",{"$f":"IF(ISERROR(FIND(\"-\",E3)),E3,LEFT(E3,FIND(\"-\",E3)-1))","v":0},null,"Taxonomic group",null,null,null,null,"Species",null,null,"Lifestage",null,null,"Exposure duration",null,null,"Measure of toxicity",null,null,"Toxicity endpoint",null,null,"Taxonomic group",null,null,"Phylum",null,null,"Class",null,null,"Media",null,null,"Temperature ",null,null,"Acute Or Chronic",null,null,"PH",null,null,"Salinity/Comdictivity"]
[null,null,"Paper and data unique identifier(eg. 1-1,10-150)",{"$f":"IF(AI3=\"\",0,1)","v":0},null,{"$f":"IF(E4=\"\",0,1)","v":0},"Species (Scientific name)",null,null,"Phylum",null,null,null,null,"Aedes aegypti",0,{"$f":"IF(P3=0,\"\",INDEX(O3:O105,P3))","v":""},"1 month",0,{"$f":"IF(S3=0,\"\",INDEX(R3:R105,S3))","v":""},"10 day",0,{"$f":"IF(V3=0,\"\",INDEX(U3:U105,V3))","v":""},"EC10",0,{"$f":"IF(Y3=0,\"\",INDEX(X3:X105,Y3))","v":""},"ability to settle",0,{"$f":"IF(AB3=0,\"\",INDEX(AA3:AA105,AB3))","v":""},"Bacteria",0,{"$f":"IF(AE3=0,\"\",INDEX(AD3:AD105,AE3))","v":""},"Annelida",0,{"$f":"IF(AH3=0,\"\",INDEX(AG3:AG105,AH3))","v":""},"\tActinopterygii",0,{"$f":"IF(AK3=0,\"\",INDEX(AJ3:AJ105,AK3))","v":""},"20um filtered seawater",0,{"$f":"IF(AN3=0,\"\",INDEX(AM3:AM105,AN3))","v":""},4,0,{"$f":"IF(AQ3=0,\"\",INDEX(AP3:AP105,AQ3))","v":""},8,0,{"$f":"IF(AT3=0,\"\",INDEX(AS3:AS105,AT3))","v":""},7.5,0,{"$f":"IF(AW3=0,\"\",INDEX(AV3:AV105,AW3))","v":""},20,0,{"$f":"IF(AZ3=0,\"\",INDEX(AY3:AY105,AZ3))","v":""}]
[null,null,"Citation",{"$f":"IF(AL3=\"\",0,1)","v":0},null,{"$f":"IF(H8=\"\",0,1)","v":0},"Lifestage",null,null,"Class",null,null,null,null,"Aedes albopictus",null,null,"1 year old",null,null,"11 hour",null,null,"EC10\\",null,null,"Adult survival",null,null,"Bacteria",null,null,"Arthropoda",null,null,"\tAscidiacea",null,null,"Artificial seawater",null,null,10,null,null,"25 ± 1",null,null,8,null,null,20]
[null,null,null,{"$f":"IF(AO3=\"\",0,1)","v":0},null,{"$f":"IF(AX3=\"\",0,1)","v":0},"Exposure duration",null,null,"Media",null,null,null,null,"Amphiascus tenuiremis",null,null,"1-2day old larvae",null,null,"12 days",null,null,"EC50",null,null,"avoidance",null,null,"Fish ",null,null,"Arthropoda",null,null,"\tEchinoidea",null,null,"dechlorinated water",null,null,10.8,null,null,"Acute",null,null,8.1,null,null,20.100000000000001]
[null,null,null,{"$f":"IF(AR3=\"\",0,1)","v":0},null,{"$f":"IF(Q3=\"\",0,1)","v":0},"Measure of toxicity",null,null,"Temperature ",null,null,null,null,"Amphiascus tenuiremis ",null,null,"4 d into the cyprid larval stage",null,null,"13 days",null,null,"EC50",null,null,"Bioluminescence reduction",null,null,"macroinvertebrate",null,null,"Chlorophyta",null,null,"\tPolychaeta",null,null,"DOM-free seawater",null,null,15,null,null,"Chronic",null,null,8.3000000000000007,null,null,20.3]
[null,null,null,{"$f":"IF(AU3=\"\",0,1)","v":0},null,{"$f":"IF(T3=\"\",0,1)","v":0},"Toxicity endpoint",null,null,"Acute Or Chronic ",null,null,null,null,"Artemia salina",null,null,"6 month adult",null,null,"15 day",null,null,"EC50",null,null,"Development",null,null,"Macroinvertebrate",null,null,"Chordata",null,null,"\tSessilia",null,null,"filtered artificial seawater",null,null,20,null,null,"N.A.",null,null,"7.5 - 8.3",null,null,20.7]
[null,null,null,null,null,{"$f":"IF(W3=\"\",0,1)","v":0},"Toxicity value",null,null,"PH",null,null,null,null,"Australian Bass",null,null,"6 months old",null,null,"15 mins",null,null,"LC10",null,null,"Development",null,null,"Microalga",null,null,"Cyanobacteria",null,null,"Bivalvia",null,null,"filtered sea water",null,null,21,null,null,null,null,null,"7.7-8.1",null,null,20.7]
[null,2,"Select the appropriate answer option to each question. Comments can be added to the cells in column H.",null,null,{"$f":"IF(Z3=\"\",0,1)","v":0},null,null,null,"Salinity/Conductivity",null,null,null,null,"Chroococcus minor",null,null,"adult",null,null,"16 day",null,null,"LC50",null,null,"Development",null,null,"Microalgae",null,null,"Echinodermata",null,null,"Branchiopoda",null,null,"filtered seawater",null,null,23.2,null,null,null,null,null,"8 ± 0.2",null,null,26]
[null,"*","If the selected answer option does not work try clicking on any other cell first and then click back on the answer option again.",null,null,{"$f":"IF(AC3=\"\",0,1)","v":0},null,null,null,null,null,null,null,null,"Ciona intestinalis",null,null,"adult",null,null,"16 day",null,null,"LC50",null,null,"Development rate",null,null,"microinvertebrate",null,null,"Mollusca",null,null,"Branchiopoda",null,null,"Filtered synthetic seawater",null,null,25,null,null,null,null,null,"8 ± 0.3",null,null,30]
[null,"No.","Question","Marks Awarded","Answer Options","Option References","Scores","Answers",null,null,null,null,null,null,"Corophium volutator",null,null,"adult",null,null,"17 day",null,null,"LOEC",null,null,"Development: abnormal development",null,null,"Microinvertebrate",null,null,"N.A.",null,null,"Chlorophyceae",null,null,"Freshwater",null,null,25,null,null,null,null,null,"8.1+-0.2",null,null,30]
[null,null,"Was the duration of the exposure stated (e.g. 48 or 96 h)?",10,null,0,{"$f":"IF(F15=0,0,INDEX($D12:$D13,F12,1))","v":0},null,null,null,null,null,null,null,"Crassostrea virginica",null,null,"Adult",null,null,"20 day",null,null,"LOEL",null,null,"egg extrusion",null,null,"N.A.",null,null,"Proteobacteria",null,null,"Cyanophyceae",null,null,"marine water",null,null,25,null,null,null,null,null,"8.1–8.4",null,null,32]
[null,1,null,0,null,null,null,null,null,null,null,null,null,null,"Cyprinidon variegatus",null,null,"Adult (5-7 days old)",null,null,"24 day",null,null,"LOEL",null,null,"embryonic development",null,null,"Rotifer",null,null,"Rotifera",null,null,"Gammaproteobacteria",null,null,"Marinewater",null,null,25.3,null,null,null,null,null,"8.23±0.01",null,null,"150 uS/cm"]
[null,null,null,null,null,null,null,null,null,null,null,null,null,null,"Elasmopus rapax",null,null,"embryo",null,null,"24 dyas",null,null,"N.A.",null,null,"embryonic development",null,null,null,null,null,"Tracheophyta",null,null,"Gastropoda",null,null,"N.A.",null,null,25.6,null,null,null,null,null,"N.A.",null,null,"20.3 ± 0.4 ppt"]
[null,null,"Was the biological endpoint (e.g., immobilization or population growth) stated and defined (10 marks)? Award 5 marks if the biological endpoint is only stated.",10,null,0,{"$f":"IF(F15=0,0,INDEX($D15:$D17,F15,1))","v":0},null,null,null,null,null,null,null,"Hydroides elegans",null,null,"Embryo",null,null,"24 hrs",null,null,"NOEC",null,null,"embryonic/larval growth",null,null,null,null,null,null,null,null,"Insecta",null,null,"natural seawater",null,null,25.6,null,null,null,null,null,"not stated",null,null,"20.4-22.8"]
[null,2,null,5,null,null,null,null,null,null,null,null,null,null,"Ilyanassa obsoleta",null,null,"embryo",null,null,"25 day",null,null,"NOEC",null,null,"emyonic development",null,null,null,null,null,null,null,null,"Malacostraca",null,null,"natural seawater",null,null,26.5,null,null,null,null,null,"Not stated",null,null,"20.4-22.8‰"]
[null,null,null,0,null,null,null,null,null,null,null,null,null,null,"Mercenaria mercenaria",null,null,"Embryo",null,null,"28 day",null,null,"NOEL",null,null,"Female mortality",null,null,null,null,null,null,null,null,"Maxillopoda",null,null,"Natural seawater",null,null,27,null,null,null,null,null,"Not stated",null,null,"30 ppt"]
[null,null,"Was the biological effect stated (e.g. LC or NOEC)?",5,null,0,{"$f":"IF(F18=0,0,INDEX($D18:$D19,F18,1))","v":0},null,null,null,null,null,null,null,"Mytilus edulis",null,null,"embryo (D-veliger)",null,null,"30 day",null,null,"NOEL",null,null,"gill sodium ion activity",null,null,null,null,null,null,null,null,"Maxillopoda",null,null,"not stated",null,null,27,null,null,null,null,null,"Not stated",null,null,"33 ± 0.5"]
[null,3,null,0,null,null,null,null,null,null,null,null,null,null,"N.A.",null,null,"female mature",null,null,"32d (3 brood)",null,null,null,null,null,"Growth",null,null,null,null,null,null,null,null,"N.A.",null,null,"Not stated",null,null,27,null,null,null,null,null,"Not stated",null,null,"35.1±0.64"]
[null,null,null,null,null,null,null,null,null,null,null,null,null,null,"Oryzias melastigma",null,null,"female stage 1 juvenile",null,null,"45 day",null,null,null,null,null,"Growth: Body length",null,null,null,null,null,null,null,null,null,null,null,"seawater",null,null,35,null,null,null,null,null,"PH11",null,null,"5000 uS/cm"]
[null,4,"Was the biological effect quantified (e.g. 50% effect, 25% effect)? \nNote: The effect for NOEC and LOEC data must be quantified.",5,null,0,{"$f":"IF(F21=0,0,INDEX($D21:$D22,F21,1))","v":0},null,null,null,null,null,null,null,"Palaemonetes pugio",null,null,"First instar larvae",null,null,"48 hour",null,null,null,null,null,"Growth: length",null,null,null,null,null,null,null,null,null,null,null,"seawater",null,null,40,null,null,null,null,null,"PH7.0",null,null,"N.A."]
[null,null,null,0,null,null,null,null,null,null,null,null,null,null,"Palaemonetes pugio",null,null,"Fresh culture <10 days",null,null,"48hr",null,null,null,null,null,"Growth: Length",null,null,null,null,null,null,null,null,null,null,null,"Seawater with added DOM",null,null,"15°C",null,null,null,null,null,null,null,null,"not stated"]
[null,5,"Were appropriate controls (e.g. a no-toxicant control and/or solvent control) used?",5,null,0,{"$f":"IF(F23=0,0,INDEX($D23:$D24,F23,1))","v":0},null,null,null,null,null,null,null,"Paracentrotus lividus",null,null,"Gravid female",null,null,"48hr",null,null,null,null,null,"Growth: Length (mm)",null,null,null,null,null,null,null,null,null,null,null,null,null,null,"20 ± 1",null,null,null,null,null,null,null,null,"Not stated"]
[null,null,null,0,null,null,null,null,null,null,null,null,null,null,"Paracentrotus lividus",null,null,"II-III instar larvae",null,null,"5 day",null,null,null,null,null,"Growth: Shell area",null,null,null,null,null,null,null,null,null,null,null,null,null,null,"20±2"]
[null,null,null,null,null,null,null,null,null,null,null,null,null,null,"Philodina acuticornis odiosa",null,null,"juvenile",null,null,"50 day",null,null,null,null,null,"Growth: Shell length",null,null,null,null,null,null,null,null,null,null,null,null,null,null,"23.2 ± 0.4°C"]
[null,6,"Was each control and contaminant concentration at least duplicated?",5,null,0,{"$f":"IF(F26=0,0,INDEX($D26:$D27,F26,1))","v":0},null,null,null,null,null,null,null,"Photobacterium phosphoreum",null,null,"juvenile",null,null,"7 days",null,null,null,null,null,"Growth: weight",null,null,null,null,null,null,null,null,null,null,null,null,null,null,"25 ± 1"]
[null,null,null,0,null,null,null,null,null,null,null,null,null,null,"Salmo salar",null,null,"juvenile (212-350um)",null,null,"96 hr",null,null,null,null,null,"Growth: Weight",null,null,null,null,null,null,null,null,null,null,null,null,null,null,"25 ± 1"]
[null,null,null,null,null,null,null,null,null,null,null,null,null,null,"Salmo salar",null,null,"Larvae",null,null,"96hr",null,null,null,null,null,"Growth: Wet weight",null,null,null,null,null,null,null,null,null,null,null,null,null,null,"25 ± 1°C"]
[null,7,"Were test acceptability criteria stated (e.g. mortality in controls must not exceed a certain percentage) (5 marks)?\nOR Were test acceptability criteria inferred (e.g. test method used [USEPA, OECD, ASTM etc.]) (award 2 marks). \nNote: Data that fail the acceptability criteria are automatically deemed to be of unacceptable quality and must not be used. ",5,null,0,{"$f":"IF(F29=0,0,INDEX($D29:$D31,F29,1))","v":0},null,null,null,null,null,null,null,"Tigriopus japonicus",null,null,"larvae",null,null,"96hr",null,null,null,null,null,"Hatch time",null,null,null,null,null,null,null,null,null,null,null,null,null,null,"25 °C"]
[null,null,null,2,null,null,null,null,null,null,null,null,null,null,"Tigriopus japonicus",null,null,"larvae",null,null,"96hr",null,null,null,null,null,"immobilisation",null,null,null,null,null,null,null,null,null,null,null,null,null,null,"25°C"]
[null,null,null,0,null,null,null,null,null,null,null,null,null,null,null,null,null,"Larvae",null,null,"N.A.",null,null,null,null,null,"Immobilisation",null,null,null,null,null,null,null,null,null,null,null,null,null,null,"28.5-31.1"]
[null,8,"Were the characteristics of the test organism (e.g. length, mass, age) stated?",5,null,0,{"$f":"IF(F32=0,0,INDEX($D32:$D34,F32,1))","v":0},null,null,null,null,null,null,null,null,null,null,"larvae",null,null,null,null,null,null,null,null,"larval development",null,null,null,null,null,null,null,null,null,null,null,null,null,null,"28.5-31.1°C"]
[null,null,null,0,null,null,null,null,null,null,null,null,null,null,null,null,null,"Larvae (Naupliar <24 hours old)",null,null,null,null,null,null,null,null,"larval growth",null,null,null,null,null,null,null,null,null,null,null,null,null,null,"N.A."]
[null,null,null,null,null,null,null,null,null,null,null,null,null,null,null,null,null,"Larvae (Naupliar)",null,null,null,null,null,null,null,null,"lipid content",null,null,null,null,null,null,null,null,null,null,null,null,null,null,"Not stated"]
[null,9,"Was the type of test media used stated?",5,null,0,{"$f":"IF(F35=0,0,INDEX($D35:$D37,F35,1))","v":0},null,null,null,null,null,null,null,null,null,null,"larval life cycle",null,null,null,null,null,null,null,null,"loss of righting ability"]
[null,null,null,0,null,null,null,null,null,null,null,null,null,null,null,null,null,"Life cycle",null,null,null,null,null,null,null,null,"Male development"]
[null,null,null,null,null,null,null,null,null,null,null,null,null,null,null,null,null,"Life cycle",null,null,null,null,null,null,null,null,"Male mortality"]
[null,null,"Was the type of exposure (e.g. static, flow through) stated? ",4,null,0,{"$f":"IF(F38=0,0,INDEX($D38:$D40,F38,1))","v":0},null,null,null,null,null,null,null,null,null,null,"male mature",null,null,null,null,null,null,null,null,"Mortality"]
[null,10,null,0,null,null,null,null,null,null,null,null,null,null,null,null,null,"male stage 1 juvenile",null,null,null,null,null,null,null,null,"Mortality"]
[null,null,null,null,null,null,null,null,null,null,null,null,null,null,null,null,null,"mature",null,null,null,null,null,null,null,null,"N.A."]
[null,null,"Were the contaminant concentrations measured at the beginning and end of the exposure (4 marks)? Award 2 marks if they were measured only once during the test.\nNote: If the concentrations were not measured then automatically the data cannot be high quality. ",4,null,0,{"$f":"IF(F41=0,0,INDEX($D41:$D43,F41,1))","v":0},null,null,null,null,null,null,null,null,null,null,"N.A.",null,null,null,null,null,null,null,null,"reduced swimming"]
[null,11,null,2,null,null,null,null,null,null,null,null,null,null,null,null,null,"Not stated",null,null,null,null,null,null,null,null,"Relative growth rate"]
[null,null,null,0,null,null,null,null,null,null,null,null,null,null,null,null,null,"pre-smolt",null,null,null,null,null,null,null,null,"Reproduction"]
[null,null,"Were parallel reference toxicant toxicity tests conducted?",4,null,0,{"$f":"IF(F44=0,0,INDEX($D44:$D46,F44,1))","v":0},null,null,null,null,null,null,null,null,null,null,"pre-smolts",null,null,null,null,null,null,null,null,"Reproduction success"]
[null,12,null,0,null,null,null,null,null,null,null,null,null,null,null,null,null,"Stage 1 juvenile",null,null,null,null,null,null,null,null,"Reproduction: Fercundity"]
[null,null,null,null,null,null,null,null,null,null,null,null,null,null,null,null,null,"stage 1 juvenile ",null,null,null,null,null,null,null,null,"Reproduction: Fertility"]
[null,null,"Was there a concentration–response relationship either observable or stated?",4,null,0,{"$f":"IF(F47=0,0,INDEX($D47:$D49,F47,1))","v":0},null,null,null,null,null,null,null,null,null,null,"stage 6 larvae",null,null,null,null,null,null,null,null,"Reproduction: Viable offspring production"]
[null,13,null,0,null,null,null,null,null,null,null,null,null,null,null,null,null,"stage VI embryo",null,null,null,null,null,null,null,null,"Reproductive success"]
[null,null,null,null,null,null,null,null,null,null,null,null,null,null,null,null,null,"Stage-I Juveniles",null,null,null,null,null,null,null,null,"Reproductive success"]
[null,null,"Was an appropriate statistical method or model used to determine the toxicity?\nNote: They should be accepted by a recognised national or international regulatory body (e.g. USEPA, OECD, ASTM). ",4,null,0,{"$f":"IF(F50=0,0,INDEX($D50:$D52,F50,1))","v":0},null,null,null,null,null,null,null,null,null,null,"Trochophore larvae (< 24 h old)",null,null,null,null,null,null,null,null,"Reproductive success: Mean % brood sac extrusion"]
[null,14,null,0,null,null,null,null,null,null,null,null,null,null,null,null,null,null,null,null,null,null,null,null,null,null,"retraction"]
[null,null,null,null,null,null,null,null,null,null,null,null,null,null,null,null,null,null,null,null,null,null,null,null,null,null,"Sex ratio"]
[null,15,"For LC/EC/BEC data was an estimate of variability provided? \nOR \nFor NO EC/LOEC data was the significance level 0.05 or less?  \n\n",4,null,0,{"$f":"IF(F53=0,0,INDEX($D53:$D55,F53,1))","v":0},null,null,null,null,null,null,null,null,null,null,null,null,null,null,null,null,null,null,null,"Survival"]
[null,null,null,0,null,null,null,null,null,null,null,null,null,null,null,null,null,null,null,null,null,null,null,null,null,null,"Survival to adult"]
[null,null,null,null,null,null,null,null,null,null,null,null,null,null,null,null,null,null,null,null,null,null,null,null,null,null,"Survival: Persistence of toxicity"]
[null,16,"Were the following parameters measured and stated? (3 marks if measured and stated, 1 mark if just measured).",null,null,null,null,null,null,null,null,null,null,null,null,null,null,null,null,null,null,null,null,null,null,null,"Viable offspring"]
[null,null,null,3,null,0,{"$f":"IF(F57=0,0,INDEX($D57:$D59,F57,1))","v":0}]
[null,16.100000000000001,"Conductivity/Salinity",1]
[null,null,null,0]
[null,null,null,3,null,0,{"$f":"IF(F60=0,0,INDEX($D60:$D62,F60,1))","v":0}]
[null,16.2,"Dissolved Oxygen",1]
[null,null,null,0]
[null,null,"pH",3,null,0,{"$f":"IF(F63=0,0,INDEX(D63:D65,F63,1))","v":0}]
[null,16.3,null,1]
[null,null,null,0]
[null,null,"Was the temperature measured and stated (3 marks)? Award 1 mark if the temperature was measured but not stated or if only the temperature settings of the room or chamber are stated.\n\n",3,null,0,{"$f":"IF(F66=0,0,INDEX(D66:D68,F66,1))","v":0}]
[null,17,null,1]
[null,null,null,0]
[null,null,"Were test solutions, blanks and/or controls tested for contamination OR were analytical reagent grade chemicals used or the highest possible purity chemicals used for the experiment? (3 marks).",3,null,0,{"$f":"IF(F69=0,0,INDEX($D69:$D70,F69,1))","v":0}]
[null,18,null,0]
[]
[null,null,null,null,null,null,null,null,{"$f":"(COUNTIF(F12:F70,\"=0\"))+COUNTIF(F1:F10,\"=0\")+COUNTIF(D2:D7,\"=0\")","v":36}]
[]
[]
[null,null,"Total score",null,null,null,{"$f":"IF(SUM(G12:G69)=0,\"\",SUM(G12:G69))","v":""}]
[null,null,"Total Max. possible score for the various types of data and contaminants ",null,{"$f":"D12+D15+D18+D21+D23+D26+D29+D32+D35+D38+D41+D44+D47+D50+D53+D57+D60+D66+D69+D63","v":94}]
[null,null,"Quality Score",null,{"$f":"\"= [Total score / Total possible score] * 100 = \"","v":"= [Total score / Total possible score] * 100 = "},null,{"$f":"IF(ISERROR(G75/E76),#N/A,G75/E76)","v":{"$error":"#N/A"}},{"$f":"IF(F41=3,\"The highest possible grade for this datum is acceptable.\",\"\")","v":""}]
[]
[null,null,"H = high quality                           Quality score ≥ 80%"]
[null,null,"A = acceptable quality         > 50% Quality score < 80%  "]
[null,null,"U = unacceptable quality              Quality score ≤ 50%"]
[]
[3,null,"Click the 'Save & Update' button to save and export the answers to the 'All results' worksheet. "]
[null,null,"Select the 'Reset Answers' button if you wish to clear all answers."]

{"sheet":"MEW nonplant_WS","index":14,"n_rows":455,"n_cols":24,"rows_kept":455,"cut":false,"hidden":false,"merged":[]}
[]
["Question No.",1,2,3,4,5,6,7,8,9,10,11,12,13,14,15,16.100000000000001,16.2,16.3,17,18,"Total Score","Quality Score"]
["Short Questions","Duration of the exposure ","Biological endpoint","Biological effect stated or not","Biological effect quantified or not","Appropriate controls","Control & contaminant concentration","Test acceptability criteria","Characteristics of the test organism"," Type of test media","Type of exposure","Contaminant concentrations","Parallel reference toxicant toxicity tests","Concentration–response relationship","Determine the toxicity","NOEC/LOEC or LC/EC/BEC","Conductivity/Salinity","Dissolved Oxygen","PH","Temperature","Grade or purity"]
["Marks Awarded ","10 or 0","10,5 or 0","5 or 0 ","5 or 0 ","5 or 0 ","5 or 0 ","5 or 0 ","5 or 0 ","5 or 0 ","4 or 0","4 or 2 or 0","4 or 2","4 or 2","4 or 2","4 or 2","3 or 1 or 0","3 or 1 or 0","3 or 1 or 0","3 or 0","3 or 0 "]
["Max. Possible Score",10,10,5,5,5,5,5,5,5,4,4,4,4,4,4,3,3,3,3,3,{"$f":"SUM(B5:U5)","v":94}]
["Category","MEW_nonplant","Paper and data unique identifier(eg. 1-1,10-150)","1025-1"]
["Scores",10,5,5,5,5,5,2,5,5,4,4,0,0,4,4,3,3,3,1,3,74,0.78723404255319152,""]
["Answers","","","","","","4 replicates","ASTM","","","","","","","","","","","","",""]
["Category","MEW_nonplant","Paper and data unique identifier(eg. 1-1,10-150)","1025-1"]
["Scores",10,5,5,5,5,5,2,5,5,4,4,0,0,4,4,3,3,3,1,3,74,0.78723404255319152,""]
["Answers","","","","","","4 replicates","ASTM","","","","","","","","(22.67–30.81)","","","","",""]
["Category","MEW_nonplant","Paper and data unique identifier(eg. 1-1,10-150)","1027-1"]
["Scores",10,10,5,5,5,5,0,5,5,0,2,0,4,4,4,0,0,0,1,3,68,0.72340425531914898,""]
["Answers","","visual deformities ","EC10",10,"5 reps","5 control reps","","","0.22um filtered sea water","","","","","","","","","","",""]
["Category","MEW_nonplant","Paper and data unique identifier(eg. 1-1,10-150)","1027-2"]
["Scores",10,10,5,5,5,5,0,5,5,0,2,0,4,4,4,0,0,0,1,3,68,0.72340425531914898,""]
["Answers","","visual deformities ","EC50",50,"5 reps","5 control reps","","","0.22um filtered sea water","","","","","","","","","","",""]
["Category","MEW_nonplant","Paper and data unique identifier(eg. 1-1,10-150)","1027-3"]
["Scores",10,10,5,5,5,5,0,5,5,0,2,0,4,4,4,0,0,0,1,3,68,0.72340425531914898,""]
["Answers","","visual deformities/length measured","","","5 reps","5 control reps","","","0.22um filtered sea water","","","","","","","","","","",""]
["Category","MEW_nonplant","Paper and data unique identifier(eg. 1-1,10-150)","1027-4"]
["Scores",10,10,5,5,5,5,0,5,5,0,2,0,4,4,4,0,0,0,1,3,68,0.72340425531914898,""]
["Answers","","visual deformities/length measured","","","5 reps","5 control reps","","","0.22um filtered sea water","","","","","","","","","","",""]
["Category","MEW_nonplant","Paper and data unique identifier(eg. 1-1,10-150)","1027-5"]
["Scores",10,10,5,5,5,5,0,5,5,0,2,0,4,4,4,0,0,0,1,3,68,0.72340425531914898,""]
["Answers","","visual deformities/length measured","","","5 reps","5 control reps","","","0.22um filtered sea water","","","","","","","","","","",""]
["Category","MEW_nonplant","Paper and data unique identifier(eg. 1-1,10-150)","1027-6"]
["Scores",10,10,5,5,5,5,0,5,5,0,2,0,4,4,4,0,0,0,1,3,68,0.72340425531914898,""]
["Answers","","visual deformities/length measured","","","5 reps","5 control reps","","","0.22um filtered sea water","","","","","","","","","","",""]
["Category","MEW_nonplant","Paper and data unique identifier(eg. 1-1,10-150)","1027-7"]
["Scores",10,10,5,5,5,5,0,5,5,0,2,0,4,4,4,0,0,0,1,3,68,0.72340425531914898,""]
["Answers","","visual deformities/length measured","","","5 reps","5 control reps","","","0.22um filtered sea water","","","","","","","","","","",""]
["Category","MEW_nonplant","Paper and data unique identifier(eg. 1-1,10-150)","1027-8"]
["Scores",10,10,5,5,5,5,0,5,5,0,2,0,4,4,4,0,0,0,1,3,68,0.72340425531914898,""]
["Answers","","","","","5 reps","5 control reps","","","0.22um filtered sea water","","","","","","","","","","",""]
["Category","MEW_nonplant","Paper and data unique identifier(eg. 1-1,10-150)","1031-1"]
["Scores",10,5,5,5,5,5,2,5,5,0,2,0,4,4,4,1,1,1,1,3,68,0.72340425531914898,""]
["Answers","48h","","","","no-tox control and solvent control","","90% control survival","age","","","","","","","95% CI (20.40–31.73)","","","","",""]
["Category","MEW_nonplant","Paper and data unique identifier(eg. 1-1,10-150)","1031-2"]
["Scores",10,5,5,5,5,5,2,5,5,0,2,0,4,4,4,1,1,1,1,3,68,0.72340425531914898,""]
["Answers","48h","","","","no-tox control and solvent control","","90% control survival","age","","","","","","","","","","","",""]
["Category","MEW_nonplant","Paper and data unique identifier(eg. 1-1,10-150)","1031-3"]
["Scores",10,5,5,5,5,5,2,5,5,0,2,0,4,4,4,1,1,1,1,3,68,0.72340425531914898,""]
["Answers","48h","","","","no-tox control and solvent control","","90% control survival","age","","","","","","","","","","","",""]
["Category","MEW_nonplant","Paper and data unique identifier(eg. 1-1,10-150)","1031-4"]
["Scores",10,5,5,5,5,5,2,5,5,0,2,0,4,4,4,1,1,1,1,3,68,0.72340425531914898,""]
["Answers","48h","","","","no-tox control and solvent control","","90% control survival","age","","","","","","","95% CI (27.44–31.04)","","","","",""]
["Category","MEW_nonplant","Paper and data unique identifier(eg. 1-1,10-150)","1031-5"]
["Scores",10,5,5,5,5,5,2,5,5,0,2,0,4,4,4,1,1,1,1,3,68,0.72340425531914898,""]
["Answers","48h","","","","no-tox control and solvent control","","90% control survival","age","","","","","","","","","","","",""]
["Category","MEW_nonplant","Paper and data unique identifier(eg. 1-1,10-150)","1031-6"]
["Scores",10,5,5,5,5,5,2,5,5,0,2,0,4,4,4,1,1,1,1,3,68,0.72340425531914898,""]
["Answers","48h","","","","no-tox control and solvent control","","90% control survival","age","","","","","","","","","","","",""]
["Category","MEW_nonplant","Paper and data unique identifier(eg. 1-1,10-150)","1037-2"]
["Scores",10,5,5,5,5,5,2,5,5,0,2,0,0,4,4,1,1,1,1,3,64,0.68085106382978722,""]
["Answers","","","","","","","","","","","","","","","","","","","",""]
["Category","MEW_nonplant","Paper and data unique identifier(eg. 1-1,10-150)","1038-6"]
["Scores",10,5,5,5,5,5,5,5,5,0,2,0,4,4,4,1,0,1,1,3,70,0.74468085106382975,""]
["Answers","","","","","","","","","","","","","","","95% CI (10-14)","","","","",""]
["Category","MEW_nonplant","Paper and data unique identifier(eg. 1-1,10-150)","1038-7"]
["Scores",10,5,5,5,5,5,5,5,5,0,2,0,4,4,4,1,0,1,1,3,70,0.74468085106382975,""]
["Answers","","","","","","","","The length of the juvenile E. rapax from the proximal end of the first thoracic segment to the distal end of the fourth thoracic segment (Hacker and Steneck, 1990) ranged\nfrom 0.36 to 0.85 mm with an average of 0.54 mm","","","","","","","95% CI (53–84)","","","","",""]
["Category","MEW_nonplant","Paper and data unique identifier(eg. 1-1,10-150)","1038-8"]
["Scores",10,5,5,5,5,5,5,5,5,0,2,0,4,4,4,1,0,1,1,3,70,0.74468085106382975,""]
["Answers","","","","","","","","","","","","","","","95% CI (86–96)","","","","",""]
["Category","MEW_nonplant","Paper and data unique identifier(eg. 1-1,10-150)","1038-9"]
["Scores",10,5,5,5,5,5,5,5,5,0,2,0,4,4,4,1,0,1,1,3,70,0.74468085106382975,""]
["Answers","","","","","","","","","","","","","","","95% CI (100–110)","","","","",""]
["Category","MEW_nonplant","Paper and data unique identifier(eg. 1-1,10-150)","1042-1"]
["Scores",10,10,5,5,5,5,2,5,5,0,2,0,4,4,4,1,0,1,1,3,72,0.76595744680851063,""]
["Answers","","Dead copepods were\ndefined as the urosome at a right angle to the prosome (Finney\n1979) and counted once every 24 h. Occasionally, especially\nfor the 35°C treatment, partial dead bodies were observed,\nand only the head parts were counted as dead individuals.","","","","","","","","","","","","sigmoidal dose-response (variable slope) non-linear regression based on Hill’s model","95% CI ","","","","",""]
["Category","MEW_nonplant","Paper and data unique identifier(eg. 1-1,10-150)","1042-2"]
["Scores",10,10,5,5,5,5,2,5,5,0,2,0,4,4,4,1,0,1,1,3,72,0.76595744680851063,""]
["Answers","","Dead copepods were\ndefined as the urosome at a right angle to the prosome (Finney\n1979) and counted once every 24 h. Occasionally, especially\nfor the 35°C treatment, partial dead bodies were observed,\nand only the head parts were counted as dead individuals.","","","","","","","","","","","","sigmoidal dose-response (variable slope) non-linear regression based on Hill’s model","95% CI ","","","","",""]
["Category","MEW_nonplant","Paper and data unique identifier(eg. 1-1,10-150)","1042-3"]
["Scores",10,10,5,5,5,5,2,5,5,0,2,0,4,4,4,1,0,1,1,3,72,0.76595744680851063,""]
["Answers","","Dead copepods were\ndefined as the urosome at a right angle to the prosome (Finney\n1979) and counted once every 24 h. Occasionally, especially\nfor the 35°C treatment, partial dead bodies were observed,\nand only the head parts were counted as dead individuals.","","","","","","","","","","","","sigmoidal dose-response (variable slope) non-linear regression based on Hill’s model","95% CI (53.1–78.5)","","","","",""]
["Category","MEW_nonplant","Paper and data unique identifier(eg. 1-1,10-150)","1042-4"]
["Scores",10,10,5,5,5,5,2,5,5,0,2,0,4,4,4,1,0,1,1,3,72,0.76595744680851063,""]
["Answers","","Dead copepods were\ndefined as the urosome at a right angle to the prosome (Finney\n1979) and counted once every 24 h. Occasionally, especially\nfor the 35°C treatment, partial dead bodies were observed,\nand only the head parts were counted as dead individuals.","","","","","","","","","","","","sigmoidal dose-response (variable slope) non-linear regression based on Hill’s model","95% CI (88.6–107.1)","","","","",""]
["Category","MEW_nonplant","Paper and data unique identifier(eg. 1-1,10-150)","1042-5"]
["Scores",10,10,5,5,5,5,2,5,5,0,2,0,4,4,4,1,0,1,1,3,72,0.76595744680851063,""]
["Answers","","Dead copepods were\ndefined as the urosome at a right angle to the prosome (Finney\n1979) and counted once every 24 h. Occasionally, especially\nfor the 35°C treatment, partial dead bodies were observed,\nand only the head parts were counted as dead individuals.","","","","","","","","","","","","sigmoidal dose-response (variable slope) non-linear regression based on Hill’s model","95% CI (88.6–107.1)","","","","",""]
["Category","MEW_nonplant","Paper and data unique identifier(eg. 1-1,10-150)","1042-6"]
["Scores",10,10,5,5,5,5,2,5,5,0,2,0,4,4,4,1,0,1,1,3,72,0.76595744680851063,""]
["Answers","","Dead copepods were\ndefined as the urosome at a right angle to the prosome (Finney\n1979) and counted once every 24 h. Occasionally, especially\nfor the 35°C treatment, partial dead bodies were observed,\nand only the head parts were counted as dead individuals.","","","","","","","","","","","","sigmoidal dose-response (variable slope) non-linear regression based on Hill’s model","95% CI (88.6–107.1)","","","","",""]
["Category","MEW_nonplant","Paper and data unique identifier(eg. 1-1,10-150)","1042-7"]
["Scores",10,10,5,5,5,5,2,5,5,0,2,0,4,4,4,1,0,1,1,3,72,0.76595744680851063,""]
["Answers","","Dead copepods were\ndefined as the urosome at a right angle to the prosome (Finney\n1979) and counted once every 24 h. Occasionally, especially\nfor the 35°C treatment, partial dead bodies were observed,\nand only the head parts were counted as dead individuals.","","","","","","","","","","","","sigmoidal dose-response (variable slope) non-linear regression based on Hill’s model","95% CI (66.3–81.1)","","","","",""]
["Category","MEW_nonplant","Paper and data unique identifier(eg. 1-1,10-150)","1042-8"]
["Scores",10,10,5,5,5,5,2,5,5,0,2,0,4,4,4,1,0,1,1,3,72,0.76595744680851063,""]
["Answers","","Dead copepods were\ndefined as the urosome at a right angle to the prosome (Finney\n1979) and counted once every 24 h. Occasionally, especially\nfor the 35°C treatment, partial dead bodies were observed,\nand only the head parts were counted as dead individuals.","","","","","","","","","","","","sigmoidal dose-response (variable slope) non-linear regression based on Hill’s model","95% CI (90.5–102.6)","","","","",""]
["Category","MEW_nonplant","Paper and data unique identifier(eg. 1-1,10-150)","1042-9"]
["Scores",10,10,5,5,5,5,2,5,5,0,2,0,4,4,4,1,0,1,1,3,72,0.76595744680851063,""]
["Answers","","Dead copepods were\ndefined as the urosome at a right angle to the prosome (Finney\n1979) and counted once every 24 h. Occasionally, especially\nfor the 35°C treatment, partial dead bodies were observed,\nand only the head parts were counted as dead individuals.","","","","","","","","","","","","sigmoidal dose-response (variable slope) non-linear regression based on Hill’s model","95% CI (107.8–137.7)","","","","",""]
["Category","MEW_nonplant","Paper and data unique identifier(eg. 1-1,10-150)","1042-10"]
["Scores",10,10,5,5,5,5,2,5,5,0,2,0,4,4,4,1,0,1,1,3,72,0.76595744680851063,""]
["Answers","","Dead copepods were\ndefined as the urosome at a right angle to the prosome (Finney\n1979) and counted once every 24 h. Occasionally, especially\nfor the 35°C treatment, partial dead bodies were observed,\nand only the head parts were counted as dead individuals.","","","","","","","","","","","","sigmoidal dose-response (variable slope) non-linear regression based on Hill’s model","95% CI (159.9–176.2)","","","","",""]
["Category","MEW_nonplant","Paper and data unique identifier(eg. 1-1,10-150)","1042-11"]
["Scores",10,10,5,5,5,5,2,5,5,0,2,0,4,4,4,1,0,1,1,3,72,0.76595744680851063,""]
["Answers","","Dead copepods were\ndefined as the urosome at a right angle to the prosome (Finney\n1979) and counted once every 24 h. Occasionally, especially\nfor the 35°C treatment, partial dead bodies were observed,\nand only the head parts were counted as dead individuals.","","","","","","","","","","","","sigmoidal dose-response (variable slope) non-linear regression based on Hill’s model","95% CI (63.6–75.9)","","","","",""]
["Category","MEW_nonplant","Paper and data unique identifier(eg. 1-1,10-150)","1042-12"]
["Scores",10,10,5,5,5,5,2,5,5,0,2,0,4,4,4,1,0,1,1,3,72,0.76595744680851063,""]
["Answers","","Dead copepods were\ndefined as the urosome at a right angle to the prosome (Finney\n1979) and counted once every 24 h. Occasionally, especially\nfor the 35°C treatment, partial dead bodies were observed,\nand only the head parts were counted as dead individuals.","","","","","","","","","","","","sigmoidal dose-response (variable slope) non-linear regression based on Hill’s model","95% CI (85.5–95.9)","","","","",""]
["Category","MEW_nonplant","Paper and data unique identifier(eg. 1-1,10-150)","1042-13"]
["Scores",10,10,5,5,5,5,2,5,5,0,2,0,4,4,4,1,0,1,1,3,72,0.76595744680851063,""]
["Answers","","Dead copepods were\ndefined as the urosome at a right angle to the prosome (Finney\n1979) and counted once every 24 h. Occasionally, especially\nfor the 35°C treatment, partial dead bodies were observed,\nand only the head parts were counted as dead individuals.","","","","","","","","","","","","sigmoidal dose-response (variable slope) non-linear regression based on Hill’s model","95% CI (57.2–80.7)","","","","",""]
["Category","MEW_nonplant","Paper and data unique identifier(eg. 1-1,10-150)","1042-14"]
["Scores",10,10,5,5,5,5,2,5,5,0,2,0,4,4,4,1,0,1,1,3,72,0.76595744680851063,""]
["Answers","","Dead copepods were\ndefined as the urosome at a right angle to the prosome (Finney\n1979) and counted once every 24 h. Occasionally, especially\nfor the 35°C treatment, partial dead bodies were observed,\nand only the head parts were counted as dead individuals.","","","","","","","","","","","","sigmoidal dose-response (variable slope) non-linear regression based on Hill’s model","95% CI (89.5–106.4)","","","","",""]
["Category","MEW_nonplant","Paper and data unique identifier(eg. 1-1,10-150)","1042-15"]
["Scores",10,10,5,5,5,5,2,5,5,0,2,0,4,4,4,1,0,1,1,3,72,0.76595744680851063,""]
["Answers","","Dead copepods were\ndefined as the urosome at a right angle to the prosome (Finney\n1979) and counted once every 24 h. Occasionally, especially\nfor the 35°C treatment, partial dead bodies were observed,\nand only the head parts were counted as dead individuals.","","","","","","","","","","","","sigmoidal dose-response (variable slope) non-linear regression based on Hill’s model","95% CI (27.6–69.2)","","","","",""]
["Category","MEW_nonplant","Paper and data unique identifier(eg. 1-1,10-150)","1042-16"]
["Scores",10,10,5,5,5,5,2,5,5,0,2,0,4,4,4,1,0,1,1,3,72,0.76595744680851063,""]
["Answers","","Dead copepods were\ndefined as the urosome at a right angle to the prosome (Finney\n1979) and counted once every 24 h. Occasionally, especially\nfor the 35°C treatment, partial dead bodies were observed,\nand only the head parts were counted as dead individuals.","","","","","","","","","","","","sigmoidal dose-response (variable slope) non-linear regression based on Hill’s model","95% CI (44.2–80.7)","","","","",""]
["Category","MEW_nonplant","Paper and data unique identifier(eg. 1-1,10-150)","1042-17"]
["Scores",10,10,5,5,5,5,2,5,5,0,2,0,4,4,4,1,0,1,1,3,72,0.76595744680851063,""]
["Answers","","Dead copepods were\ndefined as the urosome at a right angle to the prosome (Finney\n1979) and counted once every 24 h. Occasionally, especially\nfor the 35°C treatment, partial dead bodies were observed,\nand only the head parts were counted as dead individuals.","","","","","","","","","","","","sigmoidal dose-response (variable slope) non-linear regression based on Hill’s model","95% CI (1.9–527.0)","","","","",""]
["Category","MEW_nonplant","Paper and data unique identifier(eg. 1-1,10-150)","1042-18"]
["Scores",10,10,5,5,5,5,2,5,5,0,2,0,4,4,4,1,0,1,1,3,72,0.76595744680851063,""]
["Answers","","Dead copepods were\ndefined as the urosome at a right angle to the prosome (Finney\n1979) and counted once every 24 h. Occasionally, especially\nfor the 35°C treatment, partial dead bodies were observed,\nand only the head parts were counted as dead individuals.","","","","","","","","","","","","sigmoidal dose-response (variable slope) non-linear regression based on Hill’s model","95% CI (21.7–94.9)","","","","",""]
["Category","MEW_nonplant","Paper and data unique identifier(eg. 1-1,10-150)","1045-1"]
["Scores",10,5,0,5,5,5,0,0,5,0,0,0,4,0,0,1,1,1,3,0,45,0.47872340425531917,"The highest possible grade for this datum is acceptable."]
["Answers","","","","","","","","","","","","","","","","","","only measured not stated","",""]
["Category","MEW_nonplant","Paper and data unique identifier(eg. 1-1,10-150)","1045-2"]
["Scores",10,5,0,5,5,5,0,0,5,0,0,0,4,0,0,1,1,1,3,0,45,0.47872340425531917,"The highest possible grade for this datum is acceptable."]
["Answers","","","","","","","","","","","","","","","","","","only measured not stated","",""]
["Category","MEW_nonplant","Paper and data unique identifier(eg. 1-1,10-150)","1045-3"]
["Scores",10,5,0,5,5,5,0,0,5,0,0,0,4,0,0,1,1,1,3,0,45,0.47872340425531917,"The highest possible grade for this datum is acceptable."]
["Answers","","","","","","","","","","","","","","","","","","only measured not stated","",""]
["Category","MEW_nonplant","Paper and data unique identifier(eg. 1-1,10-150)","1045-4"]
["Scores",10,5,0,5,5,5,0,0,5,0,0,0,4,0,0,1,1,1,3,0,45,0.47872340425531917,"The highest possible grade for this datum is acceptable."]
["Answers","","","","","","","","","","","","","","","","","","only measured not stated","",""]
["Category","MEW_nonplant","Paper and data unique identifier(eg. 1-1,10-150)","1045-5"]
["Scores",10,5,0,5,5,5,0,0,5,0,0,0,4,0,0,1,1,1,3,0,45,0.47872340425531917,"The highest possible grade for this datum is acceptable."]
["Answers","","","","","","","","","","","","","","","","","","only measured not stated","",""]
["Category","MEW_nonplant","Paper and data unique identifier(eg. 1-1,10-150)","1045-6"]
["Scores",10,5,0,5,5,5,0,0,5,0,0,0,4,0,0,1,1,1,3,0,45,0.47872340425531917,"The highest possible grade for this datum is acceptable."]
["Answers","","","","","","","","","","","","","","","","","","only measured not stated","",""]
["Category","MEW_nonplant","Paper and data unique identifier(eg. 1-1,10-150)","1048-1"]
["Scores",10,5,0,0,5,5,0,5,5,4,2,0,4,0,0,3,0,0,1,0,49,0.52127659574468088,""]
["Answers","","","","","","","","","","flow","","","","","","","","","",""]
["Category","MEW_nonplant","Paper and data unique identifier(eg. 1-1,10-150)","1054-1"]
["Scores",10,10,5,5,5,5,2,5,5,0,2,0,4,4,4,3,3,0,3,3,78,0.82978723404255317,""]
["Answers","","","","","","","","","","","","","","","95% CI (671.1–804.7)","","","","",">98% purity"]
["Category","MEW_nonplant","Paper and data unique identifier(eg. 1-1,10-150)","1054-2"]
["Scores",10,10,5,5,5,5,2,5,5,0,2,0,4,4,4,3,3,0,3,3,78,0.82978723404255317,""]
["Answers","","","","","","","","","","","","","","","95% CI (331.3–473.4)","","","","",">98% purity"]
["Category","MEW_nonplant","Paper and data unique identifier(eg. 1-1,10-150)","1054-3"]
["Scores",10,10,5,5,5,5,2,5,5,0,2,0,4,4,4,3,3,0,3,3,78,0.82978723404255317,""]
["Answers","","","","","","","","","","","","","","","95% CI","","","","",">98% purity"]
["Category","MEW_nonplant","Paper and data unique identifier(eg. 1-1,10-150)","1054-4"]
["Scores",10,10,5,5,5,5,2,5,5,0,2,0,4,4,4,3,3,0,3,3,78,0.82978723404255317,""]
["Answers","","","","","","","","","","","","","","","95% CI","","","","",">98% purity"]
["Category","MEW_nonplant","Paper and data unique identifier(eg. 1-1,10-150)","1054-5"]
["Scores",10,10,5,5,5,5,2,5,5,0,2,0,4,4,4,3,3,3,3,3,81,0.86170212765957444,""]
["Answers","","","","","","","","","","","","","","","95% CI (163.6–253.8)","","","","",">98% purity"]
["Category","MEW_nonplant","Paper and data unique identifier(eg. 1-1,10-150)","1054-6"]
["Scores",10,10,5,5,5,5,2,5,5,0,2,0,4,4,4,3,3,3,3,3,81,0.86170212765957444,""]
["Answers","","","","","","","","","","","","","","","95% CI  (120.3–194.5)","","","","",">98% purity"]
["Category","MEW_nonplant","Paper and data unique identifier(eg. 1-1,10-150)","1054-7"]
["Scores",10,10,5,5,5,5,2,5,5,0,2,0,4,4,4,3,3,3,3,3,81,0.86170212765957444,""]
["Answers","","","","","","","","","","","","","","","95% CI ","","","","",">98% purity"]
["Category","MEW_nonplant","Paper and data unique identifier(eg. 1-1,10-150)","1054-8"]
["Scores",10,10,5,5,5,5,2,5,5,0,2,0,4,4,4,3,3,3,3,3,81,0.86170212765957444,""]
["Answers","","","","","","","","","","","","","","","95% CI ","","","","",">98% purity"]
["Category","MEW_nonplant","Paper and data unique identifier(eg. 1-1,10-150)","1054-9"]
["Scores",10,10,5,5,5,5,2,5,5,0,2,0,4,4,4,3,3,3,3,3,81,0.86170212765957444,""]
["Answers","","","","","","","","","","","","","","","95% CI (113.0–151.7)","","","","",">98% purity"]
["Category","MEW_nonplant","Paper and data unique identifier(eg. 1-1,10-150)","1054-10"]
["Scores",10,10,5,5,5,5,2,5,5,0,2,0,4,4,4,3,3,3,3,3,81,0.86170212765957444,""]
["Answers","","","","","","","","","","","","","","","95% CI (44.4–55.27)","","","","",">98% purity"]
["Category","MEW_nonplant","Paper and data unique identifier(eg. 1-1,10-150)","1054-11"]
["Scores",10,10,5,5,5,5,2,5,5,0,2,0,4,4,4,3,3,3,3,3,81,0.86170212765957444,""]
["Answers","","","","","","","","","","","","","","","95% CI","","","","",">98% purity"]
["Category","MEW_nonplant","Paper and data unique identifier(eg. 1-1,10-150)","1054-12"]
["Scores",10,10,5,5,5,5,2,5,5,0,2,0,4,4,4,3,3,3,3,3,81,0.86170212765957444,""]
["Answers","","","","","","","","","","","","","","","95% CI","","","","",">98% purity"]
["Category","MEW_nonplant","Paper and data unique identifier(eg. 1-1,10-150)","1054-13"]
["Scores",10,10,5,5,5,5,2,5,5,0,2,0,4,4,4,3,3,3,3,3,81,0.86170212765957444,""]
["Answers","","","","","","","","","","","","","","","95% CI (170.4–185.2)","","","","",">98% purity"]
["Category","MEW_nonplant","Paper and data unique identifier(eg. 1-1,10-150)","1054-14"]
["Scores",10,10,5,5,5,5,2,5,5,0,2,0,4,4,4,3,3,3,3,3,81,0.86170212765957444,""]
["Answers","","","","","","","","","","","","","","","95% CI (167.8–180.7)","","","","",">98% purity"]
["Category","MEW_nonplant","Paper and data unique identifier(eg. 1-1,10-150)","1054-15"]
["Scores",10,10,5,5,5,5,2,5,5,0,2,0,4,4,4,3,3,3,3,3,81,0.86170212765957444,""]
["Answers","","","","","","","","","","","","","","","95% CI (H56162.4–179.8)","","","","",">98% purity"]
["Category","MEW_nonplant","Paper and data unique identifier(eg. 1-1,10-150)","1054-15"]
["Scores",10,10,5,5,5,5,2,5,5,0,2,0,4,4,4,3,3,3,3,3,81,0.86170212765957444,""]
["Answers","","","","","","","","","","","","","","","95% CI (135.2–198.3)","","","","",">98% purity"]
["Category","MEW_nonplant","Paper and data unique identifier(eg. 1-1,10-150)","1054-17"]
["Scores",10,10,5,5,5,5,2,5,5,0,2,0,4,4,4,3,3,3,3,3,81,0.86170212765957444,""]
["Answers","","","","","","","","","","","","","","","95% CI (105.1–187.8)","","","","",">98% purity"]
["Category","MEW_nonplant","Paper and data unique identifier(eg. 1-1,10-150)","1054-18"]
["Scores",10,10,5,5,5,5,2,5,5,0,2,0,4,4,4,3,3,3,3,3,81,0.86170212765957444,""]
["Answers","","","","","","","","","","","","","","","95% CI (63.78–139.4)","","","","",">98% purity"]
["Category","MEW_nonplant","Paper and data unique identifier(eg. 1-1,10-150)","1054-19"]
["Scores",10,10,5,5,5,5,2,5,5,0,2,0,4,4,4,3,3,3,3,3,81,0.86170212765957444,""]
["Answers","","","","","","","","","","","","","","","95% CI (57.33–115.3)","","","","",">98% purity"]
["Category","MEW_nonplant","Paper and data unique identifier(eg. 1-1,10-150)","1054-20"]
["Scores",10,10,5,5,5,5,2,5,5,0,2,0,4,4,4,3,3,3,3,3,81,0.86170212765957444,""]
["Answers","","","","","","","","","","","","","","","95% CI (50.78–102.7)","","","","",">98% purity"]
["Category","MEW_nonplant","Paper and data unique identifier(eg. 1-1,10-150)","1055-1"]
["Scores",10,5,5,5,5,5,2,5,5,4,2,0,4,4,4,3,1,3,3,0,75,0.7978723404255319,""]
["Answers","","","","","","","","","","static renewal","","","","","95% CI  (276.1–423.5)","","","","",""]
["Category","MEW_nonplant","Paper and data unique identifier(eg. 1-1,10-150)","1055-2"]
["Scores",10,5,5,5,5,5,2,5,5,4,2,0,4,4,4,3,1,3,3,0,75,0.7978723404255319,""]
["Answers","","","","","","","","","","static renewal","","","","","95% CI  (42.74–56.26)","","","","",""]
["Category","MEW_nonplant","Paper and data unique identifier(eg. 1-1,10-150)","1055-3"]
["Scores",10,5,5,5,5,5,2,5,5,4,2,0,4,4,4,3,1,3,3,0,75,0.7978723404255319,""]
["Answers","","","","","","","","","","static renewal","","","","","95% CI  (256.4–378.0)","","","","",""]
["Category","MEW_nonplant","Paper and data unique identifier(eg. 1-1,10-150)","1055-4"]
["Scores",10,5,5,5,5,5,2,5,5,4,2,0,4,4,4,3,1,3,3,0,75,0.7978723404255319,""]
["Answers","","","","","","","","","","static renewal","","","","","95% CI (34.03–46.43)","","","","",""]
["Category","MEW_nonplant","Paper and data unique identifier(eg. 1-1,10-150)","1055-5"]
["Scores",10,5,5,5,5,5,2,5,5,4,2,0,4,4,4,3,1,3,3,0,75,0.7978723404255319,""]
["Answers","","","","","","","","","","static renewal","","","","","95% CI (78.92–169.1)","","","","",""]
["Category","MEW_nonplant","Paper and data unique identifier(eg. 1-1,10-150)","1055-6"]
["Scores",10,5,5,5,5,5,2,5,5,4,2,0,4,4,4,3,1,3,3,0,75,0.7978723404255319,""]
["Answers","","","","","","","","","","static renewal","","","","","95% CI (76.10–149.1)","","","","",""]
["Category","MEW_nonplant","Paper and data unique identifier(eg. 1-1,10-150)","1055-7"]
["Scores",10,5,5,5,5,5,2,5,5,4,2,0,4,4,4,3,1,3,3,0,75,0.7978723404255319,""]
["Answers","","","","","","","","","","static renewal","","","","","95% CI (399.5–569.2)","","","","",""]
["Category","MEW_nonplant","Paper and data unique identifier(eg. 1-1,10-150)","1055-8"]
["Scores",10,5,5,5,5,5,2,5,5,4,2,0,4,4,4,3,1,3,3,0,75,0.7978723404255319,""]
["Answers","","","","","","","","","","static renewal","","","","","95% CI (127.8–191.7)","","","","",""]
["Category","MEW_nonplant","Paper and data unique identifier(eg. 1-1,10-150)","1055-9"]
["Scores",10,5,5,5,5,5,2,5,5,4,2,0,4,4,4,3,1,3,3,0,75,0.7978723404255319,""]
["Answers","","","","","","","","","","static renewal","","","","","95% CI (393.6–586.4)","","","","",""]
["Category","MEW_nonplant","Paper and data unique identifier(eg. 1-1,10-150)","1055-10"]
["Scores",10,5,5,5,5,5,2,5,5,4,2,0,4,4,4,3,1,3,3,0,75,0.7978723404255319,""]
["Answers","","","","","","","","","","static renewal","","","","","95% CI (92.62–144.7)","","","","",""]
["Category","MEW_nonplant","Paper and data unique identifier(eg. 1-1,10-150)","1055-11"]
["Scores",10,5,5,5,5,5,2,5,5,4,2,0,4,4,4,3,1,3,3,0,75,0.7978723404255319,""]
["Answers","","","","","","","","","","static renewal","","","","","95% CI (68.76–159.0)","","","","",""]
["Category","MEW_nonplant","Paper and data unique identifier(eg. 1-1,10-150)","1055-12"]
["Scores",10,5,5,5,5,5,2,5,5,4,2,0,4,4,4,3,1,3,3,0,75,0.7978723404255319,""]
["Answers","","","","","","","","","","static renewal","","","","","95% CI (4.88–45.86)","","","","",""]
["Category","MEW_nonplant","Paper and data unique identifier(eg. 1-1,10-150)","1055-13"]
["Scores",10,5,5,5,5,5,2,5,5,4,2,0,4,4,4,3,1,3,3,0,75,0.7978723404255319,""]
["Answers","","","","","","","","","","static renewal","","","","","95% CI (129.1–178.6)","","","","",""]
["Category","MEW_nonplant","Paper and data unique identifier(eg. 1-1,10-150)","1055-14"]
["Scores",10,5,5,5,5,5,2,5,5,4,2,0,4,4,4,3,1,3,3,0,75,0.7978723404255319,""]
["Answers","","","","","","","","","","static renewal","","","","","95% CI ( 25.34–57.79)","","","","",""]
["Category","MEW_nonplant","Paper and data unique identifier(eg. 1-1,10-150)","1025-1"]
["Scores",10,5,5,5,5,5,2,5,5,4,2,0,4,4,4,1,1,1,3,3,74,0.78723404255319152,""]
["Answers","","","","","","","","","","static","","","","","95% CI  (5.23–7.5)","","","","","98% pure"]
["Category","MEW_nonplant","Paper and data unique identifier(eg. 1-1,10-150)","1025-2"]
["Scores",10,5,5,5,5,5,2,5,5,4,2,0,4,4,4,1,1,1,3,3,74,0.78723404255319152,""]
["Answers","","","","","","","","","","static","","","","","95% CI (3.25–4.46)","","","","","98% pure"]
["Category","MEW_nonplant","Paper and data unique identifier(eg. 1-1,10-150)","1025-3"]
["Scores",10,5,5,5,5,5,2,5,5,4,2,0,4,4,4,1,1,1,3,3,74,0.78723404255319152,""]
["Answers","","","","","","","","","","static","","","","","95% CI (0.99–2.17)","","","","","98% pure"]
["Category","MEW_nonplant","Paper and data unique identifier(eg. 1-1,10-150)","1025-4"]
["Scores",10,5,5,5,5,5,2,5,5,4,2,0,4,4,4,1,1,1,3,3,74,0.78723404255319152,""]
["Answers","","","","","","","","","","static","","","","","95% CI (4.13–6.24)","","","","","98% pure"]
["Category","MEW_nonplant","Paper and data unique identifier(eg. 1-1,10-150)","1025-5"]
["Scores",10,5,5,5,5,5,2,5,5,4,2,0,4,4,4,1,1,1,3,3,74,0.78723404255319152,""]
["Answers","","","","","","","","","","static","","","","","95% CI (4.13–6.24)","","","","","98% pure"]
["Category","MEW_nonplant","Paper and data unique identifier(eg. 1-1,10-150)","1025-6"]
["Scores",10,5,5,5,5,5,2,5,5,4,2,0,4,4,4,1,1,1,3,3,74,0.78723404255319152,""]
["Answers","","","","","","","","","","static","","","","","95% CI (4.13–6.24)","","","","","98% pure"]
["Category","MEW_nonplant","Paper and data unique identifier(eg. 1-1,10-150)","1062-1"]
["Scores",10,5,0,5,5,5,2,5,5,0,2,0,0,0,0,3,3,3,3,3,59,0.62765957446808507,""]
["Answers","","","","","","","","","","","","","","","","ATSM std method","ATSM std method","ATSM std method","ATSM std method","98.4% pure"]
["Category","MEW_nonplant","Paper and data unique identifier(eg. 1-1,10-150)","1062-2"]
["Scores",10,5,0,5,5,5,2,5,5,0,2,0,0,0,0,3,3,3,3,3,59,0.62765957446808507,""]
["Answers","","","","","","","","","","","","","","","","ATSM std method","ATSM std method","ATSM std method","ATSM std method","98.4% pure"]
["Category","MEW_nonplant","Paper and data unique identifier(eg. 1-1,10-150)","1062-3"]
["Scores",10,5,0,5,5,5,2,5,5,0,2,0,0,0,0,3,3,3,3,3,59,0.62765957446808507,""]
["Answers","","","","","","","","","","","","","","","","ATSM std method","ATSM std method","ATSM std method","ATSM std method","98.4% pure"]
["Category","MEW_nonplant","Paper and data unique identifier(eg. 1-1,10-150)","1063-1"]
["Scores",10,5,0,0,5,5,2,5,5,0,4,0,4,0,0,1,1,1,3,3,54,0.57446808510638303,""]
["Answers","","","","","","","","","","microwell","","","","","","","","","","98% purity"]
["Category","MEW_nonplant","Paper and data unique identifier(eg. 1-1,10-150)","1063-2"]
["Scores",10,5,0,0,5,5,2,5,5,0,4,0,4,0,0,1,1,1,3,3,54,0.57446808510638303,""]
["Answers","","","","","","","","","","microwell","","","","","","","","","","98% purity"]
["Category","MEW_nonplant","Paper and data unique identifier(eg. 1-1,10-150)","1063-3"]
["Scores",10,5,0,0,5,5,2,5,5,0,4,0,4,0,0,1,1,1,3,3,54,0.57446808510638303,""]
["Answers","","","","","","","","","","microwell","","","","","","","","","","98% purity"]
["Category","MEW_nonplant","Paper and data unique identifier(eg. 1-1,10-150)","1064-1"]
["Scores",10,5,5,5,5,5,2,5,5,4,4,0,4,4,4,1,1,1,3,3,76,0.80851063829787229,""]
["Answers","","","","","","","","sex","","static","","","","","2.5-5.0 95% CL","","","","",""]
["Category","MEW_nonplant","Paper and data unique identifier(eg. 1-1,10-150)","1064-2"]
["Scores",10,5,5,5,5,5,2,5,5,4,4,0,4,4,4,1,1,1,3,3,76,0.80851063829787229,""]
["Answers","","","","","","","","sex","","static","","","","","9.6–17.6 95% CL","","","","",""]
["Category","MEW_nonplant","Paper and data unique identifier(eg. 1-1,10-150)","1064-3"]
["Scores",10,5,5,5,5,5,2,5,5,4,4,0,4,4,4,1,1,1,3,3,76,0.80851063829787229,""]
["Answers","","","","","","","","sex","","static","","","","","5.4–8.7, 95% CL","","","","",""]
["Category","MEW_nonplant","Paper and data unique identifier(eg. 1-1,10-150)","1064-4"]
["Scores",10,5,5,5,5,5,2,5,5,4,4,0,4,4,4,1,1,1,3,3,76,0.80851063829787229,""]
["Answers","","","","","","","","","","static","","","","","","","","","",""]
["Category","MEW_nonplant","Paper and data unique identifier(eg. 1-1,10-150)","1064-5"]
["Scores",10,5,5,5,5,5,2,5,5,4,4,0,4,4,4,1,1,1,3,3,76,0.80851063829787229,""]
["Answers","","","","","","","","","","static","","","","","","","","","",""]
["Category","MEW_nonplant","Paper and data unique identifier(eg. 1-1,10-150)","1064-6"]
["Scores",10,5,5,5,5,5,2,5,5,4,4,0,4,4,4,1,1,1,3,3,76,0.80851063829787229,""]
["Answers","","","","","","","","","","static","","","","","","","","","",""]
["Category","MEW_nonplant","Paper and data unique identifier(eg. 1-1,10-150)","1064-7"]
["Scores",10,5,5,5,5,5,2,5,5,4,4,0,4,4,4,1,1,1,3,3,76,0.80851063829787229,""]
["Answers","","","","","","","","","","static","","","","","","","","","",""]
["Category","MEW_nonplant","Paper and data unique identifier(eg. 1-1,10-150)","1068-1"]
["Scores",10,5,5,5,5,5,2,5,0,4,2,0,0,4,4,3,1,0,3,0,63,0.67021276595744683,""]
["Answers","","","","","","","","","","","","","","","95% CL (0.57-0.80)","","","","",""]
["Category","MEW_nonplant","Paper and data unique identifier(eg. 1-1,10-150)","1068-2"]
["Scores",10,5,5,5,5,5,2,5,0,4,2,0,0,4,4,3,1,0,3,0,63,0.67021276595744683,""]
["Answers","","","","","","","","","","","","","","","","","","","",""]
["Category","MEW_nonplant","Paper and data unique identifier(eg. 1-1,10-150)","1068-3"]
["Scores",10,5,5,5,5,5,2,5,0,4,2,0,0,4,4,3,1,0,3,0,63,0.67021276595744683,""]
["Answers","","","","","","","","","","","","","","","","","","","",""]
["Category","MEW_nonplant","Paper and data unique identifier(eg. 1-1,10-150)","1068-4"]
["Scores",10,5,5,5,5,5,2,5,0,4,2,0,0,4,4,3,1,0,3,0,63,0.67021276595744683,""]
["Answers","","","","","","","","","","","","","","","","","","","",""]
["Category","MEW_nonplant","Paper and data unique identifier(eg. 1-1,10-150)","1068-5"]
["Scores",10,5,5,5,5,5,2,5,0,4,2,0,0,4,4,3,1,0,3,0,63,0.67021276595744683,""]
["Answers","","","","","","","","","","","","","","","","","","","",""]
["Category","MEW_nonplant","Paper and data unique identifier(eg. 1-1,10-150)","1068-6"]
["Scores",10,5,5,5,5,5,2,5,0,4,2,0,0,4,4,3,1,0,3,0,63,0.67021276595744683,""]
["Answers","","","","","","","","","","","","","","","(0.24-0.31) 95% CL","","","","",""]
["Category","MEW_nonplant","Paper and data unique identifier(eg. 1-1,10-150)","1068-7"]
["Scores",10,5,5,5,5,5,2,5,0,4,2,0,0,4,4,3,1,0,3,0,63,0.67021276595744683,""]
["Answers","","","","","","","","","","","","","","","95% CL","","","","",""]
["Category","MEW_nonplant","Paper and data unique identifier(eg. 1-1,10-150)","1068-8"]
["Scores",10,5,5,5,5,5,2,5,0,4,2,0,0,4,4,3,1,0,3,0,63,0.67021276595744683,""]
["Answers","","","","","","","","","","","","","","","95% CL","","","","",""]
["Category","MEW_nonplant","Paper and data unique identifier(eg. 1-1,10-150)","1068-9"]
["Scores",10,5,5,5,5,5,2,5,0,4,2,0,0,4,4,3,1,0,3,0,63,0.67021276595744683,""]
["Answers","","","","","","","","","","","","","","","95% CL","","","","",""]
["Category","MEW_nonplant","Paper and data unique identifier(eg. 1-1,10-150)","1068-10"]
["Scores",10,5,5,5,5,5,2,5,0,4,2,0,0,4,4,3,1,0,3,0,63,0.67021276595744683,""]
["Answers","","","","","","","","","","","","","","","95% CL","","","","",""]
["Category","MEW_nonplant","Paper and data unique identifier(eg. 1-1,10-150)","1068-11"]
["Scores",10,5,5,5,5,5,2,5,0,4,2,0,0,4,4,3,1,0,3,0,63,0.67021276595744683,""]
["Answers","","","","","","","","","","","","","","","95% CL","","","","",""]
["Category","MEW_nonplant","Paper and data unique identifier(eg. 1-1,10-150)","1084-1"]
["Scores",10,10,0,0,5,5,2,5,5,0,4,0,4,0,0,1,1,1,3,3,59,0.62765957446808507,""]
["Answers","","","","","","","","","","","","","","","","","","","","98% pure"]
["Category","MEW_nonplant","Paper and data unique identifier(eg. 1-1,10-150)","1084-2"]
["Scores",10,10,0,0,5,5,2,5,5,0,4,0,4,0,0,1,1,1,3,3,59,0.62765957446808507,""]
["Answers","","","","","","","","","","","","","","","","","","","","98% pure"]
["Category","MEW_nonplant","Paper and data unique identifier(eg. 1-1,10-150)","1084-3"]
["Scores",10,10,0,0,5,5,2,5,5,0,4,0,4,0,0,1,1,1,3,3,59,0.62765957446808507,""]
["Answers","","","","","","","","","","","","","","","","","","","","98% pure"]
["Category","MEW_nonplant","Paper and data unique identifier(eg. 1-1,10-150)","1084-4"]
["Scores",10,10,0,0,5,5,2,5,5,0,4,0,4,0,0,1,1,1,3,3,59,0.62765957446808507,""]
["Answers","","","","","","","","","","","","","","","","","","","","98% pure"]
["Category","MEW_nonplant","Paper and data unique identifier(eg. 1-1,10-150)","1088-1"]
["Scores",10,5,0,0,5,5,0,5,5,0,4,0,4,0,0,3,3,3,3,3,58,0.61702127659574468,""]
["Answers","","","","","","","","","","","collected every 24h","","","","","","","","","analytical grade"]
["Category","MEW_nonplant","Paper and data unique identifier(eg. 1-1,10-150)","1088-2"]
["Scores",10,5,5,5,5,5,0,5,5,0,4,0,4,4,4,3,3,3,3,3,76,0.80851063829787229,""]
["Answers","","","","","","","","","","","collected every 24h","","","","95% CL (261-533)","","","","","analytical grade"]
["Category","MEW_nonplant","Paper and data unique identifier(eg. 1-1,10-150)","1088-3"]
["Scores",10,5,0,0,5,5,0,5,5,0,4,0,4,0,0,3,3,3,3,3,58,0.61702127659574468,""]
["Answers","","","","","","","","","","","collected every 24h","","","","95% CL (261-533)","","","","","analytical grade"]
["Category","MEW_nonplant","Paper and data unique identifier(eg. 1-1,10-150)","1088-4"]
["Scores",10,5,0,0,5,5,0,5,5,0,4,0,4,0,0,3,3,3,3,3,58,0.61702127659574468,""]
["Answers","","","","","","","","","","","collected every 24h","","","","95% CL","","","","","analytical grade"]
["Category","MEW_nonplant","Paper and data unique identifier(eg. 1-1,10-150)","1088-5"]
["Scores",10,5,0,0,5,5,0,5,5,0,4,0,4,0,0,3,3,3,3,3,58,0.61702127659574468,""]
["Answers","","","","","","","","","","","collected every 24h","","","","95% CL","","","","","analytical grade"]
["Category","MEW_nonplant","Paper and data unique identifier(eg. 1-1,10-150)","1088-6"]
["Scores",10,5,0,0,5,5,0,5,5,0,4,0,4,0,0,3,3,3,3,3,58,0.61702127659574468,""]
["Answers","","","","","","","","","","","collected every 24h","","","","95% CL","","","","","analytical grade"]
["Category","MEW_nonplant","Paper and data unique identifier(eg. 1-1,10-150)","1093-3"]
["Scores",10,10,5,5,5,5,5,5,5,4,4,0,0,4,4,1,1,1,1,3,78,0.82978723404255317,""]
["Answers","","","","","","","Tests were considered valid if control mortality was<10%.","","","static renewed after 24hr","once beginning, once ending","","","","95% CL (0.24-0.41)","","","","",""]
["Category","MEW_nonplant","Paper and data unique identifier(eg. 1-1,10-150)","1093-4"]
["Scores",10,10,5,5,5,5,5,5,5,4,4,0,0,4,4,1,1,1,1,3,78,0.82978723404255317,""]
["Answers","","","","","","","Tests were considered valid if control mortality was<10%.","","","static renewed after 24hr","once beginning, once ending","","","","95% CL (0.57-0.80)","","","","",""]
["Category","MEW_nonplant","Paper and data unique identifier(eg. 1-1,10-150)","1093-5"]
["Scores",10,10,5,5,5,5,5,5,5,4,4,0,0,4,4,1,1,1,1,3,78,0.82978723404255317,""]
["Answers","","","","","","","Tests were considered valid if control mortality was<10%.","","","static renewed after 24hr","once beginning, once ending","","","","95% CL","","","","",""]
["Category","MEW_nonplant","Paper and data unique identifier(eg. 1-1,10-150)","1093-6"]
["Scores",10,10,5,5,5,5,5,5,5,4,4,0,0,4,4,1,1,1,1,3,78,0.82978723404255317,""]
["Answers","","","","","","","Tests were considered valid if control mortality was<10%.","","","static renewed after 24hr","once beginning, once ending","","","","95% CL (46.0-674.0)","","","","",""]
["Category","MEW_nonplant","Paper and data unique identifier(eg. 1-1,10-150)","1063-1-OK"]
["Scores",10,5,0,0,5,5,0,5,5,4,0,0,0,4,4,1,1,1,3,3,56,0.5957446808510638,"The highest possible grade for this datum is acceptable."]
["Answers","32 day assay period","Survival rates (larvae to adult)","","","Acetone carrier control","Triplicate. For each sample, an internal standard was added to the sample.","Not stated","Naupliar <24 hour old meiobenthic copepods","0.22 um filtered synthetic seawater (30 ppt,\nInstant Ocean)","Every 3 d, 90% of the overlying treatment solution was removed and replaced with 200 uLof fresh treatment solution to ensure proper water quality and a consistent exposure.","Nominal spike concentrations were measured using a liquid:liquid methyl tert-butyl ether (MTBE) extraction technique. GC-measured concentrations of all exposure treatments consistenly ranged from 82-108% of nominal values; therefore, all concentrations are reported hereafter as the nominal a priori targeted values.","","Not shown or stated","SEE: Statistical analyses of fipronil effects.",0.05,"Dissolved oxygen, salinity, and pH were measured in fresh treatment solutions every 3 d to ensure suitable water quality.","Dissolved oxygen, salinity, and pH were measured in fresh treatment solutions every 3 d to ensure suitable water quality.","Dissolved oxygen, salinity, and pH were measured in fresh treatment solutions every 3 d to ensure suitable water quality.","25 °C","Technical grade fipronil"]
["Category","MEW_nonplant","Paper and data unique identifier(eg. 1-1,10-150)","1063-2-OK"]
["Scores",10,5,0,0,5,5,0,5,5,4,0,0,0,4,4,1,1,1,3,3,56,0.5957446808510638,"The highest possible grade for this datum is acceptable."]
["Answers","32 day assay period","Survival rates (larvae to adult)","","","Acetone carrier control","Triplicate. For each sample, an internal standard was added to the sample.","Not stated","Naupliar <24 hour old meiobenthic copepods","0.22 um filtered synthetic seawater (30 ppt,\nInstant Ocean)","Every 3 d, 90% of the overlying treatment solution was removed and replaced with 200 uLof fresh treatment solution to ensure proper water quality and a consistent exposure.","Nominal spike concentrations were measured using a liquid:liquid methyl tert-butyl ether (MTBE) extraction technique. GC-measured concentrations of all exposure treatments consistenly ranged from 82-108% of nominal values; therefore, all concentrations are reported hereafter as the nominal a priori targeted values.","","Not shown or stated","SEE: Statistical analyses of fipronil effects.",0.05,"Dissolved oxygen, salinity, and pH were measured in fresh treatment solutions every 3 d to ensure suitable water quality.","Dissolved oxygen, salinity, and pH were measured in fresh treatment solutions every 3 d to ensure suitable water quality.","Dissolved oxygen, salinity, and pH were measured in fresh treatment solutions every 3 d to ensure suitable water quality.","25 °C","Technical grade fipronil"]
["Category","MEW_nonplant","Paper and data unique identifier(eg. 1-1,10-150)","1063-3-OK"]
["Scores",10,5,0,5,5,5,0,5,5,4,0,0,4,4,4,1,1,1,3,3,65,0.69148936170212771,"The highest possible grade for this datum is acceptable."]
["Answers","12 days","Number of adult mating pairs able to produce viable offspring through >12 days of mating","","Figure 3. FP treatments showed decreases of 56 and 88% as compared to controls","Acetone carrier control","Triplicate. For each sample, an internal standard was added to the sample.","Not stated","Adults","0.22 um filtered synthetic seawater (30 ppt,\nInstant Ocean)","Every 3 d, 90% of the overlying treatment solution was removed and replaced with 200 uLof fresh treatment solution to ensure proper water quality and a consistent exposure.","Nominal spike concentrations were measured using a liquid:liquid methyl tert-butyl ether (MTBE) extraction technique. GC-measured concentrations of all exposure treatments consistenly ranged from 82-108% of nominal values; therefore, all concentrations are reported hereafter as the nominal a priori targeted values.","","Showin in Figure 3","SEE: Statistical analyses of fipronil effects.",0.05,"Dissolved oxygen, salinity, and pH were measured in fresh treatment solutions every 3 d to ensure suitable water quality.","Dissolved oxygen, salinity, and pH were measured in fresh treatment solutions every 3 d to ensure suitable water quality.","Dissolved oxygen, salinity, and pH were measured in fresh treatment solutions every 3 d to ensure suitable water quality.","25 °C","Technical grade fipronil"]
["Category","MEW_nonplant","Paper and data unique identifier(eg. 1-1,10-150)","1063-4-OK"]
["Scores",10,5,0,5,5,5,0,5,5,4,0,0,4,4,4,1,1,1,3,3,65,0.69148936170212771,"The highest possible grade for this datum is acceptable."]
["Answers","12 days","For those females able to reproduce, the time required to grow and extrude their first and second brood sacs.","","Figure 4.","Acetone carrier control","Triplicate. For each sample, an internal standard was added to the sample.","Not stated","Adults","0.22 um filtered synthetic seawater (30 ppt,\nInstant Ocean)","Every 3 d, 90% of the overlying treatment solution was removed and replaced with 200 uLof fresh treatment solution to ensure proper water quality and a consistent exposure.","Nominal spike concentrations were measured using a liquid:liquid methyl tert-butyl ether (MTBE) extraction technique. GC-measured concentrations of all exposure treatments consistenly ranged from 82-108% of nominal values; therefore, all concentrations are reported hereafter as the nominal a priori targeted values.","","Showin in Figure 4","SEE: Statistical analyses of fipronil effects.",0.05,"Dissolved oxygen, salinity, and pH were measured in fresh treatment solutions every 3 d to ensure suitable water quality.","Dissolved oxygen, salinity, and pH were measured in fresh treatment solutions every 3 d to ensure suitable water quality.","Dissolved oxygen, salinity, and pH were measured in fresh treatment solutions every 3 d to ensure suitable water quality.","25 °C","Technical grade fipronil"]
["Category","MEW_nonplant","Paper and data unique identifier(eg. 1-1,10-150)","1084-1-OK"]
["Scores",10,5,0,5,5,0,0,5,5,0,2,0,0,4,4,3,3,3,3,3,60,0.63829787234042556,""]
["Answers","45 days","Decrease of adult survival","","19.6% relative to controls","Acetone control","Not stated","Not stated","17 males and 17 females from the same initial hatched cohort.","20%. Seawater","Not stated","Nominal (0 ng/L (acetone control), 100 ng/L and 200 ng/L). Actual concentrations are 97.90 ± 20.84 ng/L and 142.98 ± 40.52 ng/L.","","","ANOVA and multiple comparison procedures","Standard error includes (95% CI)","20.3 ± 0.4 %.","6.9 ± 0.3 mg/L","8 ± 0.2","23.2 ± 0.4°C","Technical grade 98.0% purity"]
["Category","MEW_nonplant","Paper and data unique identifier(eg. 1-1,10-150)","1084-2-OK"]
["Scores",10,5,0,5,5,0,0,5,5,0,2,0,0,4,4,3,3,3,3,3,60,0.63829787234042556,""]
["Answers","45 days","Decrease of adult survival","","19.6% relative to controls","Acetone control","Not stated","Not stated","17 males and 17 females from the same initial hatched cohort.","20%. Seawater","Not stated","Nominal (0 ng/L (acetone control), 100 ng/L and 200 ng/L). Actual concentrations are 97.90 ± 20.84 ng/L and 142.98 ± 40.52 ng/L.","","","ANOVA and multiple comparison procedures","Standard error includes (95% CI)","20.3 ± 0.4 %.","6.9 ± 0.3 mg/L","8 ± 0.2","23.2 ± 0.4°C","Technical grade 98.0% purity"]
["Category","MEW_nonplant","Paper and data unique identifier(eg. 1-1,10-150)","1084-3-OK"]
["Scores",10,5,0,5,5,0,0,5,5,0,2,0,0,4,4,3,3,3,3,3,60,0.63829787234042556,""]
["Answers","45 days","Gravid female body weight","","19.6% relative to controls","Acetone control","Not stated","Not stated","Gravid female. 17 males and 17 females from the same initial hatched cohort.","20%. Seawater","Not stated","Nominal (0 ng/L (acetone control), 100 ng/L and 200 ng/L). Actual concentrations are 97.90 ± 20.84 ng/L and 142.98 ± 40.52 ng/L.","","","ANOVA and multiple comparison procedures","Standard error includes (95% CI)","20.3 ± 0.4 %.","6.9 ± 0.3 mg/L","8 ± 0.2","23.2 ± 0.4°C","Technical grade 98.0% purity"]
["Category","MEW_nonplant","Paper and data unique identifier(eg. 1-1,10-150)","1084-4-OK"]
["Scores",10,5,0,5,5,0,0,5,5,0,2,0,0,4,4,3,3,3,3,3,60,0.63829787234042556,""]
["Answers","45 days","Gravid female body length","","19.6% relative to controls","Acetone control","Not stated","Not stated","Gravid female. 17 males and 17 females from the same initial hatched cohort.","20%. Seawater","Not stated","Nominal (0 ng/L (acetone control), 100 ng/L and 200 ng/L). Actual concentrations are 97.90 ± 20.84 ng/L and 142.98 ± 40.52 ng/L.","","","ANOVA and multiple comparison procedures","Standard error includes (95% CI)","20.3 ± 0.4 %.","6.9 ± 0.3 mg/L","8 ± 0.2","23.2 ± 0.4°C","Technical grade 98.0% purity"]
["Category","MEW_nonplant","Paper and data unique identifier(eg. 1-1,10-150)","1088-1-OK"]
["Scores",10,5,0,5,0,5,0,5,5,4,2,0,4,4,4,3,3,3,3,0,65,0.69148936170212771,""]
["Answers","28 days","Survival","NOEC","Average oyster survival after 28 days of exposure ranged from 92 to 98% with no significant differences among treatments (ANOVA, p ¼ 0:33)","No toxicant control","Four treatments (including control) with three reps = triplicate.","Not stated","30-60 mm","20‰ Natural\nseawater. Inter-tidal salt marsh","Each tank having a dedicated aerated sump\nand a semi-diurnal tidal cycle.","The treatments were 0 ng fipronil/L\n(CTL), 150, 355, and 5000 ng/L. Initial concentrations of total fipronil (sampled at high tide) ranged from 115% (150 ng/L) to 152% (5000 ng/L) of nominal concentrations.","","Table 4","Sublethal endpoints relating to growth, height or weight were analyzed using a multiple comparison test examining all pairwise comparisons (JMP, version 3.2.1, SAS Institute, Cary, NC, USA). Survival data were\nanalyzed using the PROBIT method to estimate LC50 concentrations (Ellersieck and LaPoint, 1995).","Variation and p values stated (Table 4)","Measured daily throughout test. 20.4-22.8‰","Measured daily throughout test. 5.9-8.8 mg/L","Measured daily throughout test. 7.7-8.1","Measured daily throughout test. 28.5-31.1°C",""]
["Category","MEW_nonplant","Paper and data unique identifier(eg. 1-1,10-150)","1088-2-OK"]
["Scores",10,10,0,5,0,5,0,5,5,4,2,0,4,4,4,3,3,3,3,0,70,0.74468085106382975,""]
["Answers","28 days","Oysters were removed, scrubbed and dried, and the weights and heights of each individual were recorded. (Wet weight (g)).","NOEC","Table 4","No toxicant control","Four treatments (including control) with three reps = triplicate.","Not stated","30-60 mm","20‰ Natural seawater. Inter-tidal salt marsh","Each tank having a dedicated aerated sump\nand a semi-diurnal tidal cycle.","The treatments were 0 ng fipronil/L\n(CTL), 150, 355, and 5000 ng/L. Initial concentrations of total fipronil (sampled at high tide) ranged from 115% (150 ng/L) to 152% (5000 ng/L) of nominal concentrations.","","Table 4","Sublethal endpoints relating to growth, height or weight were analyzed using a multiple comparison test examining all pairwise comparisons (JMP, version 3.2.1, SAS Institute, Cary, NC, USA). Survival data were\nanalyzed using the PROBIT method to estimate LC50 concentrations (Ellersieck and LaPoint, 1995).","Variation and p values stated (Table 4)","Measured daily throughout test. 20.4-22.8‰","Measured daily throughout test. 5.9-8.8 mg/L","Measured daily throughout test. 7.7-8.1","Measured daily throughout test. 28.5-31.1°C",""]
["Category","MEW_nonplant","Paper and data unique identifier(eg. 1-1,10-150)","1088-3-OK"]
["Scores",10,10,0,5,0,5,0,5,5,4,2,0,4,4,4,3,3,3,3,0,70,0.74468085106382975,""]
["Answers","28 days","Oysters were removed, scrubbed and dried, and the weights and heights of each individual were recorded. Shell length (mm).","LOEC","Table 4","No toxicant control","Four treatments (including control) with three reps = triplicate.","Not stated","30-60 mm","20‰ Natural seawater. Inter-tidal salt marsh","Each tank having a dedicated aerated sump\nand a semi-diurnal tidal cycle.","The treatments were 0 ng fipronil/L\n(CTL), 150, 355, and 5000 ng/L. Initial concentrations of total fipronil (sampled at high tide) ranged from 115% (150 ng/L) to 152% (5000 ng/L) of nominal concentrations.","","Table 4","Sublethal endpoints relating to growth, height or weight were analyzed using a multiple comparison test examining all pairwise comparisons (JMP, version 3.2.1, SAS Institute, Cary, NC, USA). Survival data were\nanalyzed using the PROBIT method to estimate LC50 concentrations (Ellersieck and LaPoint, 1995).","Variation and p values stated (Table 4)","Measured daily throughout test. 20.4-22.8‰","Measured daily throughout test. 5.9-8.8 mg/L","Measured daily throughout test. 7.7-8.1","Measured daily throughout test. 28.5-31.1°C",""]
["Category","MEW_nonplant","Paper and data unique identifier(eg. 1-1,10-150)","1088-4-OK"]
["Scores",10,10,0,5,0,5,0,5,5,4,2,0,4,4,4,3,3,3,3,0,70,0.74468085106382975,""]
["Answers","28 days","Oysters were removed, scrubbed and dried, and the weights and heights of each individual were recorded. Shell length (mm).","NOEC","Table 4","No toxicant control","Four treatments (including control) with three reps = triplicate.","Not stated","30-60 mm","20‰ Natural seawater. Inter-tidal salt marsh","Each tank having a dedicated aerated sump\nand a semi-diurnal tidal cycle.","The treatments were 0 ng fipronil/L\n(CTL), 150, 355, and 5000 ng/L. Initial concentrations of total fipronil (sampled at high tide) ranged from 115% (150 ng/L) to 152% (5000 ng/L) of nominal concentrations.","","Table 4","Sublethal endpoints relating to growth, height or weight were analyzed using a multiple comparison test examining all pairwise comparisons (JMP, version 3.2.1, SAS Institute, Cary, NC, USA). Survival data were\nanalyzed using the PROBIT method to estimate LC50 concentrations (Ellersieck and LaPoint, 1995).","Variation and p values stated (Table 4)","Measured daily throughout test. 20.4-22.8‰","Measured daily throughout test. 5.9-8.8 mg/L","Measured daily throughout test. 7.7-8.1","Measured daily throughout test. 28.5-31.1°C",""]
["Category","MEW_nonplant","Paper and data unique identifier(eg. 1-1,10-150)","1088-5-OK"]
["Scores",10,5,0,5,0,5,0,5,5,4,2,0,4,4,4,3,3,3,3,0,65,0.69148936170212771,""]
["Answers","28 days","Survival","NOEC","Clam survival ranged from 80 to 89% and exhibited no statistical differences among treatments ( p ¼ 0:60). Table 3.","No toxicant control","Four treatments (including control) with three reps = triplicate.","Not stated","Juveniles, 0.8-1 mm","20‰ Natural seawater. Inter-tidal salt marsh","Each tank having a dedicated aerated sump\nand a semi-diurnal tidal cycle.","The treatments were 0 ng fipronil/L\n(CTL), 150, 355, and 5000 ng/L. Initial concentrations of total fipronil (sampled at high tide) ranged from 115% (150 ng/L) to 152% (5000 ng/L) of nominal concentrations.","","Table 3","Sublethal endpoints relating to growth, height or weight were analyzed using a multiple comparison test examining all pairwise comparisons (JMP, version 3.2.1, SAS Institute, Cary, NC, USA). Survival data were\nanalyzed using the PROBIT method to estimate LC50 concentrations (Ellersieck and LaPoint, 1995).","Variation and p values stated (Table 3)","Measured daily throughout test. 20.4-22.8‰","Measured daily throughout test. 5.9-8.8 mg/L","Measured daily throughout test. 7.7-8.1","Measured daily throughout test. 28.5-31.1°C",""]
["Category","MEW_nonplant","Paper and data unique identifier(eg. 1-1,10-150)","1088-6-OK"]
["Scores",10,5,0,5,0,5,0,5,5,4,2,0,4,4,4,3,3,3,3,0,65,0.69148936170212771,""]
["Answers","28 days","Clams were assessed for survival and growth (wet weight (mg)).","NOEC","Table 3","No toxicant control","Four treatments (including control) with three reps = triplicate.","Not stated","Juveniles, 0.8-1 mm","20‰ Natural seawater. Inter-tidal salt marsh","Each tank having a dedicated aerated sump\nand a semi-diurnal tidal cycle.","The treatments were 0 ng fipronil/L\n(CTL), 150, 355, and 5000 ng/L. Initial concentrations of total fipronil (sampled at high tide) ranged from 115% (150 ng/L) to 152% (5000 ng/L) of nominal concentrations.","","Table 3","Sublethal endpoints relating to growth, height or weight were analyzed using a multiple comparison test examining all pairwise comparisons (JMP, version 3.2.1, SAS Institute, Cary, NC, USA). Survival data were\nanalyzed using the PROBIT method to estimate LC50 concentrations (Ellersieck and LaPoint, 1995).","Variation and p values stated (Table 3)","Measured daily throughout test. 20.4-22.8‰","Measured daily throughout test. 5.9-8.8 mg/L","Measured daily throughout test. 7.7-8.1","Measured daily throughout test. 28.5-31.1°C",""]
["Category","MEW_nonplant","Paper and data unique identifier(eg. 1-1,10-150)","1088-7-OK"]
["Scores",10,5,0,5,0,5,0,5,5,4,2,0,4,4,4,3,3,3,3,0,65,0.69148936170212771,""]
["Answers","28 days","Growth: Shell area (mm2)","NOEC","Table 3","No toxicant control","Four treatments (including control) with three reps = triplicate.","Not stated","Juveniles, 0.8-1 mm","20‰ Natural seawater. Inter-tidal salt marsh","Each tank having a dedicated aerated sump\nand a semi-diurnal tidal cycle.","The treatments were 0 ng fipronil/L\n(CTL), 150, 355, and 5000 ng/L. Initial concentrations of total fipronil (sampled at high tide) ranged from 115% (150 ng/L) to 152% (5000 ng/L) of nominal concentrations.","","Table 3","Sublethal endpoints relating to growth, height or weight were analyzed using a multiple comparison test examining all pairwise comparisons (JMP, version 3.2.1, SAS Institute, Cary, NC, USA). Survival data were\nanalyzed using the PROBIT method to estimate LC50 concentrations (Ellersieck and LaPoint, 1995).","Variation and p values stated (Table 3)","Measured daily throughout test. 20.4-22.8‰","Measured daily throughout test. 5.9-8.8 mg/L","Measured daily throughout test. 7.7-8.1","Measured daily throughout test. 28.5-31.1°C",""]
["Category","MEW_nonplant","Paper and data unique identifier(eg. 1-1,10-150)","1088-8-OK"]
["Scores",10,5,0,5,0,5,0,5,5,4,2,0,4,4,4,3,3,3,3,0,65,0.69148936170212771,""]
["Answers","28 days","Survival","NOEC","Table 5","No toxicant control","Four treatments (including control) with three reps = triplicate.","Not stated","6 months old. Used 16 males and 8 females.","20‰ Natural seawater. Inter-tidal salt marsh","Each tank having a dedicated aerated sump\nand a semi-diurnal tidal cycle.","The treatments were 0 ng fipronil/L\n(CTL), 150, 355, and 5000 ng/L. Initial concentrations of total fipronil (sampled at high tide) ranged from 115% (150 ng/L) to 152% (5000 ng/L) of nominal concentrations.","","Table 5","Sublethal endpoints relating to growth, height or weight were analyzed using a multiple comparison test examining all pairwise comparisons (JMP, version 3.2.1, SAS Institute, Cary, NC, USA). Survival data were\nanalyzed using the PROBIT method to estimate LC50 concentrations (Ellersieck and LaPoint, 1995).","Variation (95% CI) and p values stated (Table 5)","Measured daily throughout test. 20.4-22.8‰","Measured daily throughout test. 5.9-8.8 mg/L","Measured daily throughout test. 7.7-8.1","Measured daily throughout test. 28.5-31.1°C",""]
["Category","MEW_nonplant","Paper and data unique identifier(eg. 1-1,10-150)","1088-9-OK"]
["Scores",10,5,0,5,0,5,0,5,5,4,2,0,4,4,4,3,3,3,3,0,65,0.69148936170212771,""]
["Answers","28 days","Survival","LOEC","Table 5","No toxicant control","Four treatments (including control) with three reps = triplicate.","Not stated","6 months old. Used 16 males and 8 females.","20‰ Natural seawater. Inter-tidal salt marsh","Each tank having a dedicated aerated sump\nand a semi-diurnal tidal cycle.","The treatments were 0 ng fipronil/L\n(CTL), 150, 355, and 5000 ng/L. Initial concentrations of total fipronil (sampled at high tide) ranged from 115% (150 ng/L) to 152% (5000 ng/L) of nominal concentrations.","","Table 5","Sublethal endpoints relating to growth, height or weight were analyzed using a multiple comparison test examining all pairwise comparisons (JMP, version 3.2.1, SAS Institute, Cary, NC, USA). Survival data were\nanalyzed using the PROBIT method to estimate LC50 concentrations (Ellersieck and LaPoint, 1995).","Variation (95% CI) and p values stated (Table 5)","Measured daily throughout test. 20.4-22.8‰","Measured daily throughout test. 5.9-8.8 mg/L","Measured daily throughout test. 7.7-8.1","Measured daily throughout test. 28.5-31.1°C",""]
["Category","MEW_nonplant","Paper and data unique identifier(eg. 1-1,10-150)","1088-10-OK"]
["Scores",10,5,5,5,0,5,0,5,5,4,2,0,4,4,4,3,3,3,3,0,70,0.74468085106382975,""]
["Answers","28 days","Survival","LC50",0.5,"No toxicant control","Four treatments (including control) with three reps = triplicate.","Not stated","6 months old. Used 16 males and 8 females.","20‰ Natural seawater. Inter-tidal salt marsh","Each tank having a dedicated aerated sump\nand a semi-diurnal tidal cycle.","The treatments were 0 ng fipronil/L\n(CTL), 150, 355, and 5000 ng/L. Initial concentrations of total fipronil (sampled at high tide) ranged from 115% (150 ng/L) to 152% (5000 ng/L) of nominal concentrations.","","Table 5","Sublethal endpoints relating to growth, height or weight were analyzed using a multiple comparison test examining all pairwise comparisons (JMP, version 3.2.1, SAS Institute, Cary, NC, USA). Survival data were\nanalyzed using the PROBIT method to estimate LC50 concentrations (Ellersieck and LaPoint, 1995).","Variation (95% CI) and p values stated (Table 5)","Measured daily throughout test. 20.4-22.8‰","Measured daily throughout test. 5.9-8.8 mg/L","Measured daily throughout test. 7.7-8.1","Measured daily throughout test. 28.5-31.1°C",""]
["Category","MEW_nonplant","Paper and data unique identifier(eg. 1-1,10-150)","1088-11-OK"]
["Scores",10,10,5,5,0,5,2,5,5,4,2,0,0,4,4,3,3,3,3,0,73,0.77659574468085102,""]
["Answers","7 days","Persistence of fipronil toxicity was quantified by caging grass shrimp in the sumps of each dosing tank for 7 days. Comparisons of survival between treatments and controls allowed for an estimate of residual toxicity.","NOEC","Figure 3","No toxicant control","Every 7 days, a new group of shrimp was exposed. This was done in the sumps of EACH DOSING TANK.","Survival for all groups of shrimp deployed in the control was >80%","6 months old. Used 16 males and 8 females.","20‰ Natural seawater. Inter-tidal salt marsh","Each tank having a dedicated aerated sump\nand a semi-diurnal tidal cycle.","The treatments were 0 ng fipronil/L\n(CTL), 150, 355, and 5000 ng/L. Initial concentrations of total fipronil (sampled at high tide) ranged from 115% (150 ng/L) to 152% (5000 ng/L) of nominal concentrations.","","","Sublethal endpoints relating to growth, height or weight were analyzed using a multiple comparison test examining all pairwise comparisons (JMP, version 3.2.1, SAS Institute, Cary, NC, USA). Survival data were\nanalyzed using the PROBIT method to estimate LC50 concentrations (Ellersieck and LaPoint, 1995).","Variation (95% CI) and p values stated (Table 5)","Measured daily throughout test. 20.4-22.8‰","Measured daily throughout test. 5.9-8.8 mg/L","Measured daily throughout test. 7.7-8.1","Measured daily throughout test. 28.5-31.1°C",""]
["Category","MEW_nonplant","Paper and data unique identifier(eg. 1-1,10-150)","1088-12-OK"]
["Scores",10,10,5,5,0,5,2,5,5,4,2,0,0,4,4,3,3,3,3,0,73,0.77659574468085102,""]
["Answers","7 days","Persistence of fipronil toxicity was quantified by caging grass shrimp in the sumps of each dosing tank for 7 days. Comparisons of survival between treatments and controls allowed for an estimate of residual toxicity.","NOEC","Figure 3","No toxicant control","Every 7 days, a new group of shrimp was exposed. This was done in the sumps of EACH DOSING TANK.","Survival for all groups of shrimp deployed in the control was >80%","6 months old. Used 16 males and 8 females.","20‰ Natural seawater. Inter-tidal salt marsh","Each tank having a dedicated aerated sump\nand a semi-diurnal tidal cycle.","The treatments were 0 ng fipronil/L\n(CTL), 150, 355, and 5000 ng/L. Initial concentrations of total fipronil (sampled at high tide) ranged from 115% (150 ng/L) to 152% (5000 ng/L) of nominal concentrations.","","","Sublethal endpoints relating to growth, height or weight were analyzed using a multiple comparison test examining all pairwise comparisons (JMP, version 3.2.1, SAS Institute, Cary, NC, USA). Survival data were\nanalyzed using the PROBIT method to estimate LC50 concentrations (Ellersieck and LaPoint, 1995).","Variation (95% CI) and p values stated (Table 5)","Measured daily throughout test. 20.4-22.8‰","Measured daily throughout test. 5.9-8.8 mg/L","Measured daily throughout test. 7.7-8.1","Measured daily throughout test. 28.5-31.1°C",""]
["Category","MEW_nonplant","Paper and data unique identifier(eg. 1-1,10-150)","1088-13-OK"]
["Scores",10,5,5,5,0,5,0,5,5,4,2,0,4,4,4,3,3,3,3,0,70,0.74468085106382975,""]
["Answers","28 days","Survival","NOEC","Average survival ranged from 93 to 100% for all treatments (Table 5).","No toxicant control","Four treatments (including control) with three reps = triplicate.","Not stated","Juveniles. 1-1.5cm.","20‰ Natural seawater. Inter-tidal salt marsh","Each tank having a dedicated aerated sump\nand a semi-diurnal tidal cycle.","The treatments were 0 ng fipronil/L\n(CTL), 150, 355, and 5000 ng/L. Initial concentrations of total fipronil (sampled at high tide) ranged from 115% (150 ng/L) to 152% (5000 ng/L) of nominal concentrations.","","Table 5.","Sublethal endpoints relating to growth, height or weight were analyzed using a multiple comparison test examining all pairwise comparisons (JMP, version 3.2.1, SAS Institute, Cary, NC, USA). Survival data were\nanalyzed using the PROBIT method to estimate LC50 concentrations (Ellersieck and LaPoint, 1995).","Variation (95% CI) and p values stated (Table 5)","Measured daily throughout test. 20.4-22.8‰","Measured daily throughout test. 5.9-8.8 mg/L","Measured daily throughout test. 7.7-8.1","Measured daily throughout test. 28.5-31.1°C",""]
["Category","MEW_nonplant","Paper and data unique identifier(eg. 1-1,10-150)","1088-14-OK"]
["Scores",10,5,5,5,0,5,0,5,5,4,2,0,4,4,4,3,3,3,3,0,70,0.74468085106382975,""]
["Answers","28 days","Growth: Weight","NOEC","Average lengths and weights ranged from 28.0 to 30.2 cm and from 0.43 to 0.53 g wet weight, respectively.","No toxicant control","Four treatments (including control) with three reps = triplicate.","Not stated","Juveniles. 1-1.5cm. The initial cohort averaged 1.6 cm in length and 0.06 g in weight.","20‰ Natural seawater. Inter-tidal salt marsh","Each tank having a dedicated aerated sump\nand a semi-diurnal tidal cycle.","The treatments were 0 ng fipronil/L\n(CTL), 150, 355, and 5000 ng/L. Initial concentrations of total fipronil (sampled at high tide) ranged from 115% (150 ng/L) to 152% (5000 ng/L) of nominal concentrations.","","Table 5.","Sublethal endpoints relating to growth, height or weight were analyzed using a multiple comparison test examining all pairwise comparisons (JMP, version 3.2.1, SAS Institute, Cary, NC, USA). Survival data were\nanalyzed using the PROBIT method to estimate LC50 concentrations (Ellersieck and LaPoint, 1995).","Variation (95% CI) and p values stated (Table 5)","Measured daily throughout test. 20.4-22.8‰","Measured daily throughout test. 5.9-8.8 mg/L","Measured daily throughout test. 7.7-8.1","Measured daily throughout test. 28.5-31.1°C",""]
["Category","MEW_nonplant","Paper and data unique identifier(eg. 1-1,10-150)","1088-15-OK"]
["Scores",10,5,5,5,0,5,0,5,5,4,2,0,4,4,4,3,3,3,3,0,70,0.74468085106382975,""]
["Answers","28 days","Growth: Length","NOEC","Average lengths and weights ranged from 28.0 to 30.2 cm and from 0.43 to 0.53 g wet weight, respectively.","No toxicant control","Four treatments (including control) with three reps = triplicate.","Not stated","Juveniles. 1-1.5cm. The initial cohort averaged 1.6 cm in length and 0.06 g in weight.","20‰ Natural seawater. Inter-tidal salt marsh","Each tank having a dedicated aerated sump\nand a semi-diurnal tidal cycle.","The treatments were 0 ng fipronil/L\n(CTL), 150, 355, and 5000 ng/L. Initial concentrations of total fipronil (sampled at high tide) ranged from 115% (150 ng/L) to 152% (5000 ng/L) of nominal concentrations.","","Table 5.","Sublethal endpoints relating to growth, height or weight were analyzed using a multiple comparison test examining all pairwise comparisons (JMP, version 3.2.1, SAS Institute, Cary, NC, USA). Survival data were\nanalyzed using the PROBIT method to estimate LC50 concentrations (Ellersieck and LaPoint, 1995).","Variation (95% CI) and p values stated (Table 5)","Measured daily throughout test. 20.4-22.8‰","Measured daily throughout test. 5.9-8.8 mg/L","Measured daily throughout test. 7.7-8.1","Measured daily throughout test. 28.5-31.1°C",""]
["Category","MEW_nonplant","Paper and data unique identifier(eg. 1-1,10-150)","1062-1-OK"]
["Scores",10,5,0,5,5,5,0,5,5,4,2,0,0,4,4,1,1,1,0,3,60,0.63829787234042556,""]
["Answers","12 days","Survival","NOEC","There were no filial FP effects on copepod survival (P ) 0.21); mean percent survival for the parent (F0) and F1 generations were 98.5% and 95.5%, respectively.","Acetone carrier control.","Briefly, freshCTLand FP solutions were\nsampled in triplicate. For each replicate an internal standard was added to the seawater.","Not stated","Stage-I juveniles to adulthood","Filtered synthetic seawater 30ppt","Solution (~90%) was removed and replaced every 3 days to maintain water quality and fipronil concentrations.","Fipronil was not measured directly from microplate wells due to limiting individual\nmicrowell volumes (0.2 mL); however, triplicate samples of eight pooled microwells (total volume ) 1.5 mL) showed 84.2 ( 3.6% fipronil recovery efficiencies after 72 h in microwells.","","","","P < 0.05 determined statistical significance","Dissolved oxygen, salinity, and pH were measured in fresh treatment solutions every 3 days to ensure suitable water quality.","Dissolved oxygen, salinity, and pH were measured in fresh treatment solutions every 3 days to ensure suitable water quality.","Dissolved oxygen, salinity, and pH were measured in fresh treatment solutions every 3 days to ensure suitable water quality.","","FP was not detected in any measured\nacetone carrier control solutions (detection limit ) 0.1 ug/L). Purity = 98% (technical grade)."]
["Category","MEW_nonplant","Paper and data unique identifier(eg. 1-1,10-150)","1062-2-OK"]
["Scores",10,5,0,0,5,5,0,5,5,4,2,0,0,4,4,1,1,1,0,3,55,0.58510638297872342,""]
["Answers","12 days","Reproduction: Viable offspring production","NOEC","","Acetone carrier control.","Briefly, freshCTLand FP solutions were\nsampled in triplicate. For each replicate an internal standard was added to the seawater.","Not stated","Stage-I juveniles to adulthood","Filtered synthetic seawater 30ppt","Solution (~90%) was removed and replaced every 3 days to maintain water quality and fipronil concentrations.","Fipronil was not measured directly from microplate wells due to limiting individual\nmicrowell volumes (0.2 mL); however, triplicate samples of eight pooled microwells (total volume ) 1.5 mL) showed 84.2 ( 3.6% fipronil recovery efficiencies after 72 h in microwells.","","","","P < 0.05 determined statistical significance","Dissolved oxygen, salinity, and pH were measured in fresh treatment solutions every 3 days to ensure suitable water quality.","Dissolved oxygen, salinity, and pH were measured in fresh treatment solutions every 3 days to ensure suitable water quality.","Dissolved oxygen, salinity, and pH were measured in fresh treatment solutions every 3 days to ensure suitable water quality.","","FP was not detected in any measured\nacetone carrier control solutions (detection limit ) 0.1 ug/L). Purity = 98% (technical grade)."]
["Category","MEW_nonplant","Paper and data unique identifier(eg. 1-1,10-150)","1062-3-OK"]
["Scores",10,10,0,5,5,5,0,5,5,4,2,0,4,4,4,1,1,1,0,3,69,0.73404255319148903,""]
["Answers","12 days","Reproductive success: Mean percent brood sac extrusion. Measured as the mean percent of surviving females that produced viable offspring.","NOEC","In contrast, there were no significant\ndifferences in reproductive success among any of the mating combinations when adult pairing was performed in clean seawater for 12 days; mean percent brood sac extrusion success in clean seawater ranged from 83.3% to 97.0% (P values all > 0.50).","Acetone carrier control.","Briefly, freshCTLand FP solutions were\nsampled in triplicate. For each replicate an internal standard was added to the seawater.","Not stated","Stage-I juveniles to adulthood","Filtered synthetic seawater 30ppt","Solution (~90%) was removed and replaced every 3 days to maintain water quality and fipronil concentrations.","Fipronil was not measured directly from microplate wells due to limiting individual\nmicrowell volumes (0.2 mL); however, triplicate samples of eight pooled microwells (total volume ) 1.5 mL) showed 84.2 ( 3.6% fipronil recovery efficiencies after 72 h in microwells.","","Figure 4","","P < 0.05 determined statistical significance","Dissolved oxygen, salinity, and pH were measured in fresh treatment solutions every 3 days to ensure suitable water quality.","Dissolved oxygen, salinity, and pH were measured in fresh treatment solutions every 3 days to ensure suitable water quality.","Dissolved oxygen, salinity, and pH were measured in fresh treatment solutions every 3 days to ensure suitable water quality.","","FP was not detected in any measured\nacetone carrier control solutions (detection limit ) 0.1 ug/L). Purity = 98% (technical grade)."]

{"sheet":"MEW plant","index":15,"n_rows":81,"n_cols":53,"rows_kept":81,"cut":false,"hidden":false,"merged":[[52,2,54,2],[52,7,54,7],[62,2,64,2],[62,7,64,7],[56,7,58,7],[56,1,58,1],[56,2,58,2],[59,7,61,7],[65,2,68,2],[65,7,68,7],[43,2,45,2],[43,7,45,7],[46,2,48,2],[46,7,48,7],[49,2,51,2],[49,7,51,7],[34,2,36,2],[34,7,36,7],[37,2,39,2],[37,7,39,7],[40,2,42,2],[40,7,42,7],[25,2,27,2],[25,7,27,7],[28,2,30,2],[28,7,30,7],[31,2,33,2],[31,7,33,7],[17,2,19,2],[17,7,19,7],[20,2,21,2],[20,7,21,7],[22,2,24,2],[22,7,24,7],[3,4,7,4],[9,2,9,4],[11,2,13,2],[11,7,13,7],[14,2,16,2],[14,7,16,7]]}
[null,1,"Fill in the blank cells below, based on information provided in the paper being assessed. You can either pick an option from the dropdown list or add the appropriate detail using the 'Add to list' button. ",null,null,{"$f":"IF(BA3=\"\",0,1)","v":1},null,null,null,null,null,null,null,null,"* All the text in RED are used for drop down list ,make changes with caution."]
[null,null,"Category",{"$f":"IF(AF3=\"\",0,1)","v":1},"MEW_plant",{"$f":"IF(E3=\"\",0,1)","v":1},"Citation No.",{"$f":"IF(ISERROR(FIND(\"-\",E3)),E3,LEFT(E3,FIND(\"-\",E3)-1))","v":"1084"},null,"Taxonomic group",null,null,null,null,"Species",null,null,"Lifestage",null,null,"Exposure duration",null,null,"Measure of toxicity",null,null,"Toxicity endpoint",null,null,"Taxonomic group",null,null,"Phylum",null,null,"Class",null,null,"Media",null,null,"Temperature ",null,null,"Acute Or Chronic",null,null,"PH",null,null,"Salinity/Comdictivity"]
[null,null,"Paper and data unique identifier(eg. 1-1,10-150)",{"$f":"IF(AI3=\"\",0,1)","v":1},"1084-1-OK",{"$f":"IF(E4=\"\",0,1)","v":1},"Species (Scientific name)",null,null,"Phylum",null,null,null,null,"Aedes albopictus",4,{"$f":"IF(P3=0,\"\",INDEX(O3:O102,P3))","v":"Dunaliella tertiolecta"},"1 month",4,{"$f":"IF(S3=0,\"\",INDEX(R3:R102,S3))","v":"log phase growth"},"11 hour",5,{"$f":"IF(V3=0,\"\",INDEX(U3:U102,V3))","v":"96 hrs"},"EC50",4,{"$f":"IF(Y3=0,\"\",INDEX(X3:X102,Y3))","v":"LOEC"},"average pop growth rate: cell density",11,{"$f":"IF(AB3=0,\"\",INDEX(AA3:AA102,AB3))","v":"Cell density, biovolume"},"Fish ",3,{"$f":"IF(AE3=0,\"\",INDEX(AD3:AD102,AE3))","v":"Microalga"},"Bacillariophyta",2,{"$f":"IF(AH3=0,\"\",INDEX(AG3:AG102,AH3))","v":"Chlorophyta"},"Branchiopoda",2,{"$f":"IF(AK3=0,\"\",INDEX(AJ3:AJ102,AK3))","v":"Chlorophyceae"},"F/2 marine media",1,{"$f":"IF(AN3=0,\"\",INDEX(AM3:AM102,AN3))","v":"F/2 marine media"},15,3,{"$f":"IF(AQ3=0,\"\",INDEX(AP3:AP102,AQ3))","v":25},"Acute",2,{"$f":"IF(AT3=0,\"\",INDEX(AS3:AS102,AT3))","v":"Chronic"},"7.5 - 8.3",7,{"$f":"IF(AW3=0,\"\",INDEX(AV3:AV102,AW3))","v":"Not stated"},30,8,{"$f":"IF(AZ3=0,\"\",INDEX(AY3:AY102,AZ3))","v":20}]
[null,null,"Citation",{"$f":"IF(AL3=\"\",0,1)","v":1},"Volz,D.C., E.F. Wirth, M.H. Fulton, G.I. Scott, E. Strozier, D.S. Block, J.L. Ferry, S.S. Walse, and G.T. Chandler (2003) Effects of Fipronil and Chlorpyrifos on Endocrine-Related Endpoints in Female Grass Shrimp (Palaemonetes pugio) Bull. Environ. Contam. Toxicol.71(3): 497-503",{"$f":"IF(H8=\"\",0,1)","v":1},"Lifestage",null,null,"Class",null,null,null,null,"Australian Bass",null,null,"1 year old",null,null,"13 days",null,null,"EC50",null,null,"Average population growth rate",null,null,"Macroalgae",null,null,"Chlorophyta",null,null,"Chlorophyceae",null,null,"filtered artificial seawater",null,null,20,null,null,"Chronic",null,null,"8.1–8.4",null,null,"150 uS/cm"]
[null,null,null,{"$f":"IF(AO3=\"\",0,1)","v":1},null,{"$f":"IF(AX3=\"\",0,1)","v":1},"Exposure duration",null,null,"Media",null,null,null,null,"Dunaliella tertiolecta",null,null,"Fresh culture < 7d",null,null,"24hr",null,null,"LC50",null,null,"Bioluminescence",null,null,"Microalga",null,null,"Cyanobacteria",null,null,"Cyanophyceae",null,null,"Freshwater",null,null,25,null,null,"N.A.",null,null,"N.A.",null,null,"213 uS/cm"]
[null,null,null,{"$f":"IF(AR3=\"\",0,1)","v":1},null,{"$f":"IF(Q3=\"\",0,1)","v":1},"Measure of toxicity",null,null,"Temperature ",null,null,null,null,"Dunaliella tertiolecta",null,null,"log phase growth",null,null,"5 hours",null,null,"LOEC",null,null,"Fish ",null,null,"N.A.",null,null,"Miozoa",null,null,"Dinophyceae",null,null,"Marinewater",null,null,"15°C",null,null,null,null,null,"pH 8.1–8.4",null,null,"30 ppt"]
[null,null,null,{"$f":"IF(AU3=\"\",0,1)","v":1},null,{"$f":"IF(T3=\"\",0,1)","v":1},"Toxicity endpoint",null,null,"Acute Or Chronic ",null,null,null,null,"N.A.",null,null,"N.A.",null,null,"96 hrs",null,null,"N.A.",null,null,"Growth inhibition",null,null,null,null,null,"N.A.",null,null,"Mediophyceae",null,null,"N.A.",null,null,"20 ± 1°C",null,null,null,null,null,"PH11",null,null,"33 ± 0.5"]
[null,null,null,null,null,{"$f":"IF(W3=\"\",0,1)","v":1},"Toxicity value","500ug/L",null,"PH",null,null,null,null,"Photobacterium phosphoreum",null,null,"N/A",null,null,"N.A.",null,null,"NOEC",null,null,"Inhibition of carbon incorporation",null,null,null,null,null,"Ochrophyta",null,null,"N.A.",null,null,"natural seawater",null,null,"25 ± 1",null,null,null,null,null,"PH7.0",null,null,"N.A."]
[null,2,"Select the appropriate answer option to each question. Comments can be added to the cells in column H.",null,null,{"$f":"IF(Z3=\"\",0,1)","v":1},null,null,null,"Salinity/Conductivity",null,null,null,null,"Pyrocystis lunula",null,null,"not stated",null,null,null,null,null,null,null,null,"Microalga",null,null,null,null,null,"Tracheophyta",null,null,"Phaeophyceae",null,null,"Sterilised and filtered offshore marine water",null,null,"25°C",null,null,null,null,null,"Not stated",null,null,"Not stated"]
[null,"*","If the selected answer option does not work try clicking on any other cell first and then click back on the answer option again.",null,null,{"$f":"IF(AC3=\"\",0,1)","v":1},null,null,null,null,null,null,null,null,"Saccharina latissima",null,null,"Not stated",null,null,null,null,null,null,null,null,"N.A.",null,null,null,null,null,null,null,null,null,null,null,null,null,null,"N.A.",null,null,null,null,null,null,null,null,20]
[null,"No.","Question","Marks Awarded","Answer Options","Option References","Scores","Answers",null,null,null,null,null,null,"Skeletonema costatum",null,null,null,null,null,null,null,null,null,null,null,"Population Abundance: Biomass (Chl-a)"]
[null,null,"Was the duration of the exposure stated (e.g. 48 or 96 h)?",10,null,1,{"$f":"IF(F15=0,0,INDEX($D12:$D13,F12,1))","v":10},"45 days",null,null,null,null,null,null,"Synechococcus sp. ",null,null,null,null,null,null,null,null,null,null,null,"relative growth rate"]
[null,1,null,0,null,null,null,null,null,null,null,null,null,null,"Thalassiosira pseudonana",null,null,null,null,null,null,null,null,null,null,null,"Cell density, biovolume"]
[]
[null,null,"Was the biological endpoint (e.g., immobilization or population growth) stated and defined (10 marks)? Award 5 marks if the biological endpoint is only stated.",10,null,2,{"$f":"IF(F15=0,0,INDEX($D15:$D17,F15,1))","v":5},"Decrease of adult survival"]
[null,2,null,5]
[null,null,null,0]
[null,null,"Was the biological effect stated (e.g. LC or NOEC)?",5,null,2,{"$f":"IF(F18=0,0,INDEX($D18:$D19,F18,1))","v":0}]
[null,3,null,0]
[]
[null,4,"Was the biological effect quantified (e.g. 50% effect, 25% effect)? \nNote: The effect for NOEC and LOEC data must be quantified.",5,null,1,{"$f":"IF(F21=0,0,INDEX($D21:$D22,F21,1))","v":5},"19.6% relative to controls"]
[null,null,null,0]
[null,5,"Were appropriate controls (e.g. a no-toxicant control and/or solvent control) used?",5,null,1,{"$f":"IF(F23=0,0,INDEX($D23:$D24,F23,1))","v":5},"Acetone control"]
[null,null,null,0]
[]
[null,6,"Was each control and contaminant concentration at least duplicated?",5,null,2,{"$f":"IF(F26=0,0,INDEX($D26:$D27,F26,1))","v":0},"Not stated"]
[null,null,null,0]
[]
[null,7,"Were test acceptability criteria stated (e.g. mortality in controls must not exceed a certain percentage) (5 marks)?\nOR Were test acceptability criteria inferred (e.g. test method used [USEPA, OECD, ASTM etc.]) (award 2 marks). \nNote: Data that fail the acceptability criteria are automatically deemed to be of unacceptable quality and must not be used. ",5,null,3,{"$f":"IF(F29=0,0,INDEX($D29:$D31,F29,1))","v":0},"Not stated"]
[null,null,null,2]
[null,null,null,0]
[null,8,"Were the characteristics of the test organism (e.g. length, mass, age) stated?",5,null,1,{"$f":"IF(F32=0,0,INDEX($D32:$D34,F32,1))","v":5},"17 males and 17 females from the same initial hatched cohort."]
[null,null,null,0]
[]
[null,9,"Was the type of test media used stated?",5,null,1,{"$f":"IF(F35=0,0,INDEX($D35:$D37,F35,1))","v":5},"20%. Seawater"]
[null,null,null,0]
[]
[null,null,"Was the type of exposure (e.g. static, flow through) stated? ",4,null,2,{"$f":"IF(F38=0,0,INDEX($D38:$D40,F38,1))","v":0},"Not stated"]
[null,10,null,0]
[]
[null,null,"Were the contaminant concentrations measured at the beginning and end of the exposure (4 marks)? Award 2 marks if they were measured only once during the test.\nNote: If the concentrations were not measured then automatically the data cannot be high quality. ",4,null,1,{"$f":"IF(F41=0,0,INDEX($D41:$D43,F41,1))","v":4},"Nominal (0 ng/L (acetone control), 100 ng/L and 200 ng/L). Actual concentrations are 97.90 ± 20.84 ng/L and 142.98 ± 40.52 ng/L."]
[null,11,null,2]
[null,null,null,0]
[null,null,"Were parallel reference toxicant toxicity tests conducted?",4,null,2,{"$f":"IF(F44=0,0,INDEX($D44:$D46,F44,1))","v":0}]
[null,12,null,0]
[]
[null,null,"Was there a concentration–response relationship either observable or stated?",4,null,2,{"$f":"IF(F47=0,0,INDEX($D47:$D49,F47,1))","v":0}]
[null,13,null,0]
[]
[null,null,"Was an appropriate statistical method or model used to determine the toxicity?\nNote: They should be accepted by a recognised national or international regulatory body (e.g. USEPA, OECD, ASTM). ",4,null,1,{"$f":"IF(F50=0,0,INDEX($D50:$D52,F50,1))","v":4},"ANOVA and multiple comparison procedures"]
[null,14,null,0]
[]
[null,15,"For LC/EC/BEC data was an estimate of variability provided? \nOR \nFor NO EC/LOEC data was the significance level 0.05 or less?  \n\n",4,null,1,{"$f":"IF(F53=0,0,INDEX($D53:$D55,F53,1))","v":4},"Standard error includes (95% CI)"]
[null,null,null,0]
[]
[null,16,"Were the following parameters measured and stated? (3 marks if measured and stated, 1 mark if just measured)."]
[null,16.100000000000001,"Conductivity/Salinity",3,null,1,{"$f":"IF(F57=0,0,INDEX(D57:D59,F57,1))","v":3},"20.3 ± 0.4 %."]
[null,null,null,1]
[null,null,null,0]
[null,null,null,3,null,1,{"$f":"IF(F60=0,0,INDEX($D60:$D62,F60,1))","v":3},"8 ± 0.2"]
[null,16.2,"pH ",1]
[null,null,null,0]
[null,null,"Was the temperature measured and stated (3 marks)? Award 1 mark if the temperature was measured but not stated or if only the temperature settings of the room or chamber are stated.\n",3,null,1,{"$f":"IF(F63=0,0,INDEX($D63:$D65,F63,1))","v":3},"23.2 ± 0.4°C"]
[null,17,null,1]
[null,null,null,0]
[null,null,"Were test solutions, blanks and/or controls tested for contamination OR were analytical reagent grade chemicals used or the highest possible purity chemicals used for the experiment? (3 marks).",3,null,1,{"$f":"IF(F66=0,0,INDEX($D66:$D67,F66,1))","v":3},"Technical grade 98.0% purity"]
[null,18,null,0]
[]
[null,null,null,null,null,null,null,null,{"$f":"(COUNTIF(F12:F67,\"=0\"))+COUNTIF(F1:F10,\"=0\")+COUNTIF(D2:D7,\"=0\")","v":0}]
[]
[]
[null,null,"Total score",null,null,null,{"$f":"IF(SUM(G12:G66)=0,\"\",SUM(G12:G66))","v":59}]
[null,null,"Total Max. possible score for the various types of data and contaminants ",null,{"$f":"D12+D15+D18+D21+D23+D26+D29+D32+D35+D38+D41+D44+D47+D50+D53+D60+D63+D66+D57","v":91}]
[null,null,"Quality Score",null,{"$f":"\"= [Total score / Total possible score] * 100 = \"","v":"= [Total score / Total possible score] * 100 = "},null,{"$f":"IF(ISERROR(G72/E73),#N/A,G72/E73)","v":0.64835164835164838},{"$f":"IF(F41=3,\"The highest possible grade for this datum is acceptable.\",\"\")","v":""}]
[]
[null,null,"H = high quality                           Quality score ≥ 80%    "]
[null,null,"A = acceptable quality         > 50% Quality score < 80%  "]
[null,null,"U = unacceptable quality              Quality score ≤ 50%"]
[]
[3,null,"Click the 'Save & Update' button to save and export the answers to the 'All results' worksheet. "]
[null,null,"Select the 'Reset Answers' button if you wish to clear all answers."]

{"sheet":"MEW plant_WS","index":16,"n_rows":38,"n_cols":24,"rows_kept":38,"cut":false,"hidden":false,"merged":[]}
[]
["Question No.",1,2,3,4,5,6,7,8,9,10,11,12,13,14,15,16.100000000000001,16.3,17,18,"Total Score","Quality Score","Comment "]
["Short Questions","Duration of the exposure ","Biological endpoint","Biological effect stated or not","Biological effect quantified or not","Appropriate controls","Control & contaminant concentration","Test acceptability criteria","Characteristics of the test organism"," Type of test media","Type of exposure","Contaminant concentrations","Parallel reference toxicant toxicity tests","Concentration–response relationship","Determine the toxicity","NOEC/LOEC or LC/EC/BEC","Conductivity/Salinity","PH","Temperature","Grade or purity"]
["Marks Awarded ","10 or 0","10,5 or 0","5 or 0 ","5 or 0 ","5 or 0 ","5 or 0 ","5 or 0 ","5 or 0 ","5 or 0 ","4 or 0","4 or 2 or 0","4 or 2","4 or 2","4 or 2","4 or 2","3 or 1 or 0","3 or 1 or 0","3 or 0","3 or 0 "]
["Max. Possible Score",10,10,5,5,5,5,5,5,5,4,4,4,4,4,4,3,3,3,3,{"$f":"SUM(B5:T5)","v":91}]
["Category","MEW_nonplant","Paper and data unique identifier(eg. 1-1,10-150)","1038-1"]
["Scores",10,5,5,5,5,5,5,5,5,0,2,0,4,4,4,1,1,1,3,{"$f":"SUM(B7:T7)","v":70},{"$f":"70/91","v":0.76923076923076927},null,""]
["Answers","","","","","","","Tests with control mortality rates >20% were not accepted","","","","","","","","","","","","",""]
["Category","MEW_plant","Paper and data unique identifier(eg. 1-1,10-150)","1038-2"]
["Scores",10,5,5,5,5,5,5,5,5,0,2,0,4,4,4,1,0,0,0,70,0.76923076923076927,""]
["Answers","","","","","","","Tests with control mortality rates >20% were not accepted","","","","","","","","95% CI (340–460)","","","",""]
["Category","MEW_plant","Paper and data unique identifier(eg. 1-1,10-150)","1038-3"]
["Scores",10,5,5,5,5,5,5,5,5,0,2,0,4,4,4,1,0,0,0,70,0.76923076923076927,""]
["Answers","","","","","","","Tests with control mortality rates >20% were not accepted","","","","","","","","95% CI (7.3–23)","","","",""]
["Category","MEW_plant","Paper and data unique identifier(eg. 1-1,10-150)","1038-4"]
["Scores",10,5,5,5,5,5,5,5,5,0,2,0,4,4,4,1,0,0,0,70,0.76923076923076927,""]
["Answers","","","","","","","Tests with control mortality rates >20% were not accepted","","","","","","","","95% CI (1.9–10)","","","",""]
["Category","MEW_plant","Paper and data unique identifier(eg. 1-1,10-150)","1038-5"]
["Scores",10,5,5,5,5,5,5,5,5,0,2,0,4,4,4,1,0,0,0,70,0.76923076923076927,""]
["Answers","","","","","","","Tests with control mortality rates >20% were not accepted","","","","","","","","95% CI (120–290)","","","",""]
["Category","MEW_plant","Paper and data unique identifier(eg. 1-1,10-150)","1051-1"]
["Scores",10,5,5,5,5,5,0,5,5,4,2,0,4,4,0,1,0,0,0,63,0.69230769230769229,""]
["Answers","300min","","","","","","","length 40-50cm","NSW","flow through","","","","","","","","",""]
["Category","MEW_plant","Paper and data unique identifier(eg. 1-1,10-150)","1053-1"]
["Scores",10,10,5,5,5,5,2,5,5,4,2,0,0,4,4,0,0,0,0,70,0.76923076923076927,""]
["Answers","","","","","","","standard methods","","","","","","","","","","","","analytical grade chemicals"]
["Category","MEW_plant","Paper and data unique identifier(eg. 1-1,10-150)","1053-2"]
["Scores",10,10,5,5,5,5,2,5,5,4,2,0,0,4,4,0,0,0,0,70,0.76923076923076927,""]
["Answers","","","","","","","standard methods","","","","","","","","","","","","analytical grade chemicals"]
["Category","MEW_plant","Paper and data unique identifier(eg. 1-1,10-150)","1093-7"]
["Scores",10,10,5,5,5,5,5,5,5,4,4,0,0,4,0,1,0,0,0,73,0.80219780219780223,""]
["Answers","","","","","","","","","","","","","","","","","","",""]
["Category","MEW_plant","Paper and data unique identifier(eg. 1-1,10-150)","1093-8"]
["Scores",10,10,5,5,5,5,5,5,5,4,4,0,0,4,0,1,0,0,0,73,0.80219780219780223,""]
["Answers","","","","","","","","","","","","","","","","","","",""]
["Category","MEW_plant","Paper and data unique identifier(eg. 1-1,10-150)","1093-9"]
["Scores",10,10,5,5,5,5,5,5,5,4,4,0,0,4,0,1,0,0,0,73,0.80219780219780223,""]
["Answers","","","","","","","","","","","","","","","","","","",""]

{"sheet":"Terrestrial Data QA","index":17,"n_rows":98,"n_cols":25,"rows_kept":98,"cut":false,"hidden":false,"merged":[[80,2,82,2],[80,7,82,7],[83,2,86,2],[83,7,86,7],[76,2,79,2],[76,7,79,7],[3,4,7,4],[53,7,56,7],[57,7,60,7],[37,7,39,7],[40,7,42,7],[43,7,45,7],[46,7,48,7],[34,7,36,7],[28,7,30,7],[31,7,33,7],[61,7,64,7],[65,7,68,7],[11,7,13,7],[49,7,51,7],[14,7,16,7],[22,7,24,7],[25,7,27,7],[17,7,19,7],[20,7,21,7],[11,2,13,2],[20,2,21,2],[22,2,24,2],[25,2,27,2],[14,2,16,2],[17,2,19,2],[72,7,75,7],[34,2,36,2],[28,2,30,2],[57,2,60,2],[37,2,39,2],[40,2,42,2],[72,2,75,2],[43,2,45,2],[31,2,33,2],[69,2,71,2],[46,2,48,2],[49,2,51,2],[53,2,56,2],[61,2,64,2],[65,2,68,2],[69,7,71,7]]}
[null,1,"FILL IN BLANKS BELOW,PICK OPTIONS FROM DROPDOWN LIST",null,null,null,null,null,null,null,"* All the text in Blue are used for drop down list ,make changes with caution."]
[null,null,"Category",null,"Terrestrial Quality",{"$f":"IF(M3=\"\",0,1)","v":0},"Citation No.",{"$f":"IF(ISERROR(FIND(\"-\",E3)),E3,LEFT(E3,FIND(\"-\",E3)-1))","v":0},null,null,"Species",null,null,"Lifestage",null,null,"Exposure duration",null,null,"Measure of toxicity",null,null,"Toxicity endpoint"]
[null,null,"Paper and data unique identifier(eg. 1-1,10-150)",null,null,{"$f":"IF(E3=\"\",0,1)","v":0},"Species (Scientific name)",null,null,null,"Australian Bass",0,{"$f":"IF(L3=0,\"\",INDEX(K3:K47,L3))","v":""},"Phase 1",0,{"$f":"IF(O3=0,\"\",INDEX(N3:N47,O3))","v":""},"1 hour ",0,{"$f":"IF(R3=0,\"\",INDEX(Q3:Q47,R3))","v":""},"Method 1",0,{"$f":"IF(U3=0,\"\",INDEX(T3:T47,U3))","v":""},0.01,0,{"$f":"IF(X3=0,\"\",INDEX(W3:W47,X3))","v":""}]
[null,null,"Citation",null,null,{"$f":"IF(E4=\"\",0,1)","v":0},"Lifestage",null,null,null,"Bala Shark",null,null,"Phase 2",null,null,"2 hours",null,null,"Method 2",null,null,0.02]
[null,null,null,null,null,{"$f":"IF(S3=\"\",0,1)","v":0},"Exposure duration",null,null,null,"Basa",null,null,"Phase 3",null,null,"3 hours",null,null,"Method 3",null,null,0.03]
[null,null,null,null,null,{"$f":"IF(V3=\"\",0,1)","v":0},"Measure of toxicity",null,null,null,"Black Parinha",null,null,"Phase 4",null,null,"4 hours",null,null,"Method 4",null,null,0.04]
[null,null,null,null,null,{"$f":"IF(Y3=\"\",0,1)","v":0},"Toxicity endpoint",null,null,null,"Catfish",null,null,"Phase 5",null,null,"5 Hours",null,null,"Method 5",null,null,0.05]
[null,null,null,null,null,{"$f":"IF(H8=\"\",0,1)","v":0},"Toxicity value",null,null,null,null,null,null,"phase 6"]
[null,2,"CHOOSE ANSWER OPTIONS AND FILL IN ANSWERS IN ANSWER COLUMN",null,null,{"$f":"IF(M3=\"\",0,1)","v":0}]
[null,"*","If had problem click on answer options,click on any  other cells first and then click back again",null,null,{"$f":"IF(P3=\"\",0,1)","v":0}]
[null,"No.","Question","Marks Awarded","Answer Options","Option References","Scores","Answers"]
[null,null,"Was the duration of the exposure stated (e.g., 48 or 96 h)?",10,null,0,{"$f":"IF(F15=0,0,INDEX($D12:$D13,F12,1))","v":0}]
[null,1,null,0]
[]
[null,null,"Was the biological endpoint (e.g., immobilization or population growth) stated and defined (10 marks)? Award 5 marks if the biological endpoint is only stated.",10,null,0,{"$f":"IF(F15=0,0,INDEX($D15:$D17,F15,1))","v":0}]
[null,2,null,5]
[null,null,null,0]
[null,null,"Was the biological effect stated (e.g., LC or NOEC)?",5,null,0,{"$f":"IF(F18=0,0,INDEX($D18:$D19,F18,1))","v":0}]
[null,3,null,0]
[]
[null,4,"Was the biological effect quantified (e.g., 50% effect, 25% effect)? The effect for NOEC and LOEC data must be quantified.",5,null,0,{"$f":"IF(F21=0,0,INDEX($D21:$D22,F21,1))","v":0}]
[null,null,null,0]
[null,5,"Were appropriate controls (e.g., a no-toxicant control and/or solvent control) used?",5,null,0,{"$f":"IF(F23=0,0,INDEX($D23:$D24,F23,1))","v":0}]
[null,null,null,0]
[]
[null,6,"Was each control and contaminant concentration at least duplicated?",5,null,0,{"$f":"IF(F26=0,0,INDEX($D26:$D27,F26,1))","v":0}]
[null,null,null,0]
[]
[null,7,"Were test acceptability criteria stated (e.g., mortality in controls must not exceed a certain percentage) (5 marks)?\nOR\nWere test acceptability criteria inferred (e.g., test method used [USEPA, OECD, ASTM etc]) (award 2 marks). Note: Invalid data must no",5,null,0,{"$f":"IF(F29=0,0,INDEX($D29:$D31,F29,1))","v":0}]
[null,null,null,2]
[null,null,null,0]
[null,8,"Were the characteristics of the test organism (e.g., length, mass, age) stated?",5,null,0,{"$f":"IF(F32=0,0,INDEX($D32:$D34,F32,1))","v":0}]
[null,null,null,0]
[]
[null,9,"Was the type of test media used stated?",5,null,0,{"$f":"IF(F35=0,0,INDEX($D35:$D37,F35,1))","v":0}]
[null,null,null,0]
[]
[null,null,"Were the contaminant concentrations measured?",4,null,0,{"$f":"IF(F38=0,0,INDEX($D38:$D40,F38,1))","v":0}]
[null,10,null,0]
[]
[null,null,"Were parallel reference toxicant toxicity tests conducted?",4,null,0,{"$f":"IF(F41=0,0,INDEX($D41:$D43,F41,1))","v":0}]
[null,11,null,0]
[]
[null,null,"Was there a concentration–response relationship either observable or stated",4,null,0,{"$f":"IF(F44=0,0,INDEX($D44:$D46,F44,1))","v":0}]
[null,12,null,0]
[]
[null,null,"Was an appropriate statistical method or model used to determine the toxicity?",4,null,0,{"$f":"IF(F47=0,0,INDEX($D47:$D49,F47,1))","v":0}]
[null,13,null,0]
[]
[null,14,"For NOEC/LOEC data was the significance level 0.05 or less?   Or                                         For LC/EC/BEC data was an estimate of variability provided?\n\n",4,null,0,{"$f":"IF(F50=0,0,INDEX($D50:$D52,F50,1))","v":0}]
[null,null,null,0]
[]
[null,15,"Were the following parameters measured and stated? (3 marks if measured and stated, 1 if just measured)"]
[null,null,"pH",3,null,0,{"$f":"IF(F54=0,0,INDEX($D54:$D56,F54,1))","v":0}]
[null,15.1,null,1]
[null,null,null,0]
[]
[null,null,"OM or OC content",3,null,0,{"$f":"IF(F58=0,0,INDEX($D58:$D60,F58,1))","v":0}]
[null,15.2,null,1]
[null,null,null,0]
[]
[null,null,"Clay Contect",3,null,0,{"$f":"IF(F62=0,0,INDEX($D62:$D64,F62,1))","v":0}]
[null,15.3,null,1]
[null,null,null,0]
[]
[null,null,"CEC",3,null,0,{"$f":"IF(F66=0,0,INDEX($D66:$D68,F66,1))","v":0}]
[null,15.4,null,1]
[null,null,null,0]
[]
[null,null,"Was the temperature measured and stated?",3,null,0,{"$f":"IF(F70=0,0,INDEX($D70:$D72,F70,1))","v":0}]
[null,16,null,0]
[]
[null,null,"Was the grade or purity of the test contaminant stated?",3,null,0,{"$f":"IF(F73=0,0,INDEX($D73:$D74,F73,1))","v":0}]
[null,17,null,0]
[]
[]
[null,null,"Were other cations and or major soil elements measured?                                                  Or                                                                                                                             Were known interacting elements on bioavailability measured (e.g. Mo for Cu and Cl for Cd)?",3,null,0,{"$f":"IF(F77=0,0,INDEX($D77:$D78,F77,1))","v":0}]
[null,18,null,0]
[]
[]
[null,null,"For spiked soils with metal salts: Were the soils leached after spiking?",3,null,0,{"$f":"IF(F81=0,0,INDEX($D81:$D83,F81,1))","v":0}]
[null,19,null,0]
[]
[null,null,"Were the incubation conditions and duration stated?",3,null,0,{"$f":"IF(F84=0,0,INDEX($D84:$D87,F84,1))","v":0}]
[null,20,null,1]
[null,null,null,0]
[null,null,null,null,null,null,null,null,{"$f":"(COUNTIF(F12:F87,\"=0\"))+COUNTIF(F2:F10,\"=0\")","v":32}]
[]
[]
[null,null,"Total Score",null,null,null,{"$f":"IF(SUM(G12:G84)=0,\"\",SUM(G12:G84))","v":""}]
[null,null,"Total Max. possible score for the various types of data and contaminants ",null,{"$f":"D12+D15+D18+D21+D23+D26+D29+D32+D35+D38+D41+D44+D47+D50+D54+D58+D62+D66+D70+D73+D77+D81+D84","v":102}]
[null,null,"Quality Score",null,{"$f":"\"= [Total score / Total possible score] * 100 = \"","v":"= [Total score / Total possible score] * 100 = "},null,{"$f":"IF(ISERROR(G90/E91),#N/A,G90/E91)","v":{"$error":"#N/A"}}]
[]
[null,null,"H = high quality                           Quality score >=80%      "]
[null,null,"A = acceptable quality         80%>Quality score>50%      "]
[null,null,"U = unacceptable quality              Quality score <=50%  "]
[]
[3,null,"CLICK \"Save&Update\" BUTTON TO SAVE ANSWER TO SAMPLE FINALISED ASSESSMENT SHEET"]

{"sheet":"Terrestrial Quality","index":18,"n_rows":5,"n_cols":26,"rows_kept":5,"cut":false,"hidden":false,"merged":[]}
[]
["Question No.",1,2,3,4,5,6,7,8,9,10,11,12,13,14,15.1,15.2,15.3,15.4,16,17,18,19,20,"Total Score","Quality Score"]
["Short Questions","duration of the exposure  ","biological endpoint","biological effect stated or not","biological effect qualified or not","appropriate controls","control & contaminant concentration","test acceptability criteria ","characteristics of the test organism"," type of test media"," contaminant concentrations "," parallel reference toxicant toxicity","concentration–response relationship"," statistical method or model to determine the toxicity","LC/EC/BEC data","pH","OM or OC content","Clay content","CEC","Temperature","Grade or purity","cations and or major soil elements measured or  interacting elements on bioavailability measured ","soils leached after spiking","incubation conditions and duration"]
["Marks Awarded","10 or 0","10,5 or 0","5 or 0 ","5 or 0 ","5 or 0 ","5 or 0 ","5 ,2 or 0 ","5 or 0 ","5 or 0 ","4 or 0","4 or 0","4 or 0","4 or 0","4 or 0","3,1,or 0","3,1,or 0","3,1,or 0","3,1,or 0","3 or 0","3 or 0","3 or 0","3 or 0","3 or 0"]
["Max. Possible Score",10,10,5,5,5,5,5,5,5,4,4,4,4,4,3,3,3,3,3,3,3,3,3,{"$f":"SUM(B5:X5)","v":102}]

{"sheet":"Sediment Data QA","index":19,"n_rows":103,"n_cols":25,"rows_kept":103,"cut":false,"hidden":false,"merged":[[72,7,75,7],[76,7,79,7],[52,7,54,7],[89,2,90,2],[68,2,71,2],[80,2,82,2],[72,2,75,2],[76,2,79,2],[80,7,82,7],[64,2,67,2],[64,7,67,7],[68,7,71,7],[60,2,63,2],[56,2,59,2],[91,2,92,2],[89,7,90,7],[91,7,92,7],[87,7,88,7],[83,7,86,7],[83,2,86,2],[40,2,42,2],[46,2,48,2],[49,2,51,2],[52,2,54,2],[43,2,45,2],[28,2,30,2],[22,7,24,7],[25,7,27,7],[31,2,33,2],[37,7,39,7],[34,2,36,2],[37,2,39,2],[11,2,13,2],[20,2,21,2],[22,2,24,2],[25,2,27,2],[14,2,16,2],[17,2,19,2],[3,4,7,4],[56,7,59,7],[60,7,63,7],[40,7,42,7],[43,7,45,7],[46,7,48,7],[11,7,13,7],[17,7,19,7],[49,7,51,7],[34,7,36,7],[14,7,16,7],[20,7,21,7],[28,7,30,7],[31,7,33,7]]}
[null,1,"FILL IN BLANKS BELOW,PICK OPTIONS FROM DROPDOWN LIST",null,null,null,null,null,null,null,"* All the text in Blue are used for drop down list ,make changes with caution."]
[null,null,"Category",null,"Sediment ",{"$f":"IF(M3=\"\",0,1)","v":0},"Citation No.",{"$f":"IF(ISERROR(FIND(\"-\",E3)),E3,LEFT(E3,FIND(\"-\",E3)-1))","v":0},null,null,"Species",null,null,"Lifestage",null,null,"Exposure duration",null,null,"Measure of toxicity",null,null,"Toxicity endpoint"]
[null,null,"Paper and data unique identifier(eg. 1-1,10-150)",null,null,{"$f":"IF(E3=\"\",0,1)","v":0},"Species (Scientific name)",null,null,null,"Australian Bass",0,{"$f":"IF(L3=0,\"\",INDEX(K3:K50,L3))","v":""},"Phase 1",0,{"$f":"IF(O3=0,\"\",INDEX(N3:N50,O3))","v":""},"1 hour ",0,{"$f":"IF(R3=0,\"\",INDEX(Q3:Q50,R3))","v":""},"Method 1",0,{"$f":"IF(U3=0,\"\",INDEX(T3:T50,U3))","v":""},0.01,0,{"$f":"IF(X3=0,\"\",INDEX(W3:W50,X3))","v":""}]
[null,null,"Citation",null,null,{"$f":"IF(E4=\"\",0,1)","v":0},"Lifestage",null,null,null,"Bala Shark",null,null,"Phase 10",null,null,"2 hours",null,null,"Method 10",null,null,0.02]
[null,null,null,null,null,{"$f":"IF(S3=\"\",0,1)","v":0},"Exposure duration",null,null,null,"Basa",null,null,"phase 14",null,null,"3 hours",null,null,"Method 2",null,null,0.03]
[null,null,null,null,null,{"$f":"IF(V3=\"\",0,1)","v":0},"Measure of toxicity",null,null,null,"Black Parinha",null,null,"Phase 2",null,null,"4 hours",null,null,"Method 3",null,null,0.04]
[null,null,null,null,null,{"$f":"IF(Y3=\"\",0,1)","v":0},"Toxicity endpoint",null,null,null,"Catfish",null,null,"Phase 3",null,null,"5 hours",null,null,"Method 4",null,null,0.05]
[null,null,null,null,null,{"$f":"IF(H8=\"\",0,1)","v":0},"Toxicity value",null,null,null,"Eel",null,null,"Phase 4",null,null,"6 hours",null,null,"Method 5",null,null,0.06]
[null,2,"CHOOSE ANSWER OPTIONS AND FILL IN ANSWERS IN ANSWER COLUMN",null,null,{"$f":"IF(M3=\"\",0,1)","v":0},null,null,null,null,"Lungfish",null,null,"Phase 5",null,null,"7 hours",null,null,"Method 6",null,null,7.0000000000000007E-2]
[null,"*","If had problem click on answer options,click on any  other cells first and then click back again",null,null,{"$f":"IF(P3=\"\",0,1)","v":0},null,null,null,null,"Murray Cod",null,null,"Phase 6",null,null,"8 hours",null,null,"Method 7",null,null,0.08]
[null,"No.","Question","Marks Awarded","Answer Options","Option References","Scores","Answers",null,null,"Nemo",null,null,"Phase 7 ",null,null,"9 hours",null,null,"Method 8",null,null,0.09]
[null,null,"Was the duration of the exposure stated (e.g., 48 or 96 h)?",10,null,0,{"$f":"IF(F15=0,0,INDEX($D12:$D13,F12,1))","v":0},null,null,null,"Redclaw",null,null,"Phase 8",null,null,null,null,null,null,null,null,0.1]
[null,1,null,0,null,null,null,null,null,null,"Sea Mullet",null,null,"Phase 9"]
[null,null,null,null,null,null,null,null,null,null,"SilverPerch"]
[null,null,"Was the biological endpoint (e.g., immobilization or population growth) stated and defined (10 marks)? Award 5 marks if the biological endpoint is only stated.",10,null,0,{"$f":"IF(F15=0,0,INDEX($D15:$D17,F15,1))","v":0},null,null,null,"Whale"]
[null,2,null,5]
[null,null,null,0]
[null,null,"Was the biological effect stated (e.g., LC or NOEC)?",5,null,0,{"$f":"IF(F18=0,0,INDEX($D18:$D19,F18,1))","v":0}]
[null,3,null,0]
[]
[null,4,"Was the biological effect quantified (e.g., 50% effect, 25% effect)? The effect for NOEC and LOEC data must be quantified.",5,null,0,{"$f":"IF(F21=0,0,INDEX($D21:$D22,F21,1))","v":0}]
[null,null,null,0]
[null,5,"Were appropriate controls (e.g., a no-toxicant control and/or solvent control) used?",5,null,0,{"$f":"IF(F23=0,0,INDEX($D23:$D24,F23,1))","v":0}]
[null,null,null,0]
[]
[null,6,"Was each control and contaminant concentration at least duplicated?",5,null,0,{"$f":"IF(F26=0,0,INDEX($D26:$D27,F26,1))","v":0}]
[null,null,null,0]
[]
[null,7,"Were test acceptability criteria stated (e.g., mortality in controls must not exceed a certain percentage) (5 marks)?\nOR\nWere test acceptability criteria inferred (e.g., test method used [USEPA, OECD, ASTM etc]) (award 2 marks). Note: Invalid data must no",5,null,0,{"$f":"IF(F29=0,0,INDEX($D29:$D31,F29,1))","v":0}]
[null,null,null,2]
[null,null,null,0]
[null,8,"Were the characteristics of the test organism (e.g., length, mass, age) stated?",5,null,0,{"$f":"IF(F32=0,0,INDEX($D32:$D34,F32,1))","v":0}]
[null,null,null,0]
[]
[null,9,"Was the type of test media used stated?",5,null,0,{"$f":"IF(F35=0,0,INDEX($D35:$D37,F35,1))","v":0}]
[null,null,null,0]
[]
[null,null,"Was the type of exposure (e.g. static, flow through) stated? ",4,null,0,{"$f":"IF(F38=0,0,INDEX($D38:$D40,F38,1))","v":0}]
[null,10,null,0]
[]
[null,null,"Were the contaminant concentrations measured?",4,null,0,{"$f":"IF(F41=0,0,INDEX($D41:$D43,F41,1))","v":0}]
[null,11,null,0]
[]
[null,null,"Were parallel reference toxicant toxicity tests conducted?",4,null,0,{"$f":"IF(F44=0,0,INDEX($D44:$D46,F44,1))","v":0}]
[null,12,null,0]
[]
[null,null,"Was there a concentration–response relationship either observable or stated",4,null,0,{"$f":"IF(F47=0,0,INDEX($D47:$D49,F47,1))","v":0}]
[null,13,null,0]
[]
[null,null,"Was an appropriate statistical method or model used to determine the toxicity?",4,null,0,{"$f":"IF(F50=0,0,INDEX($D50:$D52,F50,1))","v":0}]
[null,14,null,0]
[]
[null,15,"For LC/EC/BEC data values derived was an estimate of variability provided? (10/20 effects data desirable)\nOR If NO EC/LOEC data, was the significance level 0.05 or less?                                                 \n\n",4,null,0,{"$f":"IF(F53=0,0,INDEX($D53:$D55,F53,1))","v":0}]
[null,null,null,0]
[]
[null,16,"Were the following parameters measured and stated? (3 marks if measured and stated, 1 if just measured)"]
[null,null,"pH",3,null,0,{"$f":"IF(F57=0,0,INDEX($D57:$D59,F57,1))","v":0}]
[null,16.100000000000001,null,1]
[null,null,null,0]
[]
[null,null,"Particulate organic carbon (POC)",3,null,0,{"$f":"IF(F61=0,0,INDEX($D61:$D63,F61,1))","v":0}]
[null,16.2,null,1]
[null,null,null,0]
[]
[null,null,"Particle size (e.g. <63 µm or silt/clay)",3,null,0,{"$f":"IF(F65=0,0,INDEX($D65:$D67,F65,1))","v":0}]
[null,16.3,null,1]
[null,null,null,0]
[]
[null,null,"Acid-volatile sulfide (AVS) and 1-M HCl extractable metals",3,null,0,{"$f":"IF(F69=0,0,INDEX($D69:$D71,F69,1))","v":0}]
[null,16.399999999999999,null,1]
[null,null,null,0]
[]
[null,null,"Dissolved contaminants (e.g. metals) in porewater or overlying water",3,null,0,{"$f":"IF(F73=0,0,INDEX($D73:$D75,F73,1))","v":0}]
[null,16.5,null,1]
[null,null,null,0]
[]
[null,null,"Dissolved ammonia and sulfide in porewater or overlying water",3,null,0,{"$f":"IF(F77=0,0,INDEX($D77:$D79,F77,1))","v":0}]
[null,16.600000000000001,null,1]
[null,null,null,0]
[]
[null,null,"Was the temperature measured and stated?",3,null,0,{"$f":"IF(F81=0,0,INDEX($D81:$D83,F81,1))","v":0}]
[null,17,null,0]
[]
[null,null,"Was the grade or purity of the test contaminant stated?",3,null,0,{"$f":"IF(F84=0,0,INDEX($D84:$D85,F84,1))","v":0}]
[null,18,null,0]
[]
[]
[null,19,"Was the salinity/conductivity measured and stated?",3,null,0,{"$f":"IF(F88=0,0,INDEX($D88:$D89,F88,1))","v":0}]
[null,null,null,0]
[null,20,"Was the alkalinity, hardness, or concentrations of Ca and Mg measured in the overlying water?Were known interacting elements on bioavailability measured (e.g. Cl for Cd)?",3,null,0,{"$f":"IF(F90=0,0,INDEX($D90:$D91,F90,1))","v":0}]
[null,null,null,0]
[null,21,"For sediments spiked with metal salts were the equilibration conditions adequate?",3,null,0,{"$f":"IF(F92=0,0,INDEX($D92:$D93,F92,1))","v":0}]
[null,null,null,0,null,null,null,null,{"$f":"(COUNTIF(F12:F93,\"=0\"))+COUNTIF(F2:F10,\"=0\")","v":35}]
[]
[null,null,"Total score",null,null,null,{"$f":"IF(SUM(G12:G92)=0,\"\",SUM(G12:G92))","v":""}]
[null,null,"Total Max. possible score for the various types of data and contaminants ",null,{"$f":"D12+D15+D18+D21+D23+D26+D29+D32+D35+D38+D41+D44+D47+D50+D53+D57+D61+D65+D69+D73+D77+D81+D84+D88+D90+D92","v":112}]
[null,null,"Quality Score",null,{"$f":"\"= [Total score / Total possible score] * 100 = \"","v":"= [Total score / Total possible score] * 100 = "},null,{"$f":"IF(ISERROR(G95/E96),#N/A,G95/E96)","v":{"$error":"#N/A"}}]
[]
[null,null,"H = high quality                           Quality score >=80%      "]
[null,null,"A = acceptable quality         80%>Quality score>50%      "]
[null,null,"U = unacceptable quality              Quality score <=50%  "]
[]
[3,null,"CLICK \"Save&Update\" BUTTON TO SAVE ANSWER TO SAMPLE FINALISED ASSESSMENT SHEET"]

{"sheet":"Sediment Quality","index":20,"n_rows":5,"n_cols":29,"rows_kept":5,"cut":false,"hidden":false,"merged":[]}
[]
["Question No.",1,2,3,4,5,6,7,8,9,10,11,12,13,14,15,16.100000000000001,16.2,16.3,16.399999999999999,16.5,16.600000000000001,17,18,19,20,21,"Total Score","Quality Score"]
["Short Questions","duration of the exposure ","biological endpoint","biological effect stated ornot","biological effect quantified or not","appropriate controls","control & contaminant concentration","test acceptability criteria","characteristics of the test organism"," type of test media","type of exposure","contaminant concentrations","parallel reference toxicant toxicity tests","concentration–response relationship","determine the toxicity","LC/EC/BEC ","pH","POC","Particle size","AVS & 1-M HCl extractable metals","Dissolved contaminants","Dissolved ammonia and sulfide","Temperature","Grade or purity"," salinity/conductivity","alkalinity, hardness, or concentrations of Ca and Mg","equilibration conditions "]
["Marks Awarded","10 or 0","10,5 or 0","5 or 0 ","5 or 0 ","5 or 0 ","5 or 0 ","5 or 0 ","5 or 0 ","5 or 0 ","4 or 0","4 or 0","4 or 0","4 or 0","4 or 0","4 or 0","3,1,or 0","3,1,or 0","3,1,or 0","3,1,or 0","3,1,or 0","3,1,or 0","3 or 0","3 or 0","3 or 0","3 or 0"]
["Max. Possible Score",10,10,5,5,5,5,5,5,5,4,4,4,4,4,4,3,3,3,3,3,3,3,3,3,3,3,{"$f":"SUM(B5:AA5)","v":112}]

{"sheet":"Sheet2","index":21,"n_rows":0,"n_cols":0,"rows_kept":0,"cut":false,"hidden":false,"merged":[]}

{"sheet":"Sheet3","index":22,"n_rows":0,"n_cols":0,"rows_kept":0,"cut":false,"hidden":false,"merged":[]}