{"text_format":"1","workbook":"xlsx","n_sheets":22,"sheets":["Copyright","Cover","All Result","Instruction","Sheet1","FW metal nonplant","FW metal nonplant_WS","FW nonmetal nonplant","FW nonmetal nonplant_WS","FW metal plant","FW metal plant_WS","FW nonmetal plant","FW nonmetal plant_WS","MEW nonplant","MEW nonplant_WS","MEW plant","MEW plant_WS","Terrestrial Data QA","Terrestrial Quality","Sediment Data QA","Sediment Quality","All Results"],"not_rendered":{"charts":0,"images":0,"macros":1,"external_links":1,"defined_names":10,"comments":11,"pivot_tables":0},"unopened":[],"bounds":{"document_bytes":16777216,"sheet_cells":100000,"rows_first":2000,"rows_last":500,"rows_between":2000,"halvings":0,"cell_chars":16384,"cell_head_chars":4096},"cells_cut":0,"cells_raw":0,"read":"whole","date_system":"1900"}

{"sheet":"Copyright","index":0,"n_rows":0,"n_cols":0,"rows_kept":0,"cut":false,"hidden":false,"merged":[]}

{"sheet":"Cover","index":1,"n_rows":20,"n_cols":7,"rows_kept":20,"cut":false,"hidden":false,"merged":[[18,6,18,8],[14,6,14,8],[13,6,13,8],[4,4,4,10],[9,6,9,8],[12,6,12,8],[5,5,6,9]]}
[]
[]
[]
[]
[null,null,null,null,"Ecotoxicity Data Quality Assessment Method V2"]
[null,null,null,null,null,"To be used to assess the quality of data used for the Australian and New Zealand Guidelines for Fresh and Marine Water Quality (including sediment) and the Australian National Environment Protection (Assessment of Site Contamination) Measure"]
[]
[]
[]
[null,null,null,null,null,null,"Developed by "]
[]
[]
[null,null,null,null,null,null,"Zoe Zhang"]
[null,null,null,null,null,null,"   Dr. Michael Warne"]
[null,null,null,null,null,null,"Alison Vieritz "]
[]
[]
[]
[null,null,null,null,null,null,"Water Quality & Investigations "]
[null,null,null,null,null,"                 Department of Science,Information Technology and Innovation"]

{"sheet":"All Result","index":2,"n_rows":415,"n_cols":23,"rows_kept":415,"cut":false,"hidden":false,"merged":[]}
["Diuron (marine)"]
[{"$f":"'FW nonmetal plant'!C2","v":"Category"},{"$f":"'FW nonmetal plant'!C3","v":"Paper and data unique identifier(eg. 1-1,10-150)"},{"$f":"'FW nonmetal plant'!C70","v":"Total score"},{"$f":"'FW nonmetal plant'!C72","v":"Quality Score"},"Comment ",{"$f":"'FW nonmetal plant'!G3","v":"Species (Scientific name)"},{"$f":"'FW nonmetal plant'!G4","v":"Lifestage"},{"$f":"'FW nonmetal plant'!G5","v":"Exposure duration"},{"$f":"'FW nonmetal plant'!G6","v":"Measure of toxicity"},{"$f":"'FW nonmetal plant'!G7","v":"Toxicity endpoint"},{"$f":"'FW nonmetal plant'!G8","v":"Toxicity value"},{"$f":"'FW nonmetal plant'!J2","v":"Taxonomic group"},{"$f":"'FW nonmetal plant'!J3","v":"Phylum"},{"$f":"'FW nonmetal plant'!J4","v":"Class"},{"$f":"'FW nonmetal plant'!J5","v":"Media"},{"$f":"'FW nonmetal plant'!J6","v":"Temperature "},{"$f":"'FW nonmetal plant'!J7","v":"Acute Or Chronic "},{"$f":"'FW nonmetal plant'!J8","v":"PH"},{"$f":"'FW metal plant'!J9","v":"Salinity/Conductivity"},{"$f":"'FW metal plant'!C4","v":"Citation"},{"$f":"'FW metal plant'!G2","v":"Citation No."}]
["MEW_nonplant","942-1",67,0.71276595744680848,"The highest possible grade for this datum is acceptable.","Oryzias melastigma","Larvae","96 hour","LC50","Mortality","7800 ug/L","Fish ","Chordata","Actinopterygii","Marinewater","25 (+ - 1) C","Acute","8.1 - 8.4","33 (+ - 0.5) %","Bao, V. W. W., Leung, K. M. Y., Qiu, J. W. & Lam, M. H. W. 2011. Acute toxicities of five commonly used antifouling booster biocides to selected subtropical and cosmopolitan marine species, Marine Pollution Bulletin, 62: 1147 - 1151.","942"]
["MEW_nonplant","942-2",67,0.71276595744680848,"The highest possible grade for this datum is acceptable.","Tigriopus japonicus","Adult","96 hour","LC50","Mortality","11000 ug/L","Crustacean","Arthropoda","Maxillopoda","Marinewater","25 (+ - 1) C","Acute","8.1 - 8.4","33 (+ - 0.5) %","Bao, V. W. W., Leung, K. M. Y., Qiu, J. W. & Lam, M. H. W. 2011. Acute toxicities of five commonly used antifouling booster biocides to selected subtropical and cosmopolitan marine species, Marine Pollution Bulletin, 62: 1147 - 1151.","942"]
["MEW_nonplant","942-3",67,0.71276595744680848,"The highest possible grade for this datum is acceptable.","Elasmopus rapax","Juvenile","96 hour","LC50","Mortality",">3000 ug/L","Crustacean","Arthropoda","Malacostraca","Marinewater","25 (+ - 1) C","Acute","8.1 - 8.4","33 (+ - 0.5) %","Bao, V. W. W., Leung, K. M. Y., Qiu, J. W. & Lam, M. H. W. 2011. Acute toxicities of five commonly used antifouling booster biocides to selected subtropical and cosmopolitan marine species, Marine Pollution Bulletin, 62: 1147 - 1151.","942"]
["MEW_nonplant","942-4",67,0.71276595744680848,"The highest possible grade for this datum is acceptable.","Balanus amphitrite","Larvae","24 hour","LC50","Mortality","21000 ug/L","Crustacean","Arthropoda","Maxillopoda","Marinewater","25 (+ - 1) C","Acute","8.1 - 8.4","33 (+ - 0.5) %","Bao, V. W. W., Leung, K. M. Y., Qiu, J. W. & Lam, M. H. W. 2011. Acute toxicities of five commonly used antifouling booster biocides to selected subtropical and cosmopolitan marine species, Marine Pollution Bulletin, 62: 1147 - 1151.","942"]
["MEW_nonplant","942-5",67,0.71276595744680848,"The highest possible grade for this datum is acceptable.","Hydroides elegans ","Larvae","48 hour","LC50","Mortality","16000 ug/L","Polychaete","Annelida","Polychaeta","Marinewater","27 (+ - 1) C","Acute","8.1 - 8.4","33 (+ - 0.5) %","Bao, V. W. W., Leung, K. M. Y., Qiu, J. W. & Lam, M. H. W. 2011. Acute toxicities of five commonly used antifouling booster biocides to selected subtropical and cosmopolitan marine species, Marine Pollution Bulletin, 62: 1147 - 1151.","942"]
["MEW_nonplant","942-6",63,0.67021276595744683,"The highest possible grade for this datum is acceptable.","Acropora tumida","Larvae","24 hour","LC10","Mortality","91 ug/L","Coral","Cnidaria","Anthozoa","Marinewater","25 (+ - 1) C","Acute","8.1 - 8.4","33 (+ - 0.5) %","Bao, V. W. W., Leung, K. M. Y., Qiu, J. W. & Lam, M. H. W. 2011. Acute toxicities of five commonly used antifouling booster biocides to selected subtropical and cosmopolitan marine species, Marine Pollution Bulletin, 62: 1147 - 1151.","942"]
["MEW_nonplant","942-7",67,0.71276595744680848,"The highest possible grade for this datum is acceptable.","Acropora tumida","Larvae","24 hour","LC50","Mortality","4800 ug/L","Coral","Cnidaria","Anthozoa","Marinewater","25 (+ - 1) C","Acute","8.1 - 8.4","33 (+ - 0.5) %","Bao, V. W. W., Leung, K. M. Y., Qiu, J. W. & Lam, M. H. W. 2011. Acute toxicities of five commonly used antifouling booster biocides to selected subtropical and cosmopolitan marine species, Marine Pollution Bulletin, 62: 1147 - 1151.","942"]
["MEW_plant","942-8",72,0.79120879120879117,"The highest possible grade for this datum is acceptable.","Pyrocystis lunula","Not stated","24 hour","EC50","Microalga","43000 ug/L","Microalga","Mioza","Dinophyceae","Marinewater","25 (+ - 1) C","Acute","8.1 - 8.4","30 (+ - 0.5) %","Bao, V. W. W., Leung, K. M. Y., Qiu, J. W. & Lam, M. H. W. 2011. Acute toxicities of five commonly used antifouling booster biocides to selected subtropical and cosmopolitan marine species, Marine Pollution Bulletin, 62: 1147 - 1151.","942"]
["MEW_plant","942-9",72,0.79120879120879117,"The highest possible grade for this datum is acceptable.","Thalassiosira pseudonana","Not stated","96 hour","EC50","Microalga","4.3 ug/L","Microalga","Bacillariophyta","Mediophyceae","Marinewater","25°C","Acute","8.1 - 8.4","30 (+ - 0.5) %","Bao, V. W. W., Leung, K. M. Y., Qiu, J. W. & Lam, M. H. W. 2011. Acute toxicities of five commonly used antifouling booster biocides to selected subtropical and cosmopolitan marine species, Marine Pollution Bulletin, 62: 1147 - 1151.","942"]
["MEW_plant","942-10",72,0.79120879120879117,"The highest possible grade for this datum is acceptable.","Skeletonema costatum","Not stated","96 hour","EC50","Microalga","5.9 ug/L","Microalga","Bacillariophyta","Mediophyceae","Marinewater","25°C","Acute","8.1 - 8.4","30 (+ - 0.5) %","Bao, V. W. W., Leung, K. M. Y., Qiu, J. W. & Lam, M. H. W. 2011. Acute toxicities of five commonly used antifouling booster biocides to selected subtropical and cosmopolitan marine species, Marine Pollution Bulletin, 62: 1147 - 1151.","942"]
["MEW_plant","942-11",72,0.79120879120879117,"The highest possible grade for this datum is acceptable.","Chroococcus minor","Not stated","7 day","EC50","Microalga","4.7 ug/L","Cyanobacteria","Cyanobacteria","Cyanophyceae","Marinewater","25°C","Acute","8.1 - 8.4","30 (+ - 0.5) %","Bao, V. W. W., Leung, K. M. Y., Qiu, J. W. & Lam, M. H. W. 2011. Acute toxicities of five commonly used antifouling booster biocides to selected subtropical and cosmopolitan marine species, Marine Pollution Bulletin, 62: 1147 - 1151.","942"]
["MEW_plant","946-1",64,0.70329670329670335,"The highest possible grade for this datum is acceptable.","Dunaliaella tertiolecta","Log growth phase","96 hour","EC50","Population: Growth rate (optical density)","9.8 ug/L","Plantae","Chlorophyta","Chlorophyceae","F2 marine media ","25°C","Chronic","Not stated","20 ppt","DeLorenzo, M. E., Danese, L. E. & Baird, T. D. 2011. Influence of Increasing Temperature and Salinity on Herbicide Toxicity in Estuarine Phytoplankton, Wiley Periodicals, pp. 359 - 371.","946"]
["MEW_plant","946-2",54,0.59340659340659341,"The highest possible grade for this datum is acceptable.","Dunaliaella tertiolecta","Log growth phase","96 hour","LOEC","Population: Growth rate (optical density)","3.8 ug/L","Plantae","Chlorophyta","Chlorophyceae","F2 marine media ","25°C","Chronic","Not stated","20 ppt","DeLorenzo, M. E., Danese, L. E. & Baird, T. D. 2011. Influence of Increasing Temperature and Salinity on Herbicide Toxicity in Estuarine Phytoplankton, Wiley Periodicals, pp. 359 - 371.","946"]
["Freshwater/non-metal/non- plant","948-1",65,0.7142857142857143,"The highest possible grade for this datum is acceptable.","Daphnia magna","< 24 hours","48 hour","EC50","Immobility","8.6 mg/L","Microinvertebrate","Arthropoda","Branchiopoda","Not stated","20 (+ - 1) C","Acute ","Not stated","N.A.","Fernandez-Alba, A. R., Hernando, M. D., Piedra, L. & Chisti, Y. 2002. Toxicity evaluation of single and mixed antifouling biocides measured with acute toxicity bioassays, Analytica Chimica Acta, vol. 456, pp. 303 - 312.","948"]
["Freshwater/non-metal/non- plant","948-2",56,0.61538461538461542,"The highest possible grade for this datum is acceptable.","Daphnia magna","< 24 hours","48 hour","LOEC","Immobility","3.5 mg/L","Microinvertebrate","Arthropoda","Branchiopoda","Not stated","20 (+ - 1) C","Acute ","Not stated","N.A.","Fernandez-Alba, A. R., Hernando, M. D., Piedra, L. & Chisti, Y. 2002. Toxicity evaluation of single and mixed antifouling biocides measured with acute toxicity bioassays, Analytica Chimica Acta, vol. 456, pp. 303 - 312.","948"]
["Freshwater/non-metal/non- plant","721-1",66,0.72527472527472525,"Standard methods state concentrations should be measured, paper does not","Daphnia magna","< 24 hours","48 hour","EC50","Immobility","8.6 mg/L","Microinvertebrate","Arthropoda","Branchiopoda","Not stated","Not stated","Acute ","Not stated","N.A.","Fernandez-Alba, A.R., Piedra, L., Mezcua, M., and Hernando, M.D. 2002. Toxicity of single and mixed contaminants in seawater measured with acute toxicity bioassays, The Scientific World Journal, vol. 2, pp. 1115 - 1120.","721"]
["Freshwater/non-metal/plant","721-2",69,0.78409090909090906,"The highest possible grade for this datum is acceptable.","Selenastrum capricornutum","Exponential growth phase","72 hour","EC50","Growth rate: Optical density (670 nm)","0.045 mg/L","Microalga","Chlorophyta","Freshwater","21-24 C","21-24 C","Chronic","Not stated","N.A.","Fernandez-Alba, A.R., Piedra, L., Mezcua, M., and Hernando, M.D. 2002. Toxicity of single and mixed contaminants in seawater measured with acute toxicity bioassays, vol. 2, pp. 1115 - 1120.","721"]
["MEW_nonplant","949-1",59,0.62765957446808507,"The highest possible grade for this datum is acceptable.","Artemia salina","II - III Instar","24 hour","LC50","Mortality","12.01 mg/L","Macroinvertebrate","Arthropoda","Branchiopoda","Atrificial seawater","25°C","Acute","Not stated",0.35,"Koutsaftis, A. & Aoyama, I. 2007. Toxicity of Four Antifouling Biocides and Their Mixtures on the Brine Shrimp Artemia salina, Sci. Total Environ.387(1-3): 166-174.  ","949"]
["Freshwater/non-metal/non- plant","950-1",78,0.8571428571428571,"","Paratya australiensis","Not stated","96 hour","LC50","Mortality: Survival","8800 ug/L","Unknown","Unknown","Unknown","Not stated","23.4 (+ - 0.8) C","Acute ","7.7 - 7.9","N.A.","Kumar, A., Correll, R., Grocke, S. & Bajet, C. 2010. Toxicity of selected pesticides to freshwater shrimp, Paratya australiensis (Decapoda: Atyidae): Use of time series acute toxicity data to predict chronic lethality, Ecotoxicology and Environmental Safety, vol. 73, pp. 360 - 369.","950"]
["MEW_nonplant","951-1",83,0.88297872340425532,"The highest possible grade for this datum is acceptable.","Psetta maxima","Embryo","2 days","LC10","Mortality","1396 ug/L","Fish","Chordata","Actinopterygii","Filtered sea water","18 (+ - 1) C","Acute","8.29 (+ - 0.1)","34.20 ppt","Mhadhbi, L. & Beiras, R. 2012. Acute Toxicity of Seven Selected Pesticides (Alachlor, Atrazine, Dieldrin, Diuron, Pirimiphos-Methyl, Chlorpyrifos, Diazinon) to the Marine Fish (Turbot, Psetta maxima), Water Air Soil Pollut, vol. 223, pp. 5917 - 5930","951"]
["MEW_nonplant","951-2",83,0.88297872340425532,"The highest possible grade for this datum is acceptable.","Psetta maxima","Embryo","2 days","LC50","Mortality","1076 ug/L","Fish","Chordata","Actinopterygii","Filtered sea water","18 (+ - 1) C","Acute","8.29 (+ - 0.1)","34.20 ppt","Mhadhbi, L. & Beiras, R. 2012. Acute Toxicity of Seven Selected Pesticides (Alachlor, Atrazine, Dieldrin, Diuron, Pirimiphos-Methyl, Chlorpyrifos, Diazinon) to the Marine Fish (Turbot, Psetta maxima), Water Air Soil Pollut, vol. 223, pp. 5917 - 5930","951"]
["MEW_nonplant","951-3",78,0.82978723404255317,"The highest possible grade for this datum is acceptable.","Psetta maxima","Embryo","2 days","NOEC","Mortality","625 ug/L","Fish","Chordata","Actinopterygii","Filtered sea water","18 (+ - 1) C","Acute","8.29 (+ - 0.1)","34.20 ppt","Mhadhbi, L. & Beiras, R. 2012. Acute Toxicity of Seven Selected Pesticides (Alachlor, Atrazine, Dieldrin, Diuron, Pirimiphos-Methyl, Chlorpyrifos, Diazinon) to the Marine Fish (Turbot, Psetta maxima), Water Air Soil Pollut, vol. 223, pp. 5917 - 5930","951"]
["MEW_nonplant","951-4",78,0.82978723404255317,"The highest possible grade for this datum is acceptable.","Psetta maxima","Embryo","2 days","LOEC","Mortality","1250 ug/L","Fish","Chordata","Actinopterygii","Filtered sea water","18 (+ - 1) C","Acute","8.29 (+ - 0.1)","34.20 ppt","Mhadhbi, L. & Beiras, R. 2012. Acute Toxicity of Seven Selected Pesticides (Alachlor, Atrazine, Dieldrin, Diuron, Pirimiphos-Methyl, Chlorpyrifos, Diazinon) to the Marine Fish (Turbot, Psetta maxima), Water Air Soil Pollut, vol. 223, pp. 5917 - 5930","951"]
["MEW_nonplant","951-5",83,0.88297872340425532,"The highest possible grade for this datum is acceptable.","Psetta maxima","Larvae","4 days","LC10","Mortality","1617 ug/L","Fish","Chordata","Actinopterygii","Filtered sea water","18 (+ - 1) C","Acute","8.29 (+ - 0.1)","34.20 ppt","Mhadhbi, L. & Beiras, R. 2012. Acute Toxicity of Seven Selected Pesticides (Alachlor, Atrazine, Dieldrin, Diuron, Pirimiphos-Methyl, Chlorpyrifos, Diazinon) to the Marine Fish (Turbot, Psetta maxima), Water Air Soil Pollut, vol. 223, pp. 5917 - 5930","951"]
["MEW_nonplant","951-6",83,0.88297872340425532,"The highest possible grade for this datum is acceptable.","Psetta maxima","Larvae","4 days","LC50","Mortality","7826 ug/L","Fish","Chordata","Actinopterygii","Filtered sea water","18 (+ - 1) C","Acute","8.29 (+ - 0.1)","34.20 ppt","Mhadhbi, L. & Beiras, R. 2012. Acute Toxicity of Seven Selected Pesticides (Alachlor, Atrazine, Dieldrin, Diuron, Pirimiphos-Methyl, Chlorpyrifos, Diazinon) to the Marine Fish (Turbot, Psetta maxima), Water Air Soil Pollut, vol. 223, pp. 5917 - 5930","951"]
["MEW_nonplant","951-7",78,0.82978723404255317,"The highest possible grade for this datum is acceptable.","Psetta maxima","Larvae","4 days","NOEC","Mortality","625 ug/L","Fish","Chordata","Actinopterygii","Filtered sea water","18 (+ - 1) C","Acute","8.29 (+ - 0.1)","34.20 ppt","Mhadhbi, L. & Beiras, R. 2012. Acute Toxicity of Seven Selected Pesticides (Alachlor, Atrazine, Dieldrin, Diuron, Pirimiphos-Methyl, Chlorpyrifos, Diazinon) to the Marine Fish (Turbot, Psetta maxima), Water Air Soil Pollut, vol. 223, pp. 5917 - 5930","951"]
["MEW_nonplant","951-8",78,0.82978723404255317,"The highest possible grade for this datum is acceptable.","Psetta maxima","Larvae","4 days","LOEC","Mortality","1250 ug/L","Fish","Chordata","Actinopterygii","Filtered sea water","18 (+ - 1) C","Acute","8.29 (+ - 0.1)","34.20 ppt","Mhadhbi, L. & Beiras, R. 2012. Acute Toxicity of Seven Selected Pesticides (Alachlor, Atrazine, Dieldrin, Diuron, Pirimiphos-Methyl, Chlorpyrifos, Diazinon) to the Marine Fish (Turbot, Psetta maxima), Water Air Soil Pollut, vol. 223, pp. 5917 - 5930","951"]
["MEW_nonplant","951-9",78,0.82978723404255317,"The highest possible grade for this datum is acceptable.","Psetta maxima","Embryo","2 days","NOEC","Reproduction: Hatching succuss","5000 ug/L","Fish","Chordata","Actinopterygii","Filtered sea water","18 (+ - 1) C","Acute","8.29 (+ - 0.1)","34.20 ppt","Mhadhbi, L. & Beiras, R. 2012. Acute Toxicity of Seven Selected Pesticides (Alachlor, Atrazine, Dieldrin, Diuron, Pirimiphos-Methyl, Chlorpyrifos, Diazinon) to the Marine Fish (Turbot, Psetta maxima), Water Air Soil Pollut, vol. 223, pp. 5917 - 5930","951"]
["MEW_nonplant","951-10",78,0.82978723404255317,"The highest possible grade for this datum is acceptable.","Psetta maxima","Larvae","4 days","NOEC","Reproduction: Hatching succuss","5000 ug/L","Fish","Chordata","Actinopterygii","Filtered sea water","18 (+ - 1) C","Acute","8.29 (+ - 0.1)","34.20 ppt","Mhadhbi, L. & Beiras, R. 2012. Acute Toxicity of Seven Selected Pesticides (Alachlor, Atrazine, Dieldrin, Diuron, Pirimiphos-Methyl, Chlorpyrifos, Diazinon) to the Marine Fish (Turbot, Psetta maxima), Water Air Soil Pollut, vol. 223, pp. 5917 - 5930","951"]
["Freshwater/non-metal/non- plant","952-1",61,0.67032967032967028,"The highest possible grade for this datum is acceptable.","Ctenopharyngodon idella","1+ years","24 hour","LC50","Mortality","47 mg/L","Fish","Chordata","Actinopterygii","Dechlorinated tap water","13.5 (+ - 0.5) C","Acute ",8.1,"N.A.","Toobey, T. E., Lucey, J. & Stott, B. 1980. The tolerance of grass carp, Ctenopharyngodon idella Val., to aquatic herbicides, J. Fish Biol., vol. 16, pp. 591 - 597. ","952"]
["Freshwater/non-metal/non- plant","952-2",61,0.67032967032967028,"The highest possible grade for this datum is acceptable.","Ctenopharyngodon idella","1+ years","48 hour","LC50","Mortality","44 mg/L","Fish","Chordata","Actinopterygii","Dechlorinated tap water","13.5 (+ - 0.5) C","Acute ",8.1,"N.A.","Toobey, T. E., Lucey, J. & Stott, B. 1980. The tolerance of grass carp, Ctenopharyngodon idella Val., to aquatic herbicides, J. Fish Biol., vol. 16, pp. 591 - 597. ","952"]
["Freshwater/non-metal/non- plant","952-3",61,0.67032967032967028,"The highest possible grade for this datum is acceptable.","Ctenopharyngodon idella","1+ years","96 hour","LC50","Mortality","31 mg/L","Fish","Chordata","Actinopterygii","Dechlorinated tap water","13.5 (+ - 0.5) C","Acute ",8.1,"N.A.","Toobey, T. E., Lucey, J. & Stott, B. 1980. The tolerance of grass carp, Ctenopharyngodon idella Val., to aquatic herbicides, J. Fish Biol., vol. 16, pp. 591 - 597. ","952"]
["MEW_plant","953-1",60,0.65934065934065933,"","Halodule uninervis","Not stated","3 day","NOEC","Growth: Leaf extension ","87.8 ug/L","Macrophyte","Tracheophyta","Liliopsida","Filtered seawater","25.8 + - 0.3 C","Acute","Not stated","Not stated","Flores, F., Collier, C. J., Mercurio, P., Negri, A. P. 2013. Phytotoxicity of Four Photosystem II Herbicides to Tropical Seagrasses, PLoS One, ","953"]
["MEW_plant","953-2",60,0.65934065934065933,"","Zostera muelleri","Not stated","3 day","NOEC","Growth: Leaf extension ","87.8 ug/L","Macrophyte","Tracheophyta","Liliopsida","Filtered seawater","25.8 + - 0.3 C","Acute","Not stated","Not stated","Flores, F., Collier, C. J., Mercurio, P., Negri, A. P. 2013. Phytotoxicity of Four Photosystem II Herbicides to Tropical Seagrasses, PLoS One, ","953"]
["MEW_nonplant","954-1",56,0.5957446808510638,"The highest possible grade for this datum is acceptable.","Pagrus auratus","Fertilised eggs (0-2 hour post-fert)","36 hour","NOEC","Hatching success","50 ug/L","Fish","Chordata","Actinopterygii","Filtered seawater","24.5 C","Acute","Not stated","Not stated","Gagnon, M. M. & Rawson, C. A. 2009. Diuron increases spinal deformity in early-life-stage pink snapper Pagrus auratus, Marine Pollution Bulletin, vol. 58, pp. 1078 - 1095. ","954","PURITY NOT STATED"]
["Freshwater/non-metal/plant","955-1",73,0.82954545454545459,"","Lemna minor","Not stated","7 day","EC50","Growth rate: Frond number","28.3 ug/L","Macrophyte","Tracheophyta","Not stated","24 (+ -2 C)","24 (+ -2 C)","Acute ","6.5 + - 0.2","N.A.","Gatidou, G., Stasinakis, A. S. & Iatrou, E. I. 2015. Assessing single and joint toxicity of three phenylurea herbicides using Lemna minor and Vibrio fischeri bioassays, Chemosphere, vol. 119, S69-S74.","955"]
["Freshwater/non-metal/plant","955-2",57,0.64772727272727271,"","Vibrio fischeri","Not stated","30 minutes","EC50","Growth rate: Frond number","8.2 ug/L","Microbe","Proteobacteria","Not stated","Not stated","Not stated","Acute ","Not stated","N.A.","Gatidou, G., Stasinakis, A. S. & Iatrou, E. I. 2015. Assessing single and joint toxicity of three phenylurea herbicides using Lemna minor and Vibrio fischeri bioassays, Chemosphere, vol. 119, S69-S74.","955"]
["Freshwater/non-metal/non- plant","956-1",61,0.67032967032967028,"","Daphnia pulex","5 day old ","96 hour","LC50","Survival: Mortality","17.9 ug/L","Microinvertebrate","Arthropoda","Branchiopoda","Freshwater","Not stated","Acute ","6.9 + - 0.1","N.A.","Nebeker, A. V & Schuytema, G. S. 1998. Chronic Effects of the Herbicide Diuron on Freshwater Cladocerans, Amphipods, Midges, Minnows, Worms, and Snails, Archives of Environmental Contamination and Toxicolgy, vol. 35, pp. 441 - 446. ","956"]
["Freshwater/non-metal/non- plant","956-2",61,0.67032967032967028,"","Daphnia pulex","5 day old ","7 days","LC50","Survival: Mortality","7.1 ug/L","Microinvertebrate","Arthropoda","Branchiopoda","Freshwater","Not stated","Chronic","6.9 + - 0.1","N.A.","Nebeker, A. V & Schuytema, G. S. 1998. Chronic Effects of the Herbicide Diuron on Freshwater Cladocerans, Amphipods, Midges, Minnows, Worms, and Snails, Archives of Environmental Contamination and Toxicolgy, vol. 35, pp. 441 - 446. ","956"]
["Freshwater/non-metal/non- plant","956-3",61,0.67032967032967028,"","Daphnia pulex","5 day old ","7 days","LOAEL","Mortality & Reduced number of young","7.7 ug/L","Microinvertebrate","Arthropoda","Branchiopoda","Freshwater","Not stated","Chronic","6.9 + - 0.1","N.A.","Nebeker, A. V & Schuytema, G. S. 1998. Chronic Effects of the Herbicide Diuron on Freshwater Cladocerans, Amphipods, Midges, Minnows, Worms, and Snails, Archives of Environmental Contamination and Toxicolgy, vol. 35, pp. 441 - 446. ","956"]
["Freshwater/non-metal/non- plant","956-4",61,0.67032967032967028,"","Daphnia pulex","5 day old ","7 days","NOAEL","Mortality & Reduced number of young","4.0 ug/L","Microinvertebrate","Arthropoda","Branchiopoda","Freshwater","Not stated","Chronic","6.9 + - 0.1","N.A.","Nebeker, A. V & Schuytema, G. S. 1998. Chronic Effects of the Herbicide Diuron on Freshwater Cladocerans, Amphipods, Midges, Minnows, Worms, and Snails, Archives of Environmental Contamination and Toxicolgy, vol. 35, pp. 441 - 446. ","956"]
["Freshwater/non-metal/non- plant","956-5",61,0.67032967032967028,"","Hyalella azteca","<11 days","96 hour","LC50","Survival: Mortality","19.4 ug/L","Macroinvertebrate","Arthropoda","Malacostraca","Freshwater","22 C","Acute ","6.9 + - 0.1","N.A.","Nebeker, A. V & Schuytema, G. S. 1998. Chronic Effects of the Herbicide Diuron on Freshwater Cladocerans, Amphipods, Midges, Minnows, Worms, and Snails, Archives of Environmental Contamination and Toxicolgy, vol. 35, pp. 441 - 446. ","956"]
["Freshwater/non-metal/non- plant","956-6",61,0.67032967032967028,"","Hyalella azteca","<11 days","10 days","LC50","Survival: Mortality","18.4 ug/L","Macroinvertebrate","Arthropoda","Malacostraca","Freshwater","22 C","Acute ","6.9 + - 0.1","N.A.","Nebeker, A. V & Schuytema, G. S. 1998. Chronic Effects of the Herbicide Diuron on Freshwater Cladocerans, Amphipods, Midges, Minnows, Worms, and Snails, Archives of Environmental Contamination and Toxicolgy, vol. 35, pp. 441 - 446. ","956"]
["Freshwater/non-metal/non- plant","956-7",61,0.67032967032967028,"","Hyalella azteca","<11 days","10 days","LOAEL","Mortality & Reducted weight","15.7 ug/L","Macroinvertebrate","Arthropoda","Malacostraca","Freshwater","22 C","Acute ","6.9 + - 0.1","N.A.","Nebeker, A. V & Schuytema, G. S. 1998. Chronic Effects of the Herbicide Diuron on Freshwater Cladocerans, Amphipods, Midges, Minnows, Worms, and Snails, Archives of Environmental Contamination and Toxicolgy, vol. 35, pp. 441 - 446. ","956"]
["Freshwater/non-metal/non- plant","956-8",61,0.67032967032967028,"","Hyalella azteca","<11 days","10 days","NOAEL","Mortality & Reducted weight","7.9 ug/L","Macroinvertebrate","Arthropoda","Malacostraca","Freshwater","22 C","Acute ","6.9 + - 0.1","N.A.","Nebeker, A. V & Schuytema, G. S. 1998. Chronic Effects of the Herbicide Diuron on Freshwater Cladocerans, Amphipods, Midges, Minnows, Worms, and Snails, Archives of Environmental Contamination and Toxicolgy, vol. 35, pp. 441 - 446. ","956"]
["Freshwater/non-metal/non- plant","956-9",61,0.67032967032967028,"","Chironomus tentans","First instar","10 days","LC50","Mortality & Reducted weight","3.3 ug/L","Macroinvertebrate","Arthropoda","Insecta","Freshwater","24 C","Acute ","6.9 + - 0.1","N.A.","Nebeker, A. V & Schuytema, G. S. 1998. Chronic Effects of the Herbicide Diuron on Freshwater Cladocerans, Amphipods, Midges, Minnows, Worms, and Snails, Archives of Environmental Contamination and Toxicolgy, vol. 35, pp. 441 - 446. ","956"]
["Freshwater/non-metal/non- plant","956-10",61,0.67032967032967028,"","Chironomus tentans","First instar","10 days","LOAEL","Growth: Reduced weight","7.1 ug/L","Macroinvertebrate","Arthropoda","Insecta","Freshwater","24 C","Acute ","6.9 + - 0.1","N.A.","Nebeker, A. V & Schuytema, G. S. 1998. Chronic Effects of the Herbicide Diuron on Freshwater Cladocerans, Amphipods, Midges, Minnows, Worms, and Snails, Archives of Environmental Contamination and Toxicolgy, vol. 35, pp. 441 - 446. ","956"]
["Freshwater/non-metal/non- plant","956-11",61,0.67032967032967028,"","Chironomus tentans","First instar","10 days","NOAEL","Growth: Reduced weight","3.4 ug/L","Macroinvertebrate","Arthropoda","Insecta","Freshwater","24 C","Acute ","6.9 + - 0.1","N.A.","Nebeker, A. V & Schuytema, G. S. 1998. Chronic Effects of the Herbicide Diuron on Freshwater Cladocerans, Amphipods, Midges, Minnows, Worms, and Snails, Archives of Environmental Contamination and Toxicolgy, vol. 35, pp. 441 - 446. ","956"]
["Freshwater/non-metal/non- plant","956-11",61,0.67032967032967028,"","Chironomus tentans","2 days old","10 days","LOAEL","Mortality","3.4 ug/L","Macroinvertebrate","Arthropoda","Insecta","Freshwater","24 C","Acute ","6.9 + - 0.1","N.A.","Nebeker, A. V & Schuytema, G. S. 1998. Chronic Effects of the Herbicide Diuron on Freshwater Cladocerans, Amphipods, Midges, Minnows, Worms, and Snails, Archives of Environmental Contamination and Toxicolgy, vol. 35, pp. 441 - 446. ","956"]
["Freshwater/non-metal/non- plant","956-12",61,0.67032967032967028,"","Chironomus tentans","2 days old","10 days","LOAEL","Mortality","1.9 ug/L","Macroinvertebrate","Arthropoda","Insecta","Freshwater","24 C","Acute ","6.9 + - 0.1","N.A.","Nebeker, A. V & Schuytema, G. S. 1998. Chronic Effects of the Herbicide Diuron on Freshwater Cladocerans, Amphipods, Midges, Minnows, Worms, and Snails, Archives of Environmental Contamination and Toxicolgy, vol. 35, pp. 441 - 446. ","956"]
["Freshwater/non-metal/non- plant","956-13",57,0.62637362637362637,"","Pimephales promelas","Juveniles (1.5 months)","10 days","LC50","Mortality","27.1 mg/L","Fish","Chordata","Actinopterygii","Freshwater","23 C","Chronic","6.8 + - 0.1","N.A.","Nebeker, A. V & Schuytema, G. S. 1998. Chronic Effects of the Herbicide Diuron on Freshwater Cladocerans, Amphipods, Midges, Minnows, Worms, and Snails, Archives of Environmental Contamination and Toxicolgy, vol. 35, pp. 441 - 446. ","956"]
["Freshwater/non-metal/non- plant","956-14",61,0.67032967032967028,"","Pimephales promelas","Juveniles (1.5 months)","10 days","LOAEL","Reduced weight","3.4 mg/L","Fish","Chordata","Actinopterygii","Freshwater","23 C","Chronic","6.8 + - 0.1","N.A.","Nebeker, A. V & Schuytema, G. S. 1998. Chronic Effects of the Herbicide Diuron on Freshwater Cladocerans, Amphipods, Midges, Minnows, Worms, and Snails, Archives of Environmental Contamination and Toxicolgy, vol. 35, pp. 441 - 446. ","956"]
["Freshwater/non-metal/non- plant","956-15",61,0.67032967032967028,"","Pimephales promelas","Juveniles (1.5 months)","10 days","NOAEL","Reduced weight","<3.4 mg/L","Fish","Chordata","Actinopterygii","Freshwater","23 C","Chronic","6.8 + - 0.1","N.A.","Nebeker, A. V & Schuytema, G. S. 1998. Chronic Effects of the Herbicide Diuron on Freshwater Cladocerans, Amphipods, Midges, Minnows, Worms, and Snails, Archives of Environmental Contamination and Toxicolgy, vol. 35, pp. 441 - 446. ","956"]
["Freshwater/non-metal/non- plant","956-16",61,0.67032967032967028,"","Pimephales promelas","Embryo/larval","7 days","LC50","Mortality","11.7 mg/L","Fish","Chordata","Actinopterygii","Freshwater","23 C","Chronic","6.8 + - 0.1","N.A.","Nebeker, A. V & Schuytema, G. S. 1998. Chronic Effects of the Herbicide Diuron on Freshwater Cladocerans, Amphipods, Midges, Minnows, Worms, and Snails, Archives of Environmental Contamination and Toxicolgy, vol. 35, pp. 441 - 446. ","956"]
["Freshwater/non-metal/non- plant","956-17",61,0.67032967032967028,"","Pimephales promelas","Embryo/larval","7 days","LOAEL","Reduced weight","8.3 mg/L","Fish","Chordata","Actinopterygii","Freshwater","23 C","Chronic","6.8 + - 0.1","N.A.","Nebeker, A. V & Schuytema, G. S. 1998. Chronic Effects of the Herbicide Diuron on Freshwater Cladocerans, Amphipods, Midges, Minnows, Worms, and Snails, Archives of Environmental Contamination and Toxicolgy, vol. 35, pp. 441 - 446. ","956"]
["Freshwater/non-metal/non- plant","956-18",61,0.67032967032967028,"","Pimephales promelas","Embryo/larval","7 days","NOAEL","Reduced weight","4.2 mg/L","Fish","Chordata","Actinopterygii","Freshwater","23 C","Chronic","6.8 + - 0.1","N.A.","Nebeker, A. V & Schuytema, G. S. 1998. Chronic Effects of the Herbicide Diuron on Freshwater Cladocerans, Amphipods, Midges, Minnows, Worms, and Snails, Archives of Environmental Contamination and Toxicolgy, vol. 35, pp. 441 - 446. ","956"]
["MEW_nonplant","956-19",67,0.71276595744680848,"","Lumbriculus variegatus","Small adults","10 days","LOAEL","Based on reduced weight","3.5 ug/L","Macroinvertebrate","Annelida","Clitellata","Not stated","23 C","Acute","6.8 + - 0.1","Not stated","Nebeker, A. V & Schuytema, G. S. 1998. Chronic Effects of the Herbicide Diuron on Freshwater Cladocerans, Amphipods, Midges, Minnows, Worms, and Snails, Archives of Environmental Contamination and Toxicolgy, vol. 35, pp. 441 - 446.","956"]
["MEW_nonplant","956-20",67,0.71276595744680848,"","Lumbriculus variegatus","Small adults","10 days","NOEC","Based on reduced weight","1.8 ug/L","Macroinvertebrate","Annelida","Clitellata","Not stated","23 C","Acute","6.8 + - 0.1","Not stated","Nebeker, A. V & Schuytema, G. S. 1998. Chronic Effects of the Herbicide Diuron on Freshwater Cladocerans, Amphipods, Midges, Minnows, Worms, and Snails, Archives of Environmental Contamination and Toxicolgy, vol. 35, pp. 441 - 446.","956"]
["Freshwater/non-metal/non- plant","956-21",61,0.67032967032967028,"","Physa gyrina","15 day old young","10 days","LOAEL","Reduced weight","22.8 ug/L","Macroinvertebrate","Mollusca","Gastropoda","Freshwater","23 C","Acute ","6.8 + - 0.1","N.A.","Nebeker, A. V & Schuytema, G. S. 1998. Chronic Effects of the Herbicide Diuron on Freshwater Cladocerans, Amphipods, Midges, Minnows, Worms, and Snails, Archives of Environmental Contamination and Toxicolgy, vol. 35, pp. 441 - 446. ","956"]
["Freshwater/non-metal/non- plant","956-22",61,0.67032967032967028,"","Physa gyrina","15 day old young","10 days","NOAEL","Reduced weight","13.4 ug/L","Macroinvertebrate","Mollusca","Gastropoda","Freshwater","23 C","Acute ","6.8 + - 0.1","N.A.","Nebeker, A. V & Schuytema, G. S. 1998. Chronic Effects of the Herbicide Diuron on Freshwater Cladocerans, Amphipods, Midges, Minnows, Worms, and Snails, Archives of Environmental Contamination and Toxicolgy, vol. 35, pp. 441 - 446. ","956"]
["Freshwater/non-metal/non- plant","957-1",65,0.7142857142857143,"The highest possible grade for this datum is acceptable.","Oncorhynchus mykiss","Juveniles","7 days","LC50","Mortality","74 mg/L","Fish","Chordata","Actinopterygii","Dechlorinated tap water","Not stated","Acute ","Not measured","N.A.","Okamura, H., Watanabe, T., Aoyama, I. & Hasobe, M. 2002. Toxicity evaluation of new antifouling compounds usinf suspension-cultured fish cells, Chemosphere, vol. 46, iss. 46, pp. 945 - 951. ","957"]
["Freshwater/non-metal/non- plant","957-2",65,0.7142857142857143,"The highest possible grade for this datum is acceptable.","Oncorhynchus mykiss","Juveniles","14 days","LC50","Mortality","15 mg/L","Fish","Chordata","Actinopterygii","Dechlorinated tap water","Not stated","Acute ","Not measured","N.A.","Okamura, H., Watanabe, T., Aoyama, I. & Hasobe, M. 2002. Toxicity evaluation of new antifouling compounds usinf suspension-cultured fish cells, Chemosphere, vol. 46, iss. 46, pp. 945 - 951. ","957"]
["Freshwater/non-metal/non- plant","957-3",65,0.7142857142857143,"The highest possible grade for this datum is acceptable.","Oncorhynchus mykiss","Juveniles","21 days","LC50","Mortality","5.9 mg/L","Fish","Chordata","Actinopterygii","Dechlorinated tap water","Not stated","Chronic","Not measured","N.A.","Okamura, H., Watanabe, T., Aoyama, I. & Hasobe, M. 2002. Toxicity evaluation of new antifouling compounds usinf suspension-cultured fish cells, Chemosphere, vol. 46, iss. 46, pp. 945 - 951. ","957"]
["Freshwater/non-metal/non- plant","957-4",65,0.7142857142857143,"The highest possible grade for this datum is acceptable.","Oncorhynchus mykiss","Juveniles","28 days","LC50","Mortality","0.23 mg/L","Fish","Chordata","Actinopterygii","Dechlorinated tap water","Not stated","Chronic","Not measured","N.A.","Okamura, H., Watanabe, T., Aoyama, I. & Hasobe, M. 2002. Toxicity evaluation of new antifouling compounds usinf suspension-cultured fish cells, Chemosphere, vol. 46, iss. 46, pp. 945 - 951. ","957"]
["MEW_nonplant","958-1",54,0.57446808510638303,"The highest possible grade for this datum is acceptable.","Crassostrea gigas","Embryo","24 hour","LC10","Mortality",">1000 mg/L","Macroinvertebrate","Mollusca ","Bivalvia","Atrificial seawater","25°C","Acute","Not stated","Not stated","Tsunemasa, N. & Okamura, H. 2011. Effects of Organotin Alternative Antifoulants on Oyster Embryo, Archives of Environmental Contamination and Toxicology, vol. 61, pp. 128 - 134.","958"]
[]
[]
["Freshwater","845-1-RE ",69,0.66990291262135926,"Craticula accomoda","Exponential Growth Phase","96 hours","EC50","Population: Growth rate (Chlorophyll-a flourescence)","1734 ug/L","Larras,F., A. Bouchez, F. Rimet, and B. Montuelle, 2012. Using Bioassays and Species Sensitivity Distributions to Assess Herbicide Toxicity Towards Benthic Diatoms, PLoS One7(8): 1-9.","FROM METOLACHLOR"]
["Freshwater","845-2-RE ",69,0.66990291262135926,"Craticula accomoda","Exponential Growth Phase","96 hours","EC05","Population: Growth rate (Chlorophyll-a flourescence)","261 ug/L","Larras,F., A. Bouchez, F. Rimet, and B. Montuelle, 2012. Using Bioassays and Species Sensitivity Distributions to Assess Herbicide Toxicity Towards Benthic Diatoms, PLoS One7(8): 1-9.","FROM METOLACHLOR"]
["Freshwater","845-3-RE ",69,0.66990291262135926,"Eolimna minima","Exponential Growth Phase","96 hours","EC50","Population: Growth rate (Chlorophyll-a flourescence)","4236 ug/L","Larras,F., A. Bouchez, F. Rimet, and B. Montuelle, 2012. Using Bioassays and Species Sensitivity Distributions to Assess Herbicide Toxicity Towards Benthic Diatoms, PLoS One7(8): 1-9.","FROM METOLACHLOR"]
["Freshwater","845-4-RE ",69,0.66990291262135926,"Eolimna minima","Exponential Growth Phase","96 hours","EC05","Population: Growth rate (Chlorophyll-a flourescence)","3007 ug/L","Larras,F., A. Bouchez, F. Rimet, and B. Montuelle, 2012. Using Bioassays and Species Sensitivity Distributions to Assess Herbicide Toxicity Towards Benthic Diatoms, PLoS One7(8): 1-9.","FROM METOLACHLOR"]
["Freshwater","845-5-RE ",69,0.66990291262135926,"Mayamaea fossalis","Exponential Growth Phase","96 hours","EC50","Population: Growth rate (Chlorophyll-a flourescence)","463 ug/L","Larras,F., A. Bouchez, F. Rimet, and B. Montuelle, 2012. Using Bioassays and Species Sensitivity Distributions to Assess Herbicide Toxicity Towards Benthic Diatoms, PLoS One7(8): 1-9.","FROM METOLACHLOR"]
["Freshwater","845-6-RE ",69,0.66990291262135926,"Mayamaea fossalis","Exponential Growth Phase","96 hours","EC05","Population: Growth rate (Chlorophyll-a flourescence)","74 ug/L","Larras,F., A. Bouchez, F. Rimet, and B. Montuelle, 2012. Using Bioassays and Species Sensitivity Distributions to Assess Herbicide Toxicity Towards Benthic Diatoms, PLoS One7(8): 1-9.","FROM METOLACHLOR"]
["Freshwater","845-7-RE ",69,0.66990291262135926,"Encyonema silesiacum","Exponential Growth Phase","96 hours","EC50","Population: Growth rate (Chlorophyll-a flourescence)","8.79 ug/L","Larras,F., A. Bouchez, F. Rimet, and B. Montuelle, 2012. Using Bioassays and Species Sensitivity Distributions to Assess Herbicide Toxicity Towards Benthic Diatoms, PLoS One7(8): 1-9.","FROM METOLACHLOR"]
["Freshwater","845-8-RE ",69,0.66990291262135926,"Encyonema silesiacum","Exponential Growth Phase","96 hours","EC05","Population: Growth rate (Chlorophyll-a flourescence)","3.11 ug/L","Larras,F., A. Bouchez, F. Rimet, and B. Montuelle, 2012. Using Bioassays and Species Sensitivity Distributions to Assess Herbicide Toxicity Towards Benthic Diatoms, PLoS One7(8): 1-9.","FROM METOLACHLOR"]
["Freshwater","845-9-RE ",69,0.66990291262135926,"Gomphonema parvulum","Exponential Growth Phase","96 hours","EC50","Population: Growth rate (Chlorophyll-a flourescence)","2255 ug/L","Larras,F., A. Bouchez, F. Rimet, and B. Montuelle, 2012. Using Bioassays and Species Sensitivity Distributions to Assess Herbicide Toxicity Towards Benthic Diatoms, PLoS One7(8): 1-9.","FROM METOLACHLOR"]
["Freshwater","845-10-RE ",69,0.66990291262135926,"Gomphonema parvulum","Exponential Growth Phase","96 hours","EC05","Population: Growth rate (Chlorophyll-a flourescence)","904 ug/L","Larras,F., A. Bouchez, F. Rimet, and B. Montuelle, 2012. Using Bioassays and Species Sensitivity Distributions to Assess Herbicide Toxicity Towards Benthic Diatoms, PLoS One7(8): 1-9.","FROM METOLACHLOR"]
["Freshwater","845-11-RE ",69,0.66990291262135926,"Fragilaria capucina var vaucheriae","Exponential Growth Phase","96 hours","EC50","Population: Growth rate (Chlorophyll-a flourescence)","4.03 ug/L","Larras,F., A. Bouchez, F. Rimet, and B. Montuelle, 2012. Using Bioassays and Species Sensitivity Distributions to Assess Herbicide Toxicity Towards Benthic Diatoms, PLoS One7(8): 1-9.","FROM METOLACHLOR"]
["Freshwater","845-12-RE ",69,0.66990291262135926,"Fragilaria capucina var vaucheriae","Exponential Growth Phase","96 hours","EC05","Population: Growth rate (Chlorophyll-a flourescence)","0.069 ug/L","Larras,F., A. Bouchez, F. Rimet, and B. Montuelle, 2012. Using Bioassays and Species Sensitivity Distributions to Assess Herbicide Toxicity Towards Benthic Diatoms, PLoS One7(8): 1-9.","FROM METOLACHLOR"]
["Freshwater","845-13-RE ",69,0.66990291262135926,"Fragilaria ulna","Exponential Growth Phase","96 hours","EC50","Population: Growth rate (Chlorophyll-a flourescence)","51 ug/L","Larras,F., A. Bouchez, F. Rimet, and B. Montuelle, 2012. Using Bioassays and Species Sensitivity Distributions to Assess Herbicide Toxicity Towards Benthic Diatoms, PLoS One7(8): 1-9.","FROM METOLACHLOR"]
["Freshwater","845-14-RE ",69,0.66990291262135926,"Fragilaria ulna","Exponential Growth Phase","96 hours","EC05","Population: Growth rate (Chlorophyll-a flourescence)","12.6 ug/L","Larras,F., A. Bouchez, F. Rimet, and B. Montuelle, 2012. Using Bioassays and Species Sensitivity Distributions to Assess Herbicide Toxicity Towards Benthic Diatoms, PLoS One7(8): 1-9.","FROM METOLACHLOR"]
["Freshwater","845-15-RE ",69,0.66990291262135926,"Fragilaria rumpens","Exponential Growth Phase","96 hours","EC50","Population: Growth rate (Chlorophyll-a flourescence)","122 ug/L","Larras,F., A. Bouchez, F. Rimet, and B. Montuelle, 2012. Using Bioassays and Species Sensitivity Distributions to Assess Herbicide Toxicity Towards Benthic Diatoms, PLoS One7(8): 1-9.","FROM METOLACHLOR"]
["Freshwater","845-16-RE ",69,0.66990291262135926,"Fragilaria rumpens","Exponential Growth Phase","96 hours","EC05","Population: Growth rate (Chlorophyll-a flourescence)","18 ug/L","Larras,F., A. Bouchez, F. Rimet, and B. Montuelle, 2012. Using Bioassays and Species Sensitivity Distributions to Assess Herbicide Toxicity Towards Benthic Diatoms, PLoS One7(8): 1-9.","FROM METOLACHLOR"]
["Freshwater","845-17-RE ",69,0.66990291262135926,"Nitzschia palea","Exponential Growth Phase","96 hours","EC50","Population: Growth rate (Chlorophyll-a flourescence)","1539 ug/L","Larras,F., A. Bouchez, F. Rimet, and B. Montuelle, 2012. Using Bioassays and Species Sensitivity Distributions to Assess Herbicide Toxicity Towards Benthic Diatoms, PLoS One7(8): 1-9.","FROM METOLACHLOR"]
["Freshwater","845-18-RE ",69,0.66990291262135926,"Nitzschia palea","Exponential Growth Phase","96 hours","EC05","Population: Growth rate (Chlorophyll-a flourescence)","106 ug/L","Larras,F., A. Bouchez, F. Rimet, and B. Montuelle, 2012. Using Bioassays and Species Sensitivity Distributions to Assess Herbicide Toxicity Towards Benthic Diatoms, PLoS One7(8): 1-9.","FROM METOLACHLOR"]
["Freshwater","845-19-RE ",69,0.66990291262135926,"Achnanthidium minutissimum","Exponential Growth Phase","96 hours","EC50","Population: Growth rate (Chlorophyll-a flourescence)","108 ug/L","Larras,F., A. Bouchez, F. Rimet, and B. Montuelle, 2012. Using Bioassays and Species Sensitivity Distributions to Assess Herbicide Toxicity Towards Benthic Diatoms, PLoS One7(8): 1-9.","FROM METOLACHLOR"]
["Freshwater","845-20-RE ",69,0.66990291262135926,"Achnanthidium minutissimum","Exponential Growth Phase","96 hours","EC05","Population: Growth rate (Chlorophyll-a flourescence)","3.15 ug/L","Larras,F., A. Bouchez, F. Rimet, and B. Montuelle, 2012. Using Bioassays and Species Sensitivity Distributions to Assess Herbicide Toxicity Towards Benthic Diatoms, PLoS One7(8): 1-9.","FROM METOLACHLOR"]
["Freshwater","845-21-RE ",69,0.66990291262135926,"Cyclotella meneghiniana","Exponential Growth Phase","96 hours","EC50","Population: Growth rate (Chlorophyll-a flourescence)","23 ug/L","Larras,F., A. Bouchez, F. Rimet, and B. Montuelle, 2012. Using Bioassays and Species Sensitivity Distributions to Assess Herbicide Toxicity Towards Benthic Diatoms, PLoS One7(8): 1-9.","FROM METOLACHLOR"]
["Freshwater","845-22-RE ",69,0.66990291262135926,"Cyclotella meneghiniana","Exponential Growth Phase","96 hours","EC05","Population: Growth rate (Chlorophyll-a flourescence)","1.59 ug/L","Larras,F., A. Bouchez, F. Rimet, and B. Montuelle, 2012. Using Bioassays and Species Sensitivity Distributions to Assess Herbicide Toxicity Towards Benthic Diatoms, PLoS One7(8): 1-9.","FROM METOLACHLOR"]
["Freshwater","888-3",65,0.6310679611650486,"Selenastrum capricornutum","24 hr-old culture","72 hours","Population: Growth Inhibition","IC50","10.5 ug/L","Fai,P.B., A. Grant, and B. Reid, 2007. Chlorophyll a Fluorescence as a Biomarker for Rapid Toxicity Assessment,  Environ. Toxicol. Chem.26(7): 1520-1531. ","FROM METSULFURON-METHYL"]
[]
[]
["Freshwater/non-metal/plant","959-1",64,0.72727272727272729,"","Craticula accomoda","Not stated","96 hour","EC50","Growth rate: Fluoresence","4083 ug/L","Microalga","Bacillariophyta","DV culture medium","Not stated","Not stated","Chronic","Not stated","N.A.","Larras, F., Montuelle. B. & Bouchez, A. 2013. Assessment of toxicity thresholds in aquatic environments: Does benthic growth of diatoms affect their exposure and sensitivity to herbicides?, Science of the Total Environment, pp. 469 - 477. ","959","ATRAZINE"]
["Freshwater/non-metal/plant","959-2",64,0.72727272727272729,"","Craticula accomoda","Not stated","96 hour","EC50","Growth rate: Fluoresence","1426 ug/L","Microalga","Bacillariophyta","DV culture medium","Not stated","Not stated","Chronic","Not stated","N.A.","Larras, F., Montuelle. B. & Bouchez, A. 2013. Assessment of toxicity thresholds in aquatic environments: Does benthic growth of diatoms affect their exposure and sensitivity to herbicides?, Science of the Total Environment, pp. 469 - 477. ","959"]
["Freshwater/non-metal/plant","959-3",64,0.72727272727272729,"","Sellaphora minima","Not stated","96 hour","EC50","Growth rate: Fluoresence","10312 ug/L","Microalga","Bacillariophyta","DV culture medium","Not stated","Not stated","Chronic","Not stated","N.A.","Larras, F., Montuelle. B. & Bouchez, A. 2013. Assessment of toxicity thresholds in aquatic environments: Does benthic growth of diatoms affect their exposure and sensitivity to herbicides?, Science of the Total Environment, pp. 469 - 477. ","959","ATRAZINE"]
["Freshwater/non-metal/plant","959-4",64,0.72727272727272729,"","Sellaphora minima","Not stated","96 hour","EC50","Growth rate: Fluoresence","2606 ug/L","Microalga","Bacillariophyta","DV culture medium","Not stated","Not stated","Chronic","Not stated","N.A.","Larras, F., Montuelle. B. & Bouchez, A. 2013. Assessment of toxicity thresholds in aquatic environments: Does benthic growth of diatoms affect their exposure and sensitivity to herbicides?, Science of the Total Environment, pp. 469 - 477. ","959"]
["Freshwater/non-metal/plant","959-5",64,0.72727272727272729,"","Mayamaea fossalis","Not stated","96 hour","EC50","Growth rate: Fluoresence","929 ug/L","Microalga","Bacillariophyta","DV culture medium","Not stated","Not stated","Chronic","Not stated","N.A.","Larras, F., Montuelle. B. & Bouchez, A. 2013. Assessment of toxicity thresholds in aquatic environments: Does benthic growth of diatoms affect their exposure and sensitivity to herbicides?, Science of the Total Environment, pp. 469 - 477. ","959","ATRAZINE"]
["Freshwater/non-metal/plant","959-6",64,0.72727272727272729,"","Mayamaea fossalis","Not stated","96 hour","EC50","Growth rate: Fluoresence","139 ug/L","Microalga","Bacillariophyta","DV culture medium","Not stated","Not stated","Chronic","Not stated","N.A.","Larras, F., Montuelle. B. & Bouchez, A. 2013. Assessment of toxicity thresholds in aquatic environments: Does benthic growth of diatoms affect their exposure and sensitivity to herbicides?, Science of the Total Environment, pp. 469 - 477. ","959"]
["Freshwater/non-metal/plant","959-7",64,0.72727272727272729,"","Mayamaea fossalis","Not stated","96 hour","EC50","Growth rate: Fluoresence","8042 ug/L","Microalga","Bacillariophyta","DV culture medium","Not stated","Not stated","Chronic","Not stated","N.A.","Larras, F., Montuelle. B. & Bouchez, A. 2013. Assessment of toxicity thresholds in aquatic environments: Does benthic growth of diatoms affect their exposure and sensitivity to herbicides?, Science of the Total Environment, pp. 469 - 477. ","959","METOLACHLOR "]
["Freshwater/non-metal/plant","959-8",64,0.72727272727272729,"","Encyonema silesiacum","Not stated","96 hour","EC50","Growth rate: Fluoresence","5995 ug/L","Microalga","Bacillariophyta","DV culture medium","Not stated","Not stated","Chronic","Not stated","N.A.","Larras, F., Montuelle. B. & Bouchez, A. 2013. Assessment of toxicity thresholds in aquatic environments: Does benthic growth of diatoms affect their exposure and sensitivity to herbicides?, Science of the Total Environment, pp. 469 - 477. ","959","ATRAZINE"]
["Freshwater/non-metal/plant","959-9",64,0.72727272727272729,"","Encyonema silesiacum","Not stated","96 hour","EC50","Growth rate: Fluoresence","286 ug/L","Microalga","Bacillariophyta","DV culture medium","Not stated","Not stated","Chronic","Not stated","N.A.","Larras, F., Montuelle. B. & Bouchez, A. 2013. Assessment of toxicity thresholds in aquatic environments: Does benthic growth of diatoms affect their exposure and sensitivity to herbicides?, Science of the Total Environment, pp. 469 - 477. ","959"]
["Freshwater/non-metal/plant","959-10",64,0.72727272727272729,"","Encyonema silesiacum","Not stated","96 hour","EC50","Growth rate: Fluoresence","37567 ug/L","Microalga","Bacillariophyta","DV culture medium","Not stated","Not stated","Chronic","Not stated","N.A.","Larras, F., Montuelle. B. & Bouchez, A. 2013. Assessment of toxicity thresholds in aquatic environments: Does benthic growth of diatoms affect their exposure and sensitivity to herbicides?, Science of the Total Environment, pp. 469 - 477. ","959","METOLACHLOR "]
["Freshwater/non-metal/plant","959-11",64,0.72727272727272729,"","Gomphonema parvulum","Not stated","96 hour","EC50","Growth rate: Fluoresence","1686 ug/L","Microalga","Bacillariophyta","DV culture medium","Not stated","Not stated","Chronic","Not stated","N.A.","Larras, F., Montuelle. B. & Bouchez, A. 2013. Assessment of toxicity thresholds in aquatic environments: Does benthic growth of diatoms affect their exposure and sensitivity to herbicides?, Science of the Total Environment, pp. 469 - 477. ","959","ATRAZINE"]
["Freshwater/non-metal/plant","959-12",64,0.72727272727272729,"","Gomphonema parvulum","Not stated","96 hour","EC50","Growth rate: Fluoresence","1423 ug/L","Microalga","Bacillariophyta","DV culture medium","Not stated","Not stated","Chronic","Not stated","N.A.","Larras, F., Montuelle. B. & Bouchez, A. 2013. Assessment of toxicity thresholds in aquatic environments: Does benthic growth of diatoms affect their exposure and sensitivity to herbicides?, Science of the Total Environment, pp. 469 - 477. ","959"]
["Freshwater/non-metal/plant","959-13",64,0.72727272727272729,"","Gomphonema parvulum","Not stated","96 hour","EC50","Growth rate: Fluoresence","31640 ug/L","Microalga","Bacillariophyta","DV culture medium","Not stated","Not stated","Chronic","Not stated","N.A.","Larras, F., Montuelle. B. & Bouchez, A. 2013. Assessment of toxicity thresholds in aquatic environments: Does benthic growth of diatoms affect their exposure and sensitivity to herbicides?, Science of the Total Environment, pp. 469 - 477. ","959","METOLACHLOR "]
["Freshwater/non-metal/plant","959-14",64,0.72727272727272729,"","Fragilaria capucina var vaucheriae","Not stated","96 hour","EC50","Growth rate: Fluoresence","635 ug/L","Microalga","Bacillariophyta","DV culture medium","Not stated","Not stated","Chronic","Not stated","N.A.","Larras, F., Montuelle. B. & Bouchez, A. 2013. Assessment of toxicity thresholds in aquatic environments: Does benthic growth of diatoms affect their exposure and sensitivity to herbicides?, Science of the Total Environment, pp. 469 - 477. ","959","ATRAZINE"]
["Freshwater/non-metal/plant","959-14",64,0.72727272727272729,"","Fragilaria capucina var vaucheriae","Not stated","96 hour","EC50","Growth rate: Fluoresence","44 ug/L","Microalga","Bacillariophyta","DV culture medium","Not stated","Not stated","Chronic","Not stated","N.A.","Larras, F., Montuelle. B. & Bouchez, A. 2013. Assessment of toxicity thresholds in aquatic environments: Does benthic growth of diatoms affect their exposure and sensitivity to herbicides?, Science of the Total Environment, pp. 469 - 477. ","959"]
["Freshwater/non-metal/plant","959-15",64,0.72727272727272729,"","Fragilaria capucina var vaucheriae","Not stated","96 hour","EC50","Growth rate: Fluoresence","310151 ug/L","Microalga","Bacillariophyta","DV culture medium","Not stated","Not stated","Chronic","Not stated","N.A.","Larras, F., Montuelle. B. & Bouchez, A. 2013. Assessment of toxicity thresholds in aquatic environments: Does benthic growth of diatoms affect their exposure and sensitivity to herbicides?, Science of the Total Environment, pp. 469 - 477. ","959","METOLACHLOR "]
["Freshwater/non-metal/plant","959-16",64,0.72727272727272729,"","Ulnaria ulna","Not stated","96 hour","EC50","Growth rate: Fluoresence","232 ug/L","Microalga","Bacillariophyta","DV culture medium","Not stated","Not stated","Chronic","Not stated","N.A.","Larras, F., Montuelle. B. & Bouchez, A. 2013. Assessment of toxicity thresholds in aquatic environments: Does benthic growth of diatoms affect their exposure and sensitivity to herbicides?, Science of the Total Environment, pp. 469 - 477. ","959","ATRAZINE"]
["Freshwater/non-metal/plant","959-17",64,0.72727272727272729,"","Ulnaria ulna","Not stated","96 hour","EC50","Growth rate: Fluoresence","42 ug/L","Microalga","Bacillariophyta","DV culture medium","Not stated","Not stated","Chronic","Not stated","N.A.","Larras, F., Montuelle. B. & Bouchez, A. 2013. Assessment of toxicity thresholds in aquatic environments: Does benthic growth of diatoms affect their exposure and sensitivity to herbicides?, Science of the Total Environment, pp. 469 - 477. ","959"]
["Freshwater/non-metal/plant","959-18",64,0.72727272727272729,"","Ulnaria ulna","Not stated","96 hour","EC50","Growth rate: Fluoresence","220 ug/L","Microalga","Bacillariophyta","DV culture medium","Not stated","Not stated","Chronic","Not stated","N.A.","Larras, F., Montuelle. B. & Bouchez, A. 2013. Assessment of toxicity thresholds in aquatic environments: Does benthic growth of diatoms affect their exposure and sensitivity to herbicides?, Science of the Total Environment, pp. 469 - 477. ","959","METOLACHLOR "]
["Freshwater/non-metal/plant","959-19",64,0.72727272727272729,"","Fragilaria rumpens","Not stated","96 hour","EC50","Growth rate: Fluoresence","106 ug/L","Microalga","Bacillariophyta","DV culture medium","Not stated","Not stated","Chronic","Not stated","N.A.","Larras, F., Montuelle. B. & Bouchez, A. 2013. Assessment of toxicity thresholds in aquatic environments: Does benthic growth of diatoms affect their exposure and sensitivity to herbicides?, Science of the Total Environment, pp. 469 - 477. ","959","ATRAZINE"]
["Freshwater/non-metal/plant","959-20",64,0.72727272727272729,"","Fragilaria rumpens","Not stated","96 hour","EC50","Growth rate: Fluoresence","8.89 ug/L","Microalga","Bacillariophyta","DV culture medium","Not stated","Not stated","Chronic","Not stated","N.A.","Larras, F., Montuelle. B. & Bouchez, A. 2013. Assessment of toxicity thresholds in aquatic environments: Does benthic growth of diatoms affect their exposure and sensitivity to herbicides?, Science of the Total Environment, pp. 469 - 477. ","959"]
["Freshwater/non-metal/plant","959-21",64,0.72727272727272729,"","Nitzschia palea","Not stated","96 hour","EC50","Growth rate: Fluoresence","14943 ug/L","Microalga","Bacillariophyta","DV culture medium","Not stated","Not stated","Chronic","Not stated","N.A.","Larras, F., Montuelle. B. & Bouchez, A. 2013. Assessment of toxicity thresholds in aquatic environments: Does benthic growth of diatoms affect their exposure and sensitivity to herbicides?, Science of the Total Environment, pp. 469 - 477. ","959","ATRAZINE"]
["Freshwater/non-metal/plant","959-22",64,0.72727272727272729,"","Nitzschia palea","Not stated","96 hour","EC50","Growth rate: Fluoresence","1667 ug/L","Microalga","Bacillariophyta","DV culture medium","Not stated","Not stated","Chronic","Not stated","N.A.","Larras, F., Montuelle. B. & Bouchez, A. 2013. Assessment of toxicity thresholds in aquatic environments: Does benthic growth of diatoms affect their exposure and sensitivity to herbicides?, Science of the Total Environment, pp. 469 - 477. ","959"]
["Freshwater/non-metal/plant","959-23",64,0.72727272727272729,"","Achnanthidium minutissimum","Not stated","96 hour","EC50","Growth rate: Fluoresence","991 ug/L","Microalga","Bacillariophyta","DV culture medium","Not stated","Not stated","Chronic","Not stated","N.A.","Larras, F., Montuelle. B. & Bouchez, A. 2013. Assessment of toxicity thresholds in aquatic environments: Does benthic growth of diatoms affect their exposure and sensitivity to herbicides?, Science of the Total Environment, pp. 469 - 477. ","959","ATRAZINE"]
["Freshwater/non-metal/plant","959-24",64,0.72727272727272729,"","Achnanthidium minutissimum","Not stated","96 hour","EC50","Growth rate: Fluoresence","56 ug/L","Microalga","Bacillariophyta","DV culture medium","Not stated","Not stated","Chronic","Not stated","N.A.","Larras, F., Montuelle. B. & Bouchez, A. 2013. Assessment of toxicity thresholds in aquatic environments: Does benthic growth of diatoms affect their exposure and sensitivity to herbicides?, Science of the Total Environment, pp. 469 - 477. ","959"]
["Freshwater/non-metal/plant","959-25",64,0.72727272727272729,"","Achnanthidium minutissimum","Not stated","96 hour","EC50","Growth rate: Fluoresence","734 ug/L","Microalga","Bacillariophyta","DV culture medium","Not stated","Not stated","Chronic","Not stated","N.A.","Larras, F., Montuelle. B. & Bouchez, A. 2013. Assessment of toxicity thresholds in aquatic environments: Does benthic growth of diatoms affect their exposure and sensitivity to herbicides?, Science of the Total Environment, pp. 469 - 477. ","959","METOLACHLOR "]
["Freshwater/non-metal/plant","959-26",64,0.72727272727272729,"","Cyclotella meneghiniana","Not stated","96 hour","EC50","Growth rate: Fluoresence","957 ug/L","Microalga","Bacillariophyta","DV culture medium","Not stated","Not stated","Chronic","Not stated","N.A.","Larras, F., Montuelle. B. & Bouchez, A. 2013. Assessment of toxicity thresholds in aquatic environments: Does benthic growth of diatoms affect their exposure and sensitivity to herbicides?, Science of the Total Environment, pp. 469 - 477. ","959","ATRAZINE"]
["Freshwater/non-metal/plant","959-27",64,0.72727272727272729,"","Cyclotella meneghiniana","Not stated","96 hour","EC50","Growth rate: Fluoresence","49 ug/L","Microalga","Bacillariophyta","DV culture medium","Not stated","Not stated","Chronic","Not stated","N.A.","Larras, F., Montuelle. B. & Bouchez, A. 2013. Assessment of toxicity thresholds in aquatic environments: Does benthic growth of diatoms affect their exposure and sensitivity to herbicides?, Science of the Total Environment, pp. 469 - 477. ","959"]
["Freshwater/non-metal/plant","959-28",64,0.72727272727272729,"","Cyclotella meneghiniana","Not stated","96 hour","EC50","Growth rate: Fluoresence","1790 ug/L","Microalga","Bacillariophyta","DV culture medium","Not stated","Not stated","Chronic","Not stated","N.A.","Larras, F., Montuelle. B. & Bouchez, A. 2013. Assessment of toxicity thresholds in aquatic environments: Does benthic growth of diatoms affect their exposure and sensitivity to herbicides?, Science of the Total Environment, pp. 469 - 477. ","959","METOLACHLOR "]
["Freshwater/non-metal/plant","959-29",64,0.72727272727272729,"","Craticula accomoda","Not stated","96 hour","EC10","Growth rate: Fluoresence","3765 ug/L","Microalga","Bacillariophyta","DV culture medium","Not stated","Not stated","Chronic","Not stated","N.A.","Larras, F., Montuelle. B. & Bouchez, A. 2013. Assessment of toxicity thresholds in aquatic environments: Does benthic growth of diatoms affect their exposure and sensitivity to herbicides?, Science of the Total Environment, pp. 469 - 477. ","959","ATRAZINE"]
["Freshwater/non-metal/plant","959-30",64,0.72727272727272729,"","Craticula accomoda","Not stated","96 hour","EC10","Growth rate: Fluoresence","185 ug/L","Microalga","Bacillariophyta","DV culture medium","Not stated","Not stated","Chronic","Not stated","N.A.","Larras, F., Montuelle. B. & Bouchez, A. 2013. Assessment of toxicity thresholds in aquatic environments: Does benthic growth of diatoms affect their exposure and sensitivity to herbicides?, Science of the Total Environment, pp. 469 - 477. ","959"]
["Freshwater/non-metal/plant","959-31",64,0.72727272727272729,"","Sellaphora minima","Not stated","96 hour","EC10","Growth rate: Fluoresence","3365 ug/L","Microalga","Bacillariophyta","DV culture medium","Not stated","Not stated","Chronic","Not stated","N.A.","Larras, F., Montuelle. B. & Bouchez, A. 2013. Assessment of toxicity thresholds in aquatic environments: Does benthic growth of diatoms affect their exposure and sensitivity to herbicides?, Science of the Total Environment, pp. 469 - 477. ","959","ATRAZINE"]
["Freshwater/non-metal/plant","959-32",64,0.72727272727272729,"","Sellaphora minima","Not stated","96 hour","EC10","Growth rate: Fluoresence","693 ug/L","Microalga","Bacillariophyta","DV culture medium","Not stated","Not stated","Chronic","Not stated","N.A.","Larras, F., Montuelle. B. & Bouchez, A. 2013. Assessment of toxicity thresholds in aquatic environments: Does benthic growth of diatoms affect their exposure and sensitivity to herbicides?, Science of the Total Environment, pp. 469 - 477. ","959"]
["Freshwater/non-metal/plant","959-33",64,0.72727272727272729,"","Mayamaea fossalis","Not stated","96 hour","EC10","Growth rate: Fluoresence","358 ug/L","Microalga","Bacillariophyta","DV culture medium","Not stated","Not stated","Chronic","Not stated","N.A.","Larras, F., Montuelle. B. & Bouchez, A. 2013. Assessment of toxicity thresholds in aquatic environments: Does benthic growth of diatoms affect their exposure and sensitivity to herbicides?, Science of the Total Environment, pp. 469 - 477. ","959","ATRAZINE"]
["Freshwater/non-metal/plant","959-34",64,0.72727272727272729,"","Mayamaea fossalis","Not stated","96 hour","EC10","Growth rate: Fluoresence","91 ug/L","Microalga","Bacillariophyta","DV culture medium","Not stated","Not stated","Chronic","Not stated","N.A.","Larras, F., Montuelle. B. & Bouchez, A. 2013. Assessment of toxicity thresholds in aquatic environments: Does benthic growth of diatoms affect their exposure and sensitivity to herbicides?, Science of the Total Environment, pp. 469 - 477. ","959"]
["Freshwater/non-metal/plant","959-35",64,0.72727272727272729,"","Mayamaea fossalis","Not stated","96 hour","EC10","Growth rate: Fluoresence","760 ug/L","Microalga","Bacillariophyta","DV culture medium","Not stated","Not stated","Chronic","Not stated","N.A.","Larras, F., Montuelle. B. & Bouchez, A. 2013. Assessment of toxicity thresholds in aquatic environments: Does benthic growth of diatoms affect their exposure and sensitivity to herbicides?, Science of the Total Environment, pp. 469 - 477. ","959","METOLACHLOR "]
["Freshwater/non-metal/plant","959-36",64,0.72727272727272729,"","Encyonema silesiacum","Not stated","96 hour","EC10","Growth rate: Fluoresence","3637 ug/L","Microalga","Bacillariophyta","DV culture medium","Not stated","Not stated","Chronic","Not stated","N.A.","Larras, F., Montuelle. B. & Bouchez, A. 2013. Assessment of toxicity thresholds in aquatic environments: Does benthic growth of diatoms affect their exposure and sensitivity to herbicides?, Science of the Total Environment, pp. 469 - 477. ","959","ATRAZINE"]
["Freshwater/non-metal/plant","959-37",64,0.72727272727272729,"","Encyonema silesiacum","Not stated","96 hour","EC10","Growth rate: Fluoresence","90 ug/L","Microalga","Bacillariophyta","DV culture medium","Not stated","Not stated","Chronic","Not stated","N.A.","Larras, F., Montuelle. B. & Bouchez, A. 2013. Assessment of toxicity thresholds in aquatic environments: Does benthic growth of diatoms affect their exposure and sensitivity to herbicides?, Science of the Total Environment, pp. 469 - 477. ","959"]
["Freshwater/non-metal/plant","959-38",64,0.72727272727272729,"","Encyonema silesiacum","Not stated","96 hour","EC10","Growth rate: Fluoresence","2542 ug/L","Microalga","Bacillariophyta","DV culture medium","Not stated","Not stated","Chronic","Not stated","N.A.","Larras, F., Montuelle. B. & Bouchez, A. 2013. Assessment of toxicity thresholds in aquatic environments: Does benthic growth of diatoms affect their exposure and sensitivity to herbicides?, Science of the Total Environment, pp. 469 - 477. ","959","METOLACHLOR "]
["Freshwater/non-metal/plant","959-39",64,0.72727272727272729,"","Gomphonema parvulum","Not stated","96 hour","EC10","Growth rate: Fluoresence","914 ug/L","Microalga","Bacillariophyta","DV culture medium","Not stated","Not stated","Chronic","Not stated","N.A.","Larras, F., Montuelle. B. & Bouchez, A. 2013. Assessment of toxicity thresholds in aquatic environments: Does benthic growth of diatoms affect their exposure and sensitivity to herbicides?, Science of the Total Environment, pp. 469 - 477. ","959","ATRAZINE"]
["Freshwater/non-metal/plant","959-40",64,0.72727272727272729,"","Gomphonema parvulum","Not stated","96 hour","EC10","Growth rate: Fluoresence","53 ug/L","Microalga","Bacillariophyta","DV culture medium","Not stated","Not stated","Chronic","Not stated","N.A.","Larras, F., Montuelle. B. & Bouchez, A. 2013. Assessment of toxicity thresholds in aquatic environments: Does benthic growth of diatoms affect their exposure and sensitivity to herbicides?, Science of the Total Environment, pp. 469 - 477. ","959"]
["Freshwater/non-metal/plant","959-41",64,0.72727272727272729,"","Gomphonema parvulum","Not stated","96 hour","EC10","Growth rate: Fluoresence","111666 ug/L","Microalga","Bacillariophyta","DV culture medium","Not stated","Not stated","Chronic","Not stated","N.A.","Larras, F., Montuelle. B. & Bouchez, A. 2013. Assessment of toxicity thresholds in aquatic environments: Does benthic growth of diatoms affect their exposure and sensitivity to herbicides?, Science of the Total Environment, pp. 469 - 477. ","959","METOLACHLOR "]
["Freshwater/non-metal/plant","959-42",64,0.72727272727272729,"","Fragilaria capucina var vaucheriae","Not stated","96 hour","EC10","Growth rate: Fluoresence","254 ug/L","Microalga","Bacillariophyta","DV culture medium","Not stated","Not stated","Chronic","Not stated","N.A.","Larras, F., Montuelle. B. & Bouchez, A. 2013. Assessment of toxicity thresholds in aquatic environments: Does benthic growth of diatoms affect their exposure and sensitivity to herbicides?, Science of the Total Environment, pp. 469 - 477. ","959","ATRAZINE"]
["Freshwater/non-metal/plant","959-43",64,0.72727272727272729,"","Fragilaria capucina var vaucheriae","Not stated","96 hour","EC10","Growth rate: Fluoresence","21 ug/L","Microalga","Bacillariophyta","DV culture medium","Not stated","Not stated","Chronic","Not stated","N.A.","Larras, F., Montuelle. B. & Bouchez, A. 2013. Assessment of toxicity thresholds in aquatic environments: Does benthic growth of diatoms affect their exposure and sensitivity to herbicides?, Science of the Total Environment, pp. 469 - 477. ","959"]
["Freshwater/non-metal/plant","959-44",64,0.72727272727272729,"","Fragilaria capucina var vaucheriae","Not stated","96 hour","EC10","Growth rate: Fluoresence","90 ug/L","Microalga","Bacillariophyta","DV culture medium","Not stated","Not stated","Chronic","Not stated","N.A.","Larras, F., Montuelle. B. & Bouchez, A. 2013. Assessment of toxicity thresholds in aquatic environments: Does benthic growth of diatoms affect their exposure and sensitivity to herbicides?, Science of the Total Environment, pp. 469 - 477. ","959","METOLACHLOR "]
["Freshwater/non-metal/plant","959-45",64,0.72727272727272729,"","Ulnaria ulna","Not stated","96 hour","EC10","Growth rate: Fluoresence","26 ug/L","Microalga","Bacillariophyta","DV culture medium","Not stated","Not stated","Chronic","Not stated","N.A.","Larras, F., Montuelle. B. & Bouchez, A. 2013. Assessment of toxicity thresholds in aquatic environments: Does benthic growth of diatoms affect their exposure and sensitivity to herbicides?, Science of the Total Environment, pp. 469 - 477. ","959","ATRAZINE"]
["Freshwater/non-metal/plant","959-46",64,0.72727272727272729,"","Ulnaria ulna","Not stated","96 hour","EC10","Growth rate: Fluoresence","24 ug/L","Microalga","Bacillariophyta","DV culture medium","Not stated","Not stated","Chronic","Not stated","N.A.","Larras, F., Montuelle. B. & Bouchez, A. 2013. Assessment of toxicity thresholds in aquatic environments: Does benthic growth of diatoms affect their exposure and sensitivity to herbicides?, Science of the Total Environment, pp. 469 - 477. ","959"]
["Freshwater/non-metal/plant","959-47",64,0.72727272727272729,"","Ulnaria ulna","Not stated","96 hour","EC10","Growth rate: Fluoresence","27 ug/L","Microalga","Bacillariophyta","DV culture medium","Not stated","Not stated","Chronic","Not stated","N.A.","Larras, F., Montuelle. B. & Bouchez, A. 2013. Assessment of toxicity thresholds in aquatic environments: Does benthic growth of diatoms affect their exposure and sensitivity to herbicides?, Science of the Total Environment, pp. 469 - 477. ","959","METOLACHLOR "]
["Freshwater/non-metal/plant","959-48",64,0.72727272727272729,"","Fragilaria rumpens","Not stated","96 hour","EC10","Growth rate: Fluoresence","17 ug/L","Microalga","Bacillariophyta","DV culture medium","Not stated","Not stated","Chronic","Not stated","N.A.","Larras, F., Montuelle. B. & Bouchez, A. 2013. Assessment of toxicity thresholds in aquatic environments: Does benthic growth of diatoms affect their exposure and sensitivity to herbicides?, Science of the Total Environment, pp. 469 - 477. ","959","ATRAZINE"]
["Freshwater/non-metal/plant","959-49",64,0.72727272727272729,"","Fragilaria rumpens","Not stated","96 hour","EC10","Growth rate: Fluoresence","0.76 ug/L","Microalga","Bacillariophyta","DV culture medium","Not stated","Not stated","Chronic","Not stated","N.A.","Larras, F., Montuelle. B. & Bouchez, A. 2013. Assessment of toxicity thresholds in aquatic environments: Does benthic growth of diatoms affect their exposure and sensitivity to herbicides?, Science of the Total Environment, pp. 469 - 477. ","959"]
["Freshwater/non-metal/plant","959-50",64,0.72727272727272729,"","Nitzschia palea","Not stated","96 hour","EC10","Growth rate: Fluoresence","5487 ug/L","Microalga","Bacillariophyta","DV culture medium","Not stated","Not stated","Chronic","Not stated","N.A.","Larras, F., Montuelle. B. & Bouchez, A. 2013. Assessment of toxicity thresholds in aquatic environments: Does benthic growth of diatoms affect their exposure and sensitivity to herbicides?, Science of the Total Environment, pp. 469 - 477. ","959","ATRAZINE"]
["Freshwater/non-metal/plant","959-51",64,0.72727272727272729,"","Nitzschia palea","Not stated","96 hour","EC10","Growth rate: Fluoresence","380 ug/L","Microalga","Bacillariophyta","DV culture medium","Not stated","Not stated","Chronic","Not stated","N.A.","Larras, F., Montuelle. B. & Bouchez, A. 2013. Assessment of toxicity thresholds in aquatic environments: Does benthic growth of diatoms affect their exposure and sensitivity to herbicides?, Science of the Total Environment, pp. 469 - 477. ","959"]
["Freshwater/non-metal/plant","959-52",64,0.72727272727272729,"","Achnanthidium minutissimum","Not stated","96 hour","EC10","Growth rate: Fluoresence","409 ug/L","Microalga","Bacillariophyta","DV culture medium","Not stated","Not stated","Chronic","Not stated","N.A.","Larras, F., Montuelle. B. & Bouchez, A. 2013. Assessment of toxicity thresholds in aquatic environments: Does benthic growth of diatoms affect their exposure and sensitivity to herbicides?, Science of the Total Environment, pp. 469 - 477. ","959"]
["Freshwater/non-metal/plant","959-53",64,0.72727272727272729,"","Achnanthidium minutissimum","Not stated","96 hour","EC10","Growth rate: Fluoresence","45 ug/L","Microalga","Bacillariophyta","DV culture medium","Not stated","Not stated","Chronic","Not stated","N.A.","Larras, F., Montuelle. B. & Bouchez, A. 2013. Assessment of toxicity thresholds in aquatic environments: Does benthic growth of diatoms affect their exposure and sensitivity to herbicides?, Science of the Total Environment, pp. 469 - 477. ","959","ATRAZINE"]
["Freshwater/non-metal/plant","959-54",64,0.72727272727272729,"","Achnanthidium minutissimum","Not stated","96 hour","EC10","Growth rate: Fluoresence","11 ug/L","Microalga","Bacillariophyta","DV culture medium","Not stated","Not stated","Chronic","Not stated","N.A.","Larras, F., Montuelle. B. & Bouchez, A. 2013. Assessment of toxicity thresholds in aquatic environments: Does benthic growth of diatoms affect their exposure and sensitivity to herbicides?, Science of the Total Environment, pp. 469 - 477. ","959"]
["Freshwater/non-metal/plant","959-55",64,0.72727272727272729,"","Cyclotella meneghiniana","Not stated","96 hour","EC10","Growth rate: Fluoresence","671 ug/L","Microalga","Bacillariophyta","DV culture medium","Not stated","Not stated","Chronic","Not stated","N.A.","Larras, F., Montuelle. B. & Bouchez, A. 2013. Assessment of toxicity thresholds in aquatic environments: Does benthic growth of diatoms affect their exposure and sensitivity to herbicides?, Science of the Total Environment, pp. 469 - 477. ","959","ATRAZINE"]
["Freshwater/non-metal/plant","959-56",64,0.72727272727272729,"","Cyclotella meneghiniana","Not stated","96 hour","EC10","Growth rate: Fluoresence","27 ug/L","Microalga","Bacillariophyta","DV culture medium","Not stated","Not stated","Chronic","Not stated","N.A.","Larras, F., Montuelle. B. & Bouchez, A. 2013. Assessment of toxicity thresholds in aquatic environments: Does benthic growth of diatoms affect their exposure and sensitivity to herbicides?, Science of the Total Environment, pp. 469 - 477. ","959"]
["Freshwater/non-metal/plant","959-57",64,0.72727272727272729,"","Cyclotella meneghiniana","Not stated","96 hour","EC10","Growth rate: Fluoresence","1020 ug/L","Microalga","Bacillariophyta","DV culture medium","Not stated","Not stated","Chronic","Not stated","N.A.","Larras, F., Montuelle. B. & Bouchez, A. 2013. Assessment of toxicity thresholds in aquatic environments: Does benthic growth of diatoms affect their exposure and sensitivity to herbicides?, Science of the Total Environment, pp. 469 - 477. ","959","METOLACHLOR "]
["Freshwater/non-metal/plant","960-1",64,0.72727272727272729,"","Fragilaria crotonensis","Exponential growth phase","96 hour","EC50","Growth rate: Fluoresence","210 ug/L","Microalga","Bacillariophyta","DV culture medium","Not stated","Not stated","Chronic","Not stated","N.A.","Larras, F., Keck, F., Montuelle, B., Rimet, F. & Bouchez, A. 2014. Linking Diatom Sensitivity to Herbicides to Phylogeny: A Step Forward for Biomonitoring?, Environmental Science and Technology, vol. 48, pp. 1921 - 1930.","960"]
["Freshwater/non-metal/plant","960-2",64,0.72727272727272729,"","Fragilaria crotonensis","Exponential growth phase","96 hour","EC50","Growth rate: Fluoresence","1202 ug/L","Microalga","Bacillariophyta","DV culture medium","Not stated","Not stated","Chronic","Not stated","N.A.","Larras, F., Keck, F., Montuelle, B., Rimet, F. & Bouchez, A. 2014. Linking Diatom Sensitivity to Herbicides to Phylogeny: A Step Forward for Biomonitoring?, Environmental Science and Technology, vol. 48, pp. 1921 - 1930.","960","ATRAZINE"]
["Freshwater/non-metal/plant","960-3",64,0.72727272727272729,"","Fistulifera saprophila","Exponential growth phase","96 hour","EC50","Growth rate: Fluoresence","91 ug/L","Microalga","Bacillariophyta","DV culture medium","Not stated","Not stated","Chronic","Not stated","N.A.","Larras, F., Keck, F., Montuelle, B., Rimet, F. & Bouchez, A. 2014. Linking Diatom Sensitivity to Herbicides to Phylogeny: A Step Forward for Biomonitoring?, Environmental Science and Technology, vol. 48, pp. 1921 - 1930.","960"]
["Freshwater/non-metal/plant","960-4",64,0.72727272727272729,"","Fistulifera saprophila","Exponential growth phase","96 hour","EC50","Growth rate: Fluoresence","4964 ug/L","Microalga","Bacillariophyta","DV culture medium","Not stated","Not stated","Chronic","Not stated","N.A.","Larras, F., Keck, F., Montuelle, B., Rimet, F. & Bouchez, A. 2014. Linking Diatom Sensitivity to Herbicides to Phylogeny: A Step Forward for Biomonitoring?, Environmental Science and Technology, vol. 48, pp. 1921 - 1930.","960","ATRAZINE"]
["Freshwater/non-metal/plant","960-5",64,0.72727272727272729,"","Gomphonema clavatum","Exponential growth phase","96 hour","EC50","Growth rate: Fluoresence","448 ug/L","Microalga","Bacillariophyta","DV culture medium","Not stated","Not stated","Chronic","Not stated","N.A.","Larras, F., Keck, F., Montuelle, B., Rimet, F. & Bouchez, A. 2014. Linking Diatom Sensitivity to Herbicides to Phylogeny: A Step Forward for Biomonitoring?, Environmental Science and Technology, vol. 48, pp. 1921 - 1930.","960"]
["Freshwater/non-metal/plant","960-6",64,0.72727272727272729,"","Gomphonema clavatum","Exponential growth phase","96 hour","EC50","Growth rate: Fluoresence","3539 ug/L","Microalga","Bacillariophyta","DV culture medium","Not stated","Not stated","Chronic","Not stated","N.A.","Larras, F., Keck, F., Montuelle, B., Rimet, F. & Bouchez, A. 2014. Linking Diatom Sensitivity to Herbicides to Phylogeny: A Step Forward for Biomonitoring?, Environmental Science and Technology, vol. 48, pp. 1921 - 1930.","960","ATRAZINE"]
["Freshwater/non-metal/non- plant","944-1",68,0.74725274725274726,"The highest possible grade for this datum is acceptable.","Tetrahymena pyriformis","Exponential growth phase","9 hour","IC50","Growth rate: Cell growth inhibition","8.18 mg/L","Protozoa","Ciliophora","Oligohymenophorea","Proteose-peptone yeast salts complex medium","28 C","Acute ","Not stated","N.A.","Bonnet, J. L., Bonnemoy, F., Dusser, M. & Bohatier, J. 2007. Assessment of the Potential Toxicity of Herbicides and Their Degradation Products to Nontarget Cells Using Two Microorganisms, the Bacteria Vibrio fischeri and the Ciliate Tetrahymena pyriformis, vol. 22, pp. 78 - 91.","944"]
["Freshwater/non-metal/non- plant","944-2",68,0.74725274725274726,"The highest possible grade for this datum is acceptable.","Tetrahymena pyriformis","Exponential growth phase","9 hour","IC50","Growth rate: Cell growth inhibition","7.84 mg/L","Protozoa","Ciliophora","Oligohymenophorea","Proteose-peptone yeast salts complex medium","28 C","Acute ","Not stated","N.A.","Bonnet, J. L., Bonnemoy, F., Dusser, M. & Bohatier, J. 2007. Assessment of the Potential Toxicity of Herbicides and Their Degradation Products to Nontarget Cells Using Two Microorganisms, the Bacteria Vibrio fischeri and the Ciliate Tetrahymena pyriformis, vol. 22, pp. 78 - 91.","944"]
["Freshwater/non-metal/non- plant","944-3",68,0.74725274725274726,"The highest possible grade for this datum is acceptable.","Tetrahymena pyriformis","Exponential growth phase","12 hour","IC50","Growth rate: Cell growth inhibition","6.33 mg/L","Protozoa","Ciliophora","Oligohymenophorea","Proteose-peptone yeast salts complex medium","28 C","Acute ","Not stated","N.A.","Bonnet, J. L., Bonnemoy, F., Dusser, M. & Bohatier, J. 2007. Assessment of the Potential Toxicity of Herbicides and Their Degradation Products to Nontarget Cells Using Two Microorganisms, the Bacteria Vibrio fischeri and the Ciliate Tetrahymena pyriformis, vol. 22, pp. 78 - 91.","944"]
["Freshwater/non-metal/plant","944-4",50,0.56818181818181823,"The highest possible grade for this datum is acceptable.","Vibrio fischeri","Not stated","15 minutes","EC10","Population: Growth inhibition (fluorescence)","66.87 mg/L","Bacteria","Proteobacteria","Not stated","Not stated","Not stated","Acute ","Not stated","N.A.","Bonnet, J. L., Bonnemoy, F., Dusser, M. & Bohatier, J. 2007. Assessment of the Potential Toxicity of Herbicides and Their Degradation Products to Nontarget Cells Using Two Microorganisms, the Bacteria Vibrio fischeri and the Ciliate Tetrahymena pyriformis, vol. 22, pp. 78 - 91.","944"]
["Freshwater/non-metal/plant","944-5",50,0.56818181818181823,"The highest possible grade for this datum is acceptable.","Vibrio fischeri","Not stated","30 minutes","EC10","Population: Growth inhibition (fluorescence)","58.07 mg/L","Bacteria","Proteobacteria","Not stated","Not stated","Not stated","Acute ","Not stated","N.A.","Bonnet, J. L., Bonnemoy, F., Dusser, M. & Bohatier, J. 2007. Assessment of the Potential Toxicity of Herbicides and Their Degradation Products to Nontarget Cells Using Two Microorganisms, the Bacteria Vibrio fischeri and the Ciliate Tetrahymena pyriformis, vol. 22, pp. 78 - 91.","944"]
["Freshwater/non-metal/plant","965-1",58,0.65909090909090906,"The highest possible grade for this datum is acceptable.","Saccharina japonica","Thalli","15 days","LOEC","Growth Rate: Area","0.00625 mg/L","Macroalgae","Ochrophyta","Artificial seawater","Not stated","Not stated","Chronic",8.4,"N.A.","Kumar, K. S., Choo, K., Yea, S. S., Seo, Y. & Han, T. 2010. Effects of the Phenylurea Herbicide Diuron on the Physiology of Saccharina japonica Aresch, Toxicology and Environmental Health Sciences, vol. 2, pp. 188 - 199.","965"]
["Freshwater/non-metal/plant","965-2",58,0.65909090909090906,"The highest possible grade for this datum is acceptable.","Saccharina japonica","Thalli","15 days","LOEC","Growth rate: Fresh weight","0.025 mg/L","Macroalgae","Ochrophyta","Artificial seawater","Not stated","Not stated","Chronic",8.4,"N.A.","Kumar, K. S., Choo, K., Yea, S. S., Seo, Y. & Han, T. 2010. Effects of the Phenylurea Herbicide Diuron on the Physiology of Saccharina japonica Aresch, Toxicology and Environmental Health Sciences, vol. 2, pp. 188 - 199.","965"]
["Freshwater/non-metal/plant","965-3",68,0.77272727272727271,"The highest possible grade for this datum is acceptable.","Saccharina japonica","Thalli","15 days","EC10","Growth rate: Fresh weight","0.0023 mg/L","Macroalgae","Ochrophyta","Artificial seawater","Not stated","Not stated","Chronic",8.4,"N.A.","Kumar, K. S., Choo, K., Yea, S. S., Seo, Y. & Han, T. 2010. Effects of the Phenylurea Herbicide Diuron on the Physiology of Saccharina japonica Aresch, Toxicology and Environmental Health Sciences, vol. 2, pp. 188 - 199.","965"]
["Freshwater/non-metal/plant","965-4",68,0.77272727272727271,"The highest possible grade for this datum is acceptable.","Saccharina japonica","Thalli","15 days","EC50","Growth rate: Fresh weight","0.0878 mg/L","Macroalgae","Ochrophyta","Artificial seawater","Not stated","Not stated","Chronic",8.4,"N.A.","Kumar, K. S., Choo, K., Yea, S. S., Seo, Y. & Han, T. 2010. Effects of the Phenylurea Herbicide Diuron on the Physiology of Saccharina japonica Aresch, Toxicology and Environmental Health Sciences, vol. 2, pp. 188 - 199.","965"]
["Freshwater/non-metal/plant","965-5",68,0.77272727272727271,"The highest possible grade for this datum is acceptable.","Saccharina japonica","Thalli","15 days","EC10","Growth Rate: Area","0.0039 mg/L","Macroalgae","Ochrophyta","Artificial seawater","Not stated","Not stated","Chronic",8.4,"N.A.","Kumar, K. S., Choo, K., Yea, S. S., Seo, Y. & Han, T. 2010. Effects of the Phenylurea Herbicide Diuron on the Physiology of Saccharina japonica Aresch, Toxicology and Environmental Health Sciences, vol. 2, pp. 188 - 199.","965"]
["Freshwater/non-metal/plant","965-6",68,0.77272727272727271,"The highest possible grade for this datum is acceptable.","Saccharina japonica","Thalli","15 days","EC50","Growth Rate: Area",">0.04 mg/L","Macroalgae","Ochrophyta","Artificial seawater","Not stated","Not stated","Chronic",8.4,"N.A.","Kumar, K. S., Choo, K., Yea, S. S., Seo, Y. & Han, T. 2010. Effects of the Phenylurea Herbicide Diuron on the Physiology of Saccharina japonica Aresch, Toxicology and Environmental Health Sciences, vol. 2, pp. 188 - 199.","965"]
["Freshwater/non-metal/plant","965-7",68,0.77272727272727271,"The highest possible grade for this datum is acceptable.","Saccharina japonica","Thalli","15 days","EC60.37","Growth Rate: Area","0.4 mg/L","Macroalgae","Ochrophyta","Artificial seawater","Not stated","Not stated","Chronic",8.4,"N.A.","Kumar, K. S., Choo, K., Yea, S. S., Seo, Y. & Han, T. 2010. Effects of the Phenylurea Herbicide Diuron on the Physiology of Saccharina japonica Aresch, Toxicology and Environmental Health Sciences, vol. 2, pp. 188 - 199.","965"]
[]
[]
["USEPA PESTICIDE DATABASE"]
["RecordID","DOC_NUMBER","TAXA","COMMONNAME","TAXONOMIC","AGE","GUIDELINE","AI","STUDYTIME","DOSETYPE","TGL","TOXICITY","TOXLEVEL","CL","NGL","NOEL"]
[24155,"2083002","Aquatic Plant","Duckweed","Lemna gibba","N.R","123-2","Tech","7 D","EC50","","13","PPB","11-17","","2.49"]
[24156,"2083004","Crustacea","Water flea","Daphnia magna","LifCyc","72-4","Tech","21 D","LOEC","","0.113","PPM","NA","","0.057"]
[1888,"2012614","Fishes","Fathead minnow","Pimephales promelas","N.R.","72-1","98.6","96 hr","LC50","","14.2","PPM","13.4-15.0","","N.R."]
[1869,"2049116","Aquatic Plant","Diatom","Thalassiosira fluviatilis","N.R.","122-2","95","72 hr","EC50","","95","PPB","N.R.","","N.R."]
[1882,"2012615","Crustacea","Mysid","Americamysis bahia","0.12g","72-3","99","96 hr","LC50","","1.1","PPM","0.97-1.3","<","0.6"]
[1881,"2079104","Crustacea","Scud","Gammarus fasciatus","1st-I","72-2","95","96 hr","LC50","","0.16","PPM","0.13-0.19","","N.R."]
[1872,"2049116","Aquatic Plant","Marine algae","Stauroneis amphoroides","N.R.","122-2","95","72 hr","EC50","","31","PPB","N.R.","","N.R."]
[1870,"2049116","Aquatic Plant","Marine algae","Achnanthes brevipes","N.R.","122-2","95","72 hr","EC50","","24","PPB","N.R.","","N.R."]
[1892,"2012603/09","Fishes","Bluegill sunfish","Lepomis macrochirus","N.R.","72-1","95","96 hr","LC50","","3.2","PPM","2.53-4.05","","N.R."]
[1871,"2049116","Aquatic Plant","Marine diatom","Navicula incerta","N.R.","122-2","95","72 hr","EC50","","93","PPB","N.R.","","N.R."]
[1877,"2049116","Aquatic Plant","Green algae","Chlamydomonas sp.","N.R.","122-2","95","72 hr","EC50","","37","PPB","N.R.","","N.R."]
[1876,"2049116","Aquatic Plant","Green algae","Dunaliella tertiolecta","N.R.","122-2","95","10 D","EC50","","20","PPB","N.R.","","N.R."]
[1875,"2049116","Aquatic Plant","Marine algae","Nitzschia closterium","N.R.","122-2","95","72 hr","EC50","","50","PPB","N.R.","","N.R."]
[1874,"2049116","Aquatic Plant","Marine diatom","Phaeodactylum tricornutum","N.R.","122-2","95","10 D","EC50","","10","PPB","N.R.","","N.R."]
[1873,"2049116","Aquatic Plant","Marine algae","Amphora exigua","N.R.","122-2","95","72 hr","EC50","","31","PPB","N.R.","","N.R."]
[1880,"2079104","Crustacea","Water flea","Daphnia pulex","1st-I","72-2","95","48 hr","EC50","","1.4","PPM","1.0-1.9","","N.R."]
[1907,"2049116","Aquatic Plant","Marine algae","Porphyridium cruentum","N.R.","122-2","95","72 hr","EC50","","24","PPB","N.R.","","N.R."]
[5130,"2059424","Aquatic Plant","Green algae","Selenastrum capricornutum","N.R.","123-2","96.8","96 hr","EC50","","2.4","PPB","2.0-2.8","","0.44"]
[5131,"2012699","Mollusca","Eastern oyster","Crassostrea virginica","SPAT","72-3","96.8","96 hr","EC50","","4.8","PPM","4.49-5.18","<","2.4"]
[1906,"2049116","Aquatic Plant","Green algae","Platymonas sp.","N.R.","122-2","95","72 hr","EC50","","17","PPB","N.R.","","N.R."]
[1905,"2049116","Aquatic Plant","Green algae","Neochloris sp.","N.R.","122-2","95","72 hr","EC50","","28","PPB","N.R.","","N.R."]
[1889,"2079104","Fishes","Cutthroat trout","Oncorhynchus clarkii","0.3 g","72-1","95","96 hr","LC50","","1.4","PPM","1.1-1.9","","N.R."]
[1868,"2049116","Aquatic Plant","Marine algae","Cyclotella nana","N.R.","122-2","95","72 hr","EC50","","39","PPB","N.R.","","N.R."]
[1899,"2049421","Fishes","Bluegill sunfish","Lepomis macrochirus","0.8 g","72-1","95","96 hr","LC50","","2.8","PPM","2.3-3.3","","N.R."]
[1898,"2049421","Fishes","Lake trout","Salvelinus namaycush","0.4 g","72-1","95","96 hr","LC50","","1.2","PPM","0.9-1.6","","N.R."]
[1897,"2049421","Fishes","Cutthroat trout","Oncorhynchus clarkii","N.R.","72-1","95","96 hr","LC50","","0.71","PPM","0.53-0.96","","N.R."]
[1896,"2049421","Fishes","Coho salmon","Oncorhynchus kisutch","N.R.","72-1","95","96 hr","LC50","<","2.4","PPM","N.R.","","N.R."]
[1891,"2012602/10","Fishes","Rainbow trout","Oncorhynchus mykiss","1.28 g","72-1","95","96 hr","LC50","","1.95","PPM","1.5-2.54","","N.R."]
[1890,"2079104","Fishes","Lake trout","Salvelinus namaycush","N.R.","72-1","95","96 hr","LC50","","2.7","PPM","2.4-3.0","","N.R."]
[1867,"2049116","Aquatic Plant","Marine algae","Isochrysis galbana","N.R.","122-2","95","10 D","EC50","","10","PPB","N.R.","","N.R."]
[1893,"2012617","Fishes","Sheepshead minnow","Cyprinodon variegatus","0.63 g","72-3","99","96 hr","LC50","","6.7","PPM","3.6-10.0","","3.6"]
[1866,"2049116","Aquatic Plant","Marine algae","Monochrysis lutheri","N.R.","122-2","95","72 hr","EC50","","18","PPB","N.R.","","N.R."]
[10475,"2049116","Fishes","Striped mullet","Mugil cephalus","Juv","72-3","95","48 hr","LC50","","6.3","PPM","N.R.","","N.R."]
[10474,"2049116","Mollusca","Eastern oyster","Crassostrea virginica","EmbLrv","72-3","95","96 hr","EC50","","1.8","PPM","N.R.","","N.R."]
[12241,"2012601/11","Crustacea","Water flea","Daphnia magna","LifCyc","72-4","98.2","28 D","LOEC",">","0.2","PPM","N.R.","","0.2"]
[12242,"2012702","Crustacea","Mysid","Americamysis bahia","LifCyc","72-4","96.8","28 D","LOEC","","0.56","PPM","N.R.","","0.27"]
[12243,"2012700","Fishes","Sheepshead minnow","Cyprinodon variegatus","ErlyLf","72-4","96.8","38 D","LOEC","<","0.44","PPM","N.A.","","N.D."]
[12244,"2012614","Fishes","Fathead minnow","Pimephales promelas","ErlyLf","72-4","98.6","60day","LOEC","","61.8","PPB","N.R.","","26.4"]
[10473,"2049116","Crustacea","Brown shrimp","Penaeus aztecus","Juv","72-3","95","48 hr","LC50",">","1.0","PPM","N.A.","","N.R."]
["MEW_plant","946-1",68,0.74725274725274726,"","Dunaliaella tertiolecta","Log growth phase","96 hour","EC50","Population: Growth Rate (Cell counts)","9.2 ug/L","Microalga","Chlorophyta","Chlorophyceae","Marinewater","25°C","Chronic","Not stated","20 ppt","DeLorenzo, M. E., Danese, L. E. & Baird, T. D. 2011. Influence of Increasing Temperature and Salinity on Herbicide Toxicity in Estuarine Phytoplankton, Wiley Periodicals, pp. 359 - 371.","946"]
["MEW_plant","946-2",68,0.74725274725274726,"","Dunaliaella tertiolecta","Log growth phase","96 hour","EC50","Population: Growth Rate (Cell counts)","7.0 ug/L","Microalga","Chlorophyta","Chlorophyceae","Marinewater","25°C","Chronic","Not stated","20 ppt","DeLorenzo, M. E., Danese, L. E. & Baird, T. D. 2011. Influence of Increasing Temperature and Salinity on Herbicide Toxicity in Estuarine Phytoplankton, Wiley Periodicals, pp. 359 - 371.","946","AMETRYN"]
["MEW_plant","946-3",63,0.69230769230769229,"","Dunaliaella tertiolecta","Log growth phase","96 hour","LOEC","Population: Growth Rate (Cell counts)","3.8 ug/L","Microalga","Chlorophyta","Chlorophyceae","Marinewater","25°C","Chronic","Not stated","20 ppt","DeLorenzo, M. E., Danese, L. E. & Baird, T. D. 2011. Influence of Increasing Temperature and Salinity on Herbicide Toxicity in Estuarine Phytoplankton, Wiley Periodicals, pp. 359 - 371.","946"]
["MEW_plant","946-4",63,0.69230769230769229,"","Dunaliaella tertiolecta","Log growth phase","96 hour","LOEC","Population: Growth Rate (Cell counts)","3.8 ug/L","Microalga","Chlorophyta","Chlorophyceae","Marinewater","25°C","Chronic","Not stated","20 ppt","DeLorenzo, M. E., Danese, L. E. & Baird, T. D. 2011. Influence of Increasing Temperature and Salinity on Herbicide Toxicity in Estuarine Phytoplankton, Wiley Periodicals, pp. 359 - 371.","946","AMETRYN"]
["MEW_nonplant","958-1",44,0.46808510638297873,"The highest possible grade for this datum is acceptable.","Crassostrea gigas","Embryo","24 hour","LC10","Mortality",">1000 ug/L","Macroinvertebrate","Mollusca ","Bivalvia","Daigo's Artificial Seawater","25°C","Acute","Not stated","Not stated","Tsunemasa, N. & Okamura, H. 2011. Effects of Organotin Alternative Antifoulants on Oyster Embryo, Archives of Environmental Contamination and Toxicology, vol. 61, pp. 128 - 134.","958"]
["Freshwater/non-metal/plant","944-5-OK",54,0.61363636363636365,"The highest possible grade for this datum is acceptable.","Vibrio fischeri","Not stated","30 minutes","EC50","Growth Rate (Fluorescence)","58.07 mg/L","Microalga","Proteobacteria","Not stated","28 C","28 C","Acute ","Not stated","N.A.","Bonnet, J. L., Bonnemoy, F., Dusser, M. & Bohatier, J. 2007. Assessment of the Potential Toxicity of Herbicides and Their Degradation Products to Nontarget Cells Using Two Microorganisms, the Bacteria Vibrio fischeri and the Ciliate Tetrahymena pyriformis, vol. 22, pp. 78 - 91.","944"]
["Freshwater/non-metal/plant","944-4-OK",54,0.61363636363636365,"The highest possible grade for this datum is acceptable.","Vibrio fischeri","Not stated","15 minutes","EC50","Growth Rate (Fluorescence)","66.87 mg/L","Microalga","Proteobacteria","Not stated","28 C","28 C","Acute ","Not stated","N.A.","Bonnet, J. L., Bonnemoy, F., Dusser, M. & Bohatier, J. 2007. Assessment of the Potential Toxicity of Herbicides and Their Degradation Products to Nontarget Cells Using Two Microorganisms, the Bacteria Vibrio fischeri and the Ciliate Tetrahymena pyriformis, vol. 22, pp. 78 - 91.","944"]
["Freshwater/non-metal/non- plant","865-1-RE",50,0.5494505494505495,"The highest possible grade for this datum is acceptable.","Chlorella vulgaris ","Not stated","1 day","NOEC","Growth: Cell number","0.09 nmM","Microalga","Chlorophyta","Trebouxiophyceae","Freshwater","25°C","Chronic","Not stated","N.A.","Saygideger, S.D. & O, Okkay. 2008. Effect of 2,4-Dichlorophenoxyacetic Acid on Growth, Protein and Chlorophyll-a Content of Chlorella vulgaris and Spirulina platensis Cells, Journal of Environmental Biology, vol. 29, no. 2, pp. 175 - 178. ","865","2, 4-D"]
["Freshwater/non-metal/non- plant","865-2-RE",50,0.5494505494505495,"The highest possible grade for this datum is acceptable.","Chlorella vulgaris ","Not stated","3 days","NOEC","Growth: Cell number","0.009 nmM","Microalga","Chlorophyta","Trebouxiophyceae","Freshwater","25°C","Chronic","Not stated","N.A.","Saygideger, S.D. & O, Okkay. 2008. Effect of 2,4-Dichlorophenoxyacetic Acid on Growth, Protein and Chlorophyll-a Content of Chlorella vulgaris and Spirulina platensis Cells, Journal of Environmental Biology, vol. 29, no. 2, pp. 175 - 178. ","865","2, 4-D"]
["Freshwater/non-metal/non- plant","865-3-RE",50,0.5494505494505495,"The highest possible grade for this datum is acceptable.","Chlorella vulgaris ","Not stated","3 days","LOEC","Growth: Cell number","0.09 nmM","Microalga","Chlorophyta","Trebouxiophyceae","Freshwater","25°C","Chronic","Not stated","N.A.","Saygideger, S.D. & O, Okkay. 2008. Effect of 2,4-Dichlorophenoxyacetic Acid on Growth, Protein and Chlorophyll-a Content of Chlorella vulgaris and Spirulina platensis Cells, Journal of Environmental Biology, vol. 29, no. 2, pp. 175 - 178. ","865","2, 4-D"]
["Freshwater/non-metal/non- plant","865-4-RE",50,0.5494505494505495,"The highest possible grade for this datum is acceptable.","Chlorella vulgaris ","Not stated","5 days","NOEC","Growth: Cell number","0.0009 nmM","Microalga","Chlorophyta","Trebouxiophyceae","Freshwater","25°C","Chronic","Not stated","N.A.","Saygideger, S.D. & O, Okkay. 2008. Effect of 2,4-Dichlorophenoxyacetic Acid on Growth, Protein and Chlorophyll-a Content of Chlorella vulgaris and Spirulina platensis Cells, Journal of Environmental Biology, vol. 29, no. 2, pp. 175 - 178. ","865","2, 4-D"]
["Freshwater/non-metal/non- plant","865-5-RE",50,0.5494505494505495,"The highest possible grade for this datum is acceptable.","Chlorella vulgaris ","Not stated","5 days","LOEC","Growth: Cell number","0.009 nmM","Microalga","Chlorophyta","Trebouxiophyceae","Freshwater","25°C","Chronic","Not stated","N.A.","Saygideger, S.D. & O, Okkay. 2008. Effect of 2,4-Dichlorophenoxyacetic Acid on Growth, Protein and Chlorophyll-a Content of Chlorella vulgaris and Spirulina platensis Cells, Journal of Environmental Biology, vol. 29, no. 2, pp. 175 - 178. ","865","2, 4-D"]
["Freshwater/non-metal/non- plant","865-6-RE",50,0.5494505494505495,"The highest possible grade for this datum is acceptable.","Chlorella vulgaris ","Not stated","7 days","NOEC","Growth: Cell number","0.0009 nmM","Microalga","Chlorophyta","Trebouxiophyceae","Freshwater","25°C","Chronic","Not stated","N.A.","Saygideger, S.D. & O, Okkay. 2008. Effect of 2,4-Dichlorophenoxyacetic Acid on Growth, Protein and Chlorophyll-a Content of Chlorella vulgaris and Spirulina platensis Cells, Journal of Environmental Biology, vol. 29, no. 2, pp. 175 - 178. ","865","2, 4-D"]
["Freshwater/non-metal/non- plant","865-7-RE",50,0.5494505494505495,"The highest possible grade for this datum is acceptable.","Chlorella vulgaris ","Not stated","7 days","LOEC","Growth: Cell number","0.009 nmM","Microalga","Chlorophyta","Trebouxiophyceae","Freshwater","25°C","Chronic","Not stated","N.A.","Saygideger, S.D. & O, Okkay. 2008. Effect of 2,4-Dichlorophenoxyacetic Acid on Growth, Protein and Chlorophyll-a Content of Chlorella vulgaris and Spirulina platensis Cells, Journal of Environmental Biology, vol. 29, no. 2, pp. 175 - 178. ","865","2, 4-D"]
["Freshwater/non-metal/non- plant","865-8-RE",50,0.5494505494505495,"The highest possible grade for this datum is acceptable.","Chlorella vulgaris ","Not stated","9 days","NOEC","Growth: Cell number","0.0009 nmM","Microalga","Chlorophyta","Trebouxiophyceae","Freshwater","25°C","Chronic","Not stated","N.A.","Saygideger, S.D. & O, Okkay. 2008. Effect of 2,4-Dichlorophenoxyacetic Acid on Growth, Protein and Chlorophyll-a Content of Chlorella vulgaris and Spirulina platensis Cells, Journal of Environmental Biology, vol. 29, no. 2, pp. 175 - 178. ","865","2, 4-D"]
["Freshwater/non-metal/non- plant","865-9-RE",50,0.5494505494505495,"The highest possible grade for this datum is acceptable.","Chlorella vulgaris ","Not stated","9 days","LOEC","Growth: Cell number","0.009 nmM","Microalga","Chlorophyta","Trebouxiophyceae","Freshwater","25°C","Chronic","Not stated","N.A.","Saygideger, S.D. & O, Okkay. 2008. Effect of 2,4-Dichlorophenoxyacetic Acid on Growth, Protein and Chlorophyll-a Content of Chlorella vulgaris and Spirulina platensis Cells, Journal of Environmental Biology, vol. 29, no. 2, pp. 175 - 178. ","865","2, 4-D"]
["Freshwater/non-metal/non- plant","865-10-RE",50,0.5494505494505495,"The highest possible grade for this datum is acceptable.","Chlorella vulgaris ","Not stated","1 day","NOEC","Growth: Chlorophyll-a","0.09 nmM","Microalga","Chlorophyta","Trebouxiophyceae","Freshwater","25°C","Chronic","Not stated","N.A.","Saygideger, S.D. & O, Okkay. 2008. Effect of 2,4-Dichlorophenoxyacetic Acid on Growth, Protein and Chlorophyll-a Content of Chlorella vulgaris and Spirulina platensis Cells, Journal of Environmental Biology, vol. 29, no. 2, pp. 175 - 178. ","865","2, 4-D"]
["Freshwater/non-metal/non- plant","865-11-RE",50,0.5494505494505495,"The highest possible grade for this datum is acceptable.","Chlorella vulgaris ","Not stated","3 days","NOEC","Growth: Chlorophyll-a","0.0009 nmM","Microalga","Chlorophyta","Trebouxiophyceae","Freshwater","25°C","Chronic","Not stated","N.A.","Saygideger, S.D. & O, Okkay. 2008. Effect of 2,4-Dichlorophenoxyacetic Acid on Growth, Protein and Chlorophyll-a Content of Chlorella vulgaris and Spirulina platensis Cells, Journal of Environmental Biology, vol. 29, no. 2, pp. 175 - 178. ","865","2, 4-D"]
["Freshwater/non-metal/non- plant","865-12-RE",50,0.5494505494505495,"The highest possible grade for this datum is acceptable.","Chlorella vulgaris ","Not stated","3 days","LOEC","Growth: Chlorophyll-a","0.009 nmM","Microalga","Chlorophyta","Trebouxiophyceae","Freshwater","25°C","Chronic","Not stated","N.A.","Saygideger, S.D. & O, Okkay. 2008. Effect of 2,4-Dichlorophenoxyacetic Acid on Growth, Protein and Chlorophyll-a Content of Chlorella vulgaris and Spirulina platensis Cells, Journal of Environmental Biology, vol. 29, no. 2, pp. 175 - 178. ","865","2, 4-D"]
["Freshwater/non-metal/non- plant","865-13-RE",50,0.5494505494505495,"The highest possible grade for this datum is acceptable.","Chlorella vulgaris ","Not stated","5 days","NOEC","Growth: Chlorophyll-a","0.0009 nmM","Microalga","Chlorophyta","Trebouxiophyceae","Freshwater","25°C","Chronic","Not stated","N.A.","Saygideger, S.D. & O, Okkay. 2008. Effect of 2,4-Dichlorophenoxyacetic Acid on Growth, Protein and Chlorophyll-a Content of Chlorella vulgaris and Spirulina platensis Cells, Journal of Environmental Biology, vol. 29, no. 2, pp. 175 - 178. ","865","2, 4-D"]
["Freshwater/non-metal/non- plant","865-14-RE",50,0.5494505494505495,"The highest possible grade for this datum is acceptable.","Chlorella vulgaris ","Not stated","5 days","LOEC","Growth: Chlorophyll-a","0.009 nmM","Microalga","Chlorophyta","Trebouxiophyceae","Freshwater","25°C","Chronic","Not stated","N.A.","Saygideger, S.D. & O, Okkay. 2008. Effect of 2,4-Dichlorophenoxyacetic Acid on Growth, Protein and Chlorophyll-a Content of Chlorella vulgaris and Spirulina platensis Cells, Journal of Environmental Biology, vol. 29, no. 2, pp. 175 - 178. ","865","2, 4-D"]
["Freshwater/non-metal/non- plant","865-15-RE",50,0.5494505494505495,"The highest possible grade for this datum is acceptable.","Chlorella vulgaris ","Not stated","7 days","NOEC","Growth: Chlorophyll-a","0.0009 nmM","Microalga","Chlorophyta","Trebouxiophyceae","Freshwater","25°C","Chronic","Not stated","N.A.","Saygideger, S.D. & O, Okkay. 2008. Effect of 2,4-Dichlorophenoxyacetic Acid on Growth, Protein and Chlorophyll-a Content of Chlorella vulgaris and Spirulina platensis Cells, Journal of Environmental Biology, vol. 29, no. 2, pp. 175 - 178. ","865","2, 4-D"]
["Freshwater/non-metal/non- plant","865-16-RE",50,0.5494505494505495,"The highest possible grade for this datum is acceptable.","Chlorella vulgaris ","Not stated","7 days","LOEC","Growth: Chlorophyll-a","0.009 nmM","Microalga","Chlorophyta","Trebouxiophyceae","Freshwater","25°C","Chronic","Not stated","N.A.","Saygideger, S.D. & O, Okkay. 2008. Effect of 2,4-Dichlorophenoxyacetic Acid on Growth, Protein and Chlorophyll-a Content of Chlorella vulgaris and Spirulina platensis Cells, Journal of Environmental Biology, vol. 29, no. 2, pp. 175 - 178. ","865","2, 4-D"]
["Freshwater/non-metal/non- plant","865-17-RE",50,0.5494505494505495,"The highest possible grade for this datum is acceptable.","Chlorella vulgaris ","Not stated","9 days","NOEC","Growth: Chlorophyll-a","0.0009 nmM","Microalga","Chlorophyta","Trebouxiophyceae","Freshwater","25°C","Chronic","Not stated","N.A.","Saygideger, S.D. & O, Okkay. 2008. Effect of 2,4-Dichlorophenoxyacetic Acid on Growth, Protein and Chlorophyll-a Content of Chlorella vulgaris and Spirulina platensis Cells, Journal of Environmental Biology, vol. 29, no. 2, pp. 175 - 178. ","865","2, 4-D"]
["Freshwater/non-metal/non- plant","865-18-RE",50,0.5494505494505495,"The highest possible grade for this datum is acceptable.","Chlorella vulgaris ","Not stated","9 days","LOEC","Growth: Chlorophyll-a","0.009 nmM","Microalga","Chlorophyta","Trebouxiophyceae","Freshwater","25°C","Chronic","Not stated","N.A.","Saygideger, S.D. & O, Okkay. 2008. Effect of 2,4-Dichlorophenoxyacetic Acid on Growth, Protein and Chlorophyll-a Content of Chlorella vulgaris and Spirulina platensis Cells, Journal of Environmental Biology, vol. 29, no. 2, pp. 175 - 178. ","865","2, 4-D"]
["Freshwater/non-metal/non- plant","865-19-RE",50,0.5494505494505495,"The highest possible grade for this datum is acceptable.","Spirulina platensis","Not stated","1 day","NOEC","Growth: Cell number","0.09 mg/L","Microalga","Cyanobacteria","Cyanophyceae","Freshwater","35 C","Chronic","Not stated","N.A.","Saygideger, S.D. & O, Okkay. 2008. Effect of 2,4-Dichlorophenoxyacetic Acid on Growth, Protein and Chlorophyll-a Content of Chlorella vulgaris and Spirulina platensis Cells, Journal of Environmental Biology, vol. 29, no. 2, pp. 175 - 178. ","865","2, 4-D","To see whether these values fall within the data set"]
["Freshwater/non-metal/non- plant","865-20-RE",50,0.5494505494505495,"The highest possible grade for this datum is acceptable.","Spirulina platensis","Not stated","3 days","NOEC","Growth: Cell number","0.0009 mg/L","Microalga","Cyanobacteria","Cyanophyceae","Freshwater","35 C","Chronic","Not stated","N.A.","Saygideger, S.D. & O, Okkay. 2008. Effect of 2,4-Dichlorophenoxyacetic Acid on Growth, Protein and Chlorophyll-a Content of Chlorella vulgaris and Spirulina platensis Cells, Journal of Environmental Biology, vol. 29, no. 2, pp. 175 - 178. ","865","2, 4-D","To see whether these values fall within the data set"]
["Freshwater/non-metal/non- plant","865-21-RE",50,0.5494505494505495,"The highest possible grade for this datum is acceptable.","Spirulina platensis","Not stated","3 days","LOEC","Growth: Cell number","0.009 mg/L","Microalga","Cyanobacteria","Cyanophyceae","Freshwater","35 C","Chronic","Not stated","N.A.","Saygideger, S.D. & O, Okkay. 2008. Effect of 2,4-Dichlorophenoxyacetic Acid on Growth, Protein and Chlorophyll-a Content of Chlorella vulgaris and Spirulina platensis Cells, Journal of Environmental Biology, vol. 29, no. 2, pp. 175 - 178. ","865","2, 4-D","To see whether these values fall within the data set"]
["Freshwater/non-metal/non- plant","865-22-RE",50,0.5494505494505495,"The highest possible grade for this datum is acceptable.","Spirulina platensis","Not stated","5 days","NOEC","Growth: Cell number","0.0009 mg/L","Microalga","Cyanobacteria","Cyanophyceae","Freshwater","35 C","Chronic","Not stated","N.A.","Saygideger, S.D. & O, Okkay. 2008. Effect of 2,4-Dichlorophenoxyacetic Acid on Growth, Protein and Chlorophyll-a Content of Chlorella vulgaris and Spirulina platensis Cells, Journal of Environmental Biology, vol. 29, no. 2, pp. 175 - 178. ","865","2, 4-D","To see whether these values fall within the data set"]
["Freshwater/non-metal/non- plant","865-23-RE",50,0.5494505494505495,"The highest possible grade for this datum is acceptable.","Spirulina platensis","Not stated","5 days","LOEC","Growth: Cell number","0.009 mg/L","Microalga","Cyanobacteria","Cyanophyceae","Freshwater","35 C","Chronic","Not stated","N.A.","Saygideger, S.D. & O, Okkay. 2008. Effect of 2,4-Dichlorophenoxyacetic Acid on Growth, Protein and Chlorophyll-a Content of Chlorella vulgaris and Spirulina platensis Cells, Journal of Environmental Biology, vol. 29, no. 2, pp. 175 - 178. ","865","2, 4-D","To see whether these values fall within the data set"]
["Freshwater/non-metal/non- plant","865-24-RE",50,0.5494505494505495,"The highest possible grade for this datum is acceptable.","Spirulina platensis","Not stated","7 days","NOEC","Growth: Cell number","0.0009 mg/L","Microalga","Cyanobacteria","Cyanophyceae","Freshwater","35 C","Chronic","Not stated","N.A.","Saygideger, S.D. & O, Okkay. 2008. Effect of 2,4-Dichlorophenoxyacetic Acid on Growth, Protein and Chlorophyll-a Content of Chlorella vulgaris and Spirulina platensis Cells, Journal of Environmental Biology, vol. 29, no. 2, pp. 175 - 178. ","865","2, 4-D","To see whether these values fall within the data set"]
["Freshwater/non-metal/non- plant","865-25-RE",50,0.5494505494505495,"The highest possible grade for this datum is acceptable.","Spirulina platensis","Not stated","7 days","LOEC","Growth: Cell number","0.009 mg/L","Microalga","Cyanobacteria","Cyanophyceae","Freshwater","35 C","Chronic","Not stated","N.A.","Saygideger, S.D. & O, Okkay. 2008. Effect of 2,4-Dichlorophenoxyacetic Acid on Growth, Protein and Chlorophyll-a Content of Chlorella vulgaris and Spirulina platensis Cells, Journal of Environmental Biology, vol. 29, no. 2, pp. 175 - 178. ","865","2, 4-D","To see whether these values fall within the data set"]
["Freshwater/non-metal/non- plant","865-26-RE",50,0.5494505494505495,"The highest possible grade for this datum is acceptable.","Spirulina platensis","Not stated","9 days","NOEC","Growth: Cell number","0.0009 mg/L","Microalga","Cyanobacteria","Cyanophyceae","Freshwater","35 C","Chronic","Not stated","N.A.","Saygideger, S.D. & O, Okkay. 2008. Effect of 2,4-Dichlorophenoxyacetic Acid on Growth, Protein and Chlorophyll-a Content of Chlorella vulgaris and Spirulina platensis Cells, Journal of Environmental Biology, vol. 29, no. 2, pp. 175 - 178. ","865","2, 4-D","To see whether these values fall within the data set"]
["Freshwater/non-metal/non- plant","865-27-RE",50,0.5494505494505495,"The highest possible grade for this datum is acceptable.","Spirulina platensis","Not stated","9 days","LOEC","Growth: Cell number","0.009 mg/L","Microalga","Cyanobacteria","Cyanophyceae","Freshwater","35 C","Chronic","Not stated","N.A.","Saygideger, S.D. & O, Okkay. 2008. Effect of 2,4-Dichlorophenoxyacetic Acid on Growth, Protein and Chlorophyll-a Content of Chlorella vulgaris and Spirulina platensis Cells, Journal of Environmental Biology, vol. 29, no. 2, pp. 175 - 178. ","865","2, 4-D","To see whether these values fall within the data set"]
["Freshwater/non-metal/non- plant","865-28-RE",50,0.5494505494505495,"The highest possible grade for this datum is acceptable.","Spirulina platensis","Not stated","1 day","NOEC","Growth: Chlorophyll-a","0.009 mg/L","Microalga","Cyanobacteria","Cyanophyceae","Freshwater","35 C","Chronic","Not stated","N.A.","Saygideger, S.D. & O, Okkay. 2008. Effect of 2,4-Dichlorophenoxyacetic Acid on Growth, Protein and Chlorophyll-a Content of Chlorella vulgaris and Spirulina platensis Cells, Journal of Environmental Biology, vol. 29, no. 2, pp. 175 - 178. ","865","2, 4-D","To see whether these values fall within the data set"]
["Freshwater/non-metal/non- plant","865-29-RE",50,0.5494505494505495,"The highest possible grade for this datum is acceptable.","Spirulina platensis","Not stated","1 day","LOEC","Growth: Chlorophyll-a","0.09 mg/L","Microalga","Cyanobacteria","Cyanophyceae","Freshwater","35 C","Chronic","Not stated","N.A.","Saygideger, S.D. & O, Okkay. 2008. Effect of 2,4-Dichlorophenoxyacetic Acid on Growth, Protein and Chlorophyll-a Content of Chlorella vulgaris and Spirulina platensis Cells, Journal of Environmental Biology, vol. 29, no. 2, pp. 175 - 178. ","865","2, 4-D","To see whether these values fall within the data set"]
["Freshwater/non-metal/non- plant","865-30-RE",50,0.5494505494505495,"The highest possible grade for this datum is acceptable.","Spirulina platensis","Not stated","3 days","NOEC","Growth: Chlorophyll-a","0.0009 mg/L","Microalga","Cyanobacteria","Cyanophyceae","Freshwater","35 C","Chronic","Not stated","N.A.","Saygideger, S.D. & O, Okkay. 2008. Effect of 2,4-Dichlorophenoxyacetic Acid on Growth, Protein and Chlorophyll-a Content of Chlorella vulgaris and Spirulina platensis Cells, Journal of Environmental Biology, vol. 29, no. 2, pp. 175 - 178. ","865","2, 4-D","To see whether these values fall within the data set"]
["Freshwater/non-metal/non- plant","865-31-RE",50,0.5494505494505495,"The highest possible grade for this datum is acceptable.","Spirulina platensis","Not stated","3 days","LOEC","Growth: Chlorophyll-a","0.009 mg/L","Microalga","Cyanobacteria","Cyanophyceae","Freshwater","35 C","Chronic","Not stated","N.A.","Saygideger, S.D. & O, Okkay. 2008. Effect of 2,4-Dichlorophenoxyacetic Acid on Growth, Protein and Chlorophyll-a Content of Chlorella vulgaris and Spirulina platensis Cells, Journal of Environmental Biology, vol. 29, no. 2, pp. 175 - 178. ","865","2, 4-D","To see whether these values fall within the data set"]
["Freshwater/non-metal/non- plant","865-32-RE",50,0.5494505494505495,"The highest possible grade for this datum is acceptable.","Spirulina platensis","Not stated","5 days","NOEC","Growth: Chlorophyll-a","0.0009 mg/L","Microalga","Cyanobacteria","Cyanophyceae","Freshwater","35 C","Chronic","Not stated","N.A.","Saygideger, S.D. & O, Okkay. 2008. Effect of 2,4-Dichlorophenoxyacetic Acid on Growth, Protein and Chlorophyll-a Content of Chlorella vulgaris and Spirulina platensis Cells, Journal of Environmental Biology, vol. 29, no. 2, pp. 175 - 178. ","865","2, 4-D","To see whether these values fall within the data set"]
["Freshwater/non-metal/non- plant","865-33-RE",50,0.5494505494505495,"The highest possible grade for this datum is acceptable.","Spirulina platensis","Not stated","5 days","LOEC","Growth: Chlorophyll-a","0.009 mg/L","Microalga","Cyanobacteria","Cyanophyceae","Freshwater","35 C","Chronic","Not stated","N.A.","Saygideger, S.D. & O, Okkay. 2008. Effect of 2,4-Dichlorophenoxyacetic Acid on Growth, Protein and Chlorophyll-a Content of Chlorella vulgaris and Spirulina platensis Cells, Journal of Environmental Biology, vol. 29, no. 2, pp. 175 - 178. ","865","2, 4-D","To see whether these values fall within the data set"]
["Freshwater/non-metal/non- plant","865-34-RE",50,0.5494505494505495,"The highest possible grade for this datum is acceptable.","Spirulina platensis","Not stated","7 days","NOEC","Growth: Chlorophyll-a","0.0009 mg/L","Microalga","Cyanobacteria","Cyanophyceae","Freshwater","35 C","Chronic","Not stated","N.A.","Saygideger, S.D. & O, Okkay. 2008. Effect of 2,4-Dichlorophenoxyacetic Acid on Growth, Protein and Chlorophyll-a Content of Chlorella vulgaris and Spirulina platensis Cells, Journal of Environmental Biology, vol. 29, no. 2, pp. 175 - 178. ","865","2, 4-D","To see whether these values fall within the data set"]
["Freshwater/non-metal/non- plant","865-35-RE",50,0.5494505494505495,"The highest possible grade for this datum is acceptable.","Spirulina platensis","Not stated","7 days","LOEC","Growth: Chlorophyll-a","0.009 mg/L","Microalga","Cyanobacteria","Cyanophyceae","Freshwater","35 C","Chronic","Not stated","N.A.","Saygideger, S.D. & O, Okkay. 2008. Effect of 2,4-Dichlorophenoxyacetic Acid on Growth, Protein and Chlorophyll-a Content of Chlorella vulgaris and Spirulina platensis Cells, Journal of Environmental Biology, vol. 29, no. 2, pp. 175 - 178. ","865","2, 4-D","To see whether these values fall within the data set"]
["Freshwater/non-metal/non- plant","865-36-RE",50,0.5494505494505495,"The highest possible grade for this datum is acceptable.","Spirulina platensis","Not stated","9 days","NOEC","Growth: Chlorophyll-a","0.0009 mg/L","Microalga","Cyanobacteria","Cyanophyceae","Freshwater","35 C","Chronic","Not stated","N.A.","Saygideger, S.D. & O, Okkay. 2008. Effect of 2,4-Dichlorophenoxyacetic Acid on Growth, Protein and Chlorophyll-a Content of Chlorella vulgaris and Spirulina platensis Cells, Journal of Environmental Biology, vol. 29, no. 2, pp. 175 - 178. ","865","2, 4-D","To see whether these values fall within the data set"]
["Freshwater/non-metal/non- plant","865-37-RE",50,0.5494505494505495,"The highest possible grade for this datum is acceptable.","Spirulina platensis","Not stated","9 days","LOEC","Growth: Chlorophyll-a","0.009 mg/L","Microalga","Cyanobacteria","Cyanophyceae","Freshwater","35 C","Chronic","Not stated","N.A.","Saygideger, S.D. & O, Okkay. 2008. Effect of 2,4-Dichlorophenoxyacetic Acid on Growth, Protein and Chlorophyll-a Content of Chlorella vulgaris and Spirulina platensis Cells, Journal of Environmental Biology, vol. 29, no. 2, pp. 175 - 178. ","865","2, 4-D","To see whether these values fall within the data set"]
["Freshwater/non-metal/non- plant","646-1-RE2",48,0.52747252747252749,"The highest possible grade for this datum is acceptable.","Daphnia magna","Neonates","6 days","NOEC","Reproduction: Sex ratio","100 ug/L","Microinvertebrate","Arthropoda","Branchiopoda","Freshwater","Not stated","Acute ","Not stated","N.A.","Kashian, D.R. & Dodson, S. I. 2002. Effects of Common-Use Pesticides on Developmental and Reproductive Processes in Daphnia, Toxicology and Industrial Health, vol. 18, pp. 225 - 235. ","646","2, 4-D"]
["Freshwater/non-metal/non- plant","646-2-RE2",48,0.52747252747252749,"The highest possible grade for this datum is acceptable.","Daphnia magna","Neonates","6 days","NOEC","Survival: Mortality","100 ug/L","Microinvertebrate","Arthropoda","Branchiopoda","Freshwater","Not stated","Acute ","Not stated","N.A.","Kashian, D.R. & Dodson, S. I. 2002. Effects of Common-Use Pesticides on Developmental and Reproductive Processes in Daphnia, Toxicology and Industrial Health, vol. 18, pp. 225 - 235. ","646","2, 4-D"]
["Freshwater/non-metal/non- plant","646-3-RE2",48,0.52747252747252749,"The highest possible grade for this datum is acceptable.","Daphnia magna","Adults","6 days","NOEC","Survival: Mortality","100 ug/L","Microinvertebrate","Arthropoda","Branchiopoda","Freshwater","Not stated","Acute ","Not stated","N.A.","Kashian, D.R. & Dodson, S. I. 2002. Effects of Common-Use Pesticides on Developmental and Reproductive Processes in Daphnia, Toxicology and Industrial Health, vol. 18, pp. 225 - 235. ","646","2, 4-D"]
["Freshwater/non-metal/non- plant","646-4-RE2",48,0.52747252747252749,"The highest possible grade for this datum is acceptable.","Daphnia magna","Adults","6 days","NOEC","Reproduction: Resting egg production","100 ug/L","Microinvertebrate","Arthropoda","Branchiopoda","Freshwater","Not stated","Acute ","Not stated","N.A.","Kashian, D.R. & Dodson, S. I. 2002. Effects of Common-Use Pesticides on Developmental and Reproductive Processes in Daphnia, Toxicology and Industrial Health, vol. 18, pp. 225 - 235. ","646","2, 4-D"]
["Freshwater/non-metal/non- plant","646-5-RE2",48,0.52747252747252749,"The highest possible grade for this datum is acceptable.","Daphnia magna","Adults","6 days","NOEC","Growth: Morphology (size)","100 ug/L","Microinvertebrate","Arthropoda","Branchiopoda","Freshwater","Not stated","Acute ","Not stated","N.A.","Kashian, D.R. & Dodson, S. I. 2002. Effects of Common-Use Pesticides on Developmental and Reproductive Processes in Daphnia, Toxicology and Industrial Health, vol. 18, pp. 225 - 235. ","646","2, 4-D"]
[]
["FROM WQG"]
["Fish"]
[null,"Carassius auratus","Freshwater","Acute","LC50","MORT",null,null,"NR",5800,"ug/L",215192,48,"Goldfish"]
[null,"Carassius sp","Freshwater","Acute","LC50","MORT",null,null,"NR",63000,"ug/L",206270,96,"Carp"]
[null,"Ctenopharyngodon idella","Freshwater","Acute","LC50","MORT",null,null,"NR",44000,"ug/L",200575,48,"Grass carp, white amur"]
[null,"Ctenopharyngodon idella","Freshwater","Acute","LC50","MORT",null,null,"NR",31000,"ug/L",200575,96,"Grass carp, white amur"]
[null,"Cyprinus carpio","Freshwater","Acute","LC50","MORT",null,null,"NR",3200,"ug/L",215192,48,"Common carp"]
[null,"Cyprinus carpio","Freshwater","Acute","LC50","MORT",null,null,"NR",2900,"ug/L",206270,96,"Common carp"]
[null,"Lepomis macrochirus","Freshwater","Acute","LC50","MORT",null,null,"NR",7400,"ug/L",202871,48,"Bluegill "]
[null,"Lepomis macrochirus","Freshwater","Acute","LC50","MORT",null,null,"NR",8900,"ug/L",202085,96,"Bluegill "]
[null,"Lepomis macrochirus","Freshwater","Acute","LC50","MORT",null,null,"NR",5900,"ug/L",202085,96,"Bluegill "]
[null,"Lepomis macrochirus","Freshwater","Acute","LC50","MORT",null,null,"NR",7600,"ug/L",202085,96,"Bluegill "]
[null,"Lepomis macrochirus","Freshwater","Acute","LC50","MORT",null,null,"NR",2800,"ug/L",200344,96,"Bluegill "]
[null,"Lepomis macrochirus","Freshwater","Acute","LC50","MORT",null,null,"NR",84000,"ug/L",200344,96,"Bluegill "]
[null,"Lepomis macrochirus","Freshwater","Acute","LC50","MORT",null,null,"NR",3200,"ug/L",200344,96,"Bluegill "]
[null,"Lepomis macrochirus","Freshwater","Acute","LC50","MORT",null,null,"NR",4000,"ug/L",202871,96,"Bluegill "]
[null,"Lepomis macrochirus","Freshwater","Acute","LC50","MORT",null,null,"NR",8200,"ug/L",200666,96,"Bluegill "]
[null,"Morone saxatilis","Freshwater","Acute","LC50","MORT",null,null,"NR",8000,"ug/L",202012,48,"Striped bass"]
[null,"Morone saxatilis","Freshwater","Acute","LC50","MORT",null,null,"NR",500,"ug/L",202012,48,"Striped bass"]
[null,"Morone saxatilis","Freshwater","Acute","LC50","MORT",null,null,"NR",500,"ug/L",202012,72,"Striped bass"]
[null,"Morone saxatilis","Freshwater","Acute","LC50","MORT",null,null,"NR",6000,"ug/L",202012,72,"Striped bass"]
[null,"Morone saxatilis","Freshwater","Acute","LC50","MORT",null,null,"NR",6000,"ug/L",202012,96,"Striped bass"]
[null,"Morone saxatilis","Freshwater","Acute","LC50","MORT",null,null,"NR",3100,"ug/L",200909,96,"Striped bass"]
[null,"Morone saxatilis","Freshwater","Acute","LC50","MORT",null,null,"NR",500,"ug/L",202012,96,"Striped bass"]
[null,"Oncorhynchus clarki","Freshwater","Acute","LC50","MORT",null,null,"NR",1400,"ug/L",200344,96,"Cutthroat trout"]
[null,"Oncorhynchus clarki","Freshwater","Acute","LC50","MORT",null,null,"NR",1400,"ug/L",200666,96,"Cutthroat trout"]
[null,"Oncorhynchus clarki","Freshwater","Acute","LC50","MORT",null,null,"NR",710,"ug/L",200344,96,"Cutthroat trout"]
[null,"Oncorhynchus kisutch ","Freshwater","Acute","LC50","MORT",null,null,"NR",16000,"ug/L",200879,48,"Coho salmon,silver salmon"]
[null,"Oncorhynchus mykiss","Freshwater","Acute","LC50","MORT",null,null,"NR",4900,"ug/L",200666,96,"Rainbow trout"]
[null,"Oncorhynchus mykiss","Freshwater","Acute","LC50","MORT",null,null,"NR",1950,"ug/L",200344,96,"Rainbow trout"]
[null,"Oncorhynchus mykiss","Freshwater","Acute","LC50","MORT",null,null,"NR",19600,"ug/L",200344,96,"Rainbow trout"]
[null,"Oncorhynchus mykiss","Freshwater","Acute","LC50","MORT",null,null,"NR",23800,"ug/L",200344,96,"Rainbow trout"]
[null,"Oncorhynchus mykiss","Freshwater","Acute","LC50","MORT",null,null,"NR",16000,"ug/L",200666,96,"Rainbow trout"]
[null,"Oncorhynchus mykiss","Freshwater","Acute","LC50","MORT",null,null,"NR",16000,"ug/L",200344,96,"Rainbow trout"]
[null,"Oryzias latipes","Freshwater","Acute","LC50","MORT",null,null,"NR",3500,"ug/L",215192,48,"Medaka, high-eyes"]
[null,"Pimephales promelas","Freshwater","Acute","LC50","MORT",null,null,"NR",19900,"ug/L",212612,48,"Fathead minnow"]
[null,"Pimephales promelas","Freshwater","Acute","LC50","MORT",null,null,"NR",14200,"ug/L",212858,96,"Fathead minnow"]
[null,"Pimephales promelas","Freshwater","Acute","LC50","MORT",null,null,"NR",14200,"ug/L",200344,96,"Fathead minnow"]
[null,"Rasbora heteromorpha","Freshwater","Acute","LC50","MORT",null,null,"NR",190000,"ug/L",200848,48,"Harlequinfish, red rasbora"]
[null,"Salmonidae","Freshwater","Acute","LC50","MORT",null,null,"NR",1100,"ug/L",206270,96,"Trout family"]
[null,"Salvelinus namaycush ","Freshwater","Acute","LC50","MORT",null,null,"NR",1200,"ug/L",200344,96,"Lake trout, siscowet"]
[null,"Salvelinus namaycush ","Freshwater","Acute","LC50","MORT",null,null,"NR",2700,"ug/L",200344,96,"Lake trout, siscowet"]
[null,"Salvelinus namaycush ","Freshwater","Acute","LC50","MORT",null,null,"NR",2700,"ug/L",200666,96,"Lake trout, siscowet"]
[null,"Tinca tinca ","Freshwater","Acute","LC50","MORT",null,null,"NR",15500,"ug/L",206270,96,"Tench"]
["crustaceans"]
[null,"Asellus brevicaudus","Freshwater","Acute","LC50","MORT",null,null,"NR",15500,"ug/L",200666,96,"Aquatic sowbug"]
[null,"Daphnia magna","Freshwater","Acute","LC50","MORT",null,null,"NR",400,"ug/L",206270,96,"Water flea"]
[null,"Daphnia pulex","Freshwater","Acute","EC50","IMM",null,null,"NR",1400,"ug/L",200888,48,"Water flea "]
[null,"Daphnia pulex","Freshwater","Acute","EC50","IMM",null,null,"NR",1400,"ug/L",200666,48,"Water flea "]
[null,"Gammarus fasciatus","Freshwater","Acute","LC50","MORT",null,null,"NR",1800,"ug/L",200886,48,"Scud "]
[null,"Gammarus fasciatus","Freshwater","Acute","LC50","MORT",null,null,"NR",700,"ug/L",200886,96,"Scud "]
[null,"Gammarus fasciatus","Freshwater","Acute","LC50","MORT",null,null,"NR",160,"ug/L",200666,96,"Scud "]
[null,"Gammarus fasciatus","Freshwater","Acute","LC50","MORT",null,null,"NR",160,"ug/L",200344,96,"Scud "]
[null,"Gammarus lacustris","Freshwater","Acute","LC50","MORT",null,null,"NR",380,"ug/L",200885,48,"Scud"]
[null,"Gammarus lacustris","Freshwater","Acute","LC50","MORT",null,null,"NR",160,"ug/L",200885,96,"Scud"]
[null,"Simocephalus serrulatus","Freshwater","Acute","EC50","IMM",null,null,"NR",2000,"ug/L",200888,48,"Water flea"]
[null,"Simocephalus serrulatus","Freshwater","Acute","EC50","IMM",null,null,"NR",2000,"ug/L",200666,48,"Water flea"]
["Insects"]
[null,"Aedes aegypti","Freshwater","Acute","LC50","MORT",null,null,"NR",1200,"ug/L",206270,96,"Mosquito"]
[null,"Pteronarcys californica ","Freshwater","Acute","LC50","MORT",null,null,"NR",2800,"ug/L",200889,48,"Stonefly"]
[null,"Pteronarcys californica ","Freshwater","Acute","LC50","MORT",null,null,"NR",1200,"ug/L",200889,96,"Stonefly"]
[null,"Pteronarcys californica ","Freshwater","Acute","LC50","MORT",null,null,"NR",1200,"ug/L",200666,96,"Stonefly"]
["Fish"]
[null,"Pimephales promelas","Freshwater","Chronic","NOEC","MORT",null,null,"NR",33.400001525878906,"ug/L",212612,1536,"Fathead minnow"]
["Fish"]
[null,"Mugil curema","Marine","Acute","LC50","MORT",null,null,"NR",6300,"ug/L",202188,48,"White mullet"]
["Molluscs"]
["MEW_nonplant","954-1-OK",62,0.65957446808510634,"The highest possible grade for this datum is acceptable.","Pagrus auratus","Larvae (2 hrs old)","36 hour","NOEC","Hatching success","50 ug/L","Fish ","Chordata","Actinopterygii","Filtered seawater","24.5 C","Acute","Not stated","40 ppt","Gagnon, M. M. & Rawson, C. A. 2009. Diuron increases spinal deformity in early-life-stage pink snapper Pagrus auratus, Marine Pollution Bulletin, vol. 58, pp. 1078 - 1095. ","954"]
["MEW_nonplant","958-1-OK",55,0.58510638297872342,"The highest possible grade for this datum is acceptable.","Crassostrea gigas","Mature fertilised eggs","24 hour","LC10","Survival Rate",">1000 ug/L","Macroinvertebrate","Mollusca ","Bivalvia","Daigo's Artificial Seawater","25°C","Acute","Not stated","Not stated","Tsunemasa, N. & Okamura, H. 2011. Effects of Organotin Alternative Antifoulants on Oyster Embryo, Archives of Environmental Contamination and Toxicology, vol. 61, pp. 128 - 134.","958"]
["MEW_nonplant","958-1-RE",56,0.5957446808510638,"The highest possible grade for this datum is acceptable.","Crassostrea gigas","Mature fertilised eggs","24 hour","LC10","Survival Rate",">1000 ug/L","Macroinvertebrate","Mollusca ","Bivalvia","Daigo's Artificial Seawater","25°C","Acute","Not stated","Not stated","Tsunemasa, N. & Okamura, H. 2011. Effects of Organotin Alternative Antifoulants on Oyster Embryo, Archives of Environmental Contamination and Toxicology, vol. 61, pp. 128 - 134.","958"]
["MEW_nonplant","958-2-RE",56,0.5957446808510638,"The highest possible grade for this datum is acceptable.","Crassostrea gigas","Mature fertilised eggs","48 hour","LC10","Survival Rate",">1000 ug/L","Macroinvertebrate","Mollusca ","Bivalvia","Daigo's Artificial Seawater","25°C","Acute","Not stated","Not stated","Tsunemasa, N. & Okamura, H. 2011. Effects of Organotin Alternative Antifoulants on Oyster Embryo, Archives of Environmental Contamination and Toxicology, vol. 61, pp. 128 - 134.","958"]
["MEW_nonplant","958-3-RE",56,0.5957446808510638,"The highest possible grade for this datum is acceptable.","Crassostrea gigas","Mature fertilised eggs","24 hour","LC50","Survival Rate",">1000 ug/L","Macroinvertebrate","Mollusca ","Bivalvia","Daigo's Artificial Seawater","25°C","Acute","Not stated","Not stated","Tsunemasa, N. & Okamura, H. 2011. Effects of Organotin Alternative Antifoulants on Oyster Embryo, Archives of Environmental Contamination and Toxicology, vol. 61, pp. 128 - 134.","958"]
["MEW_nonplant","958-4-RE",56,0.5957446808510638,"The highest possible grade for this datum is acceptable.","Crassostrea gigas","Mature fertilised eggs","48 hour","LC50","Survival Rate",">1000 ug/L","Macroinvertebrate","Mollusca ","Bivalvia","Daigo's Artificial Seawater","25°C","Acute","Not stated","Not stated","Tsunemasa, N. & Okamura, H. 2011. Effects of Organotin Alternative Antifoulants on Oyster Embryo, Archives of Environmental Contamination and Toxicology, vol. 61, pp. 128 - 134.","958"]
["MEW_nonplant","954-1-RE",59,0.62765957446808507,"The highest possible grade for this datum is acceptable.","Pagrus auratus","<2.5 hour old eggs","36 hour","NOEC","Hatching success","50 ug/L","Fish","Chordata","Actinopterygii","Filtered sea water","24.5 C","Acute","Not stated","Not stated","Gagnon, M. M. & Rawson, C. A. 2009. Diuron increases spinal deformity in early-life-stage pink snapper Pagrus auratus, Marine Pollution Bulletin 58, 1078 - 1095. ","954"]
[]
[]
["MEW_plant","679-1",65,0.7142857142857143,null,"Acropora tenuis","Mature colonies","53 days","NOEC","Reproduction: Polyp fercundity","8.8 ug/L","Coral","Cnidaria","Anthozoa","Unfiltered oceanic seawater","26-29°C","Chronic","Not stated","Not stated","Cantin,N.E., A.P. Negri, and B.L. Willis (2007). Photoinhibition from Chronic Herbicide Exposure Reduces Reproductive Output of Reef-Building Corals, Mar. Ecol. Prog. Ser.344:81-93.","679","Data failed the acceptability criteria (Q7) are automatically deemed to be of unacceptable quality and must not be used."]
["MEW_plant","679-2",65,0.7142857142857143,null,"Acropora tenuis","Mature colonies","53 days","NOEC","Reproduction: Egg size","8.8 ug/L","Coral","Cnidaria","Anthozoa","Unfiltered oceanic seawater","26-29°C","Chronic","Not stated","Not stated","Cantin,N.E., A.P. Negri, and B.L. Willis (2007). Photoinhibition from Chronic Herbicide Exposure Reduces Reproductive Output of Reef-Building Corals, Mar. Ecol. Prog. Ser.344:81-93.","679","Data failed the acceptability criteria (Q7) are automatically deemed to be of unacceptable quality and must not be used."]
["MEW_plant","679-3",65,0.7142857142857143,null,"Acropora tenuis","Mature colonies","53 days","NOEC","Mortality","8.8 ug/L","Coral","Cnidaria","Anthozoa","Unfiltered oceanic seawater","26-29°C","Chronic","Not stated","Not stated","Cantin,N.E., A.P. Negri, and B.L. Willis (2007). Photoinhibition from Chronic Herbicide Exposure Reduces Reproductive Output of Reef-Building Corals, Mar. Ecol. Prog. Ser.344:81-93.","679","Data failed the acceptability criteria (Q7) are automatically deemed to be of unacceptable quality and must not be used."]
["MEW_plant","679-4",63,0.69230769230769229,"The highest possible grade for this datum is acceptable.","Acropora valida","Mature colonies","90 days","LOEC","Reproduction: Polyp fercundity","10 ug/L","Coral","Cnidaria","Anthozoa","Unfiltered oceanic seawater","26-29°C","Chronic","Not stated","Not stated","Cantin,N.E., A.P. Negri, and B.L. Willis (2007). Photoinhibition from Chronic Herbicide Exposure Reduces Reproductive Output of Reef-Building Corals, Mar. Ecol. Prog. Ser.344:81-93.","679","Data failed the acceptability criteria (Q7) are automatically deemed to be of unacceptable quality and must not be used."]
["MEW_plant","679-5",63,0.69230769230769229,"The highest possible grade for this datum is acceptable.","Acropora valida","Mature colonies","90 days","NOEC","Reproduction: Polyp fercundity","1 ug/L","Coral","Cnidaria","Anthozoa","Unfiltered oceanic seawater","26-29°C","Chronic","Not stated","Not stated","Cantin,N.E., A.P. Negri, and B.L. Willis (2007). Photoinhibition from Chronic Herbicide Exposure Reduces Reproductive Output of Reef-Building Corals, Mar. Ecol. Prog. Ser.344:81-93.","679","Data failed the acceptability criteria (Q7) are automatically deemed to be of unacceptable quality and must not be used."]
["MEW_plant","679-6",63,0.69230769230769229,"The highest possible grade for this datum is acceptable.","Acropora valida","Mature colonies","90 days","NOEC","Reproduction: Egg size","1 ug/L","Coral","Cnidaria","Anthozoa","Unfiltered oceanic seawater","26-29°C","Chronic","Not stated","Not stated","Cantin,N.E., A.P. Negri, and B.L. Willis (2007). Photoinhibition from Chronic Herbicide Exposure Reduces Reproductive Output of Reef-Building Corals, Mar. Ecol. Prog. Ser.344:81-93.","679","Data failed the acceptability criteria (Q7) are automatically deemed to be of unacceptable quality and must not be used."]
["MEW_plant","679-7",63,0.69230769230769229,"The highest possible grade for this datum is acceptable.","Pocillopora damicornis","Reproductively mature colonies","67 days","NOEC","Reproduction: Egg size","1 ug/L","Coral","Cnidaria","Anthozoa","Unfiltered oceanic seawater","26-29°C","Chronic","Not stated","Not stated","Cantin,N.E., A.P. Negri, and B.L. Willis (2007). Photoinhibition from Chronic Herbicide Exposure Reduces Reproductive Output of Reef-Building Corals, Mar. Ecol. Prog. Ser.344:81-93.","679","Data failed the acceptability criteria (Q7) are automatically deemed to be of unacceptable quality and must not be used."]
["Freshwater/non-metal/non- plant","655-1",66,0.72527472527472525,"The highest possible grade for this datum is acceptable.","Oncorhynchus mykiss","Juveniles (<24 hours after hatching)","7 days","LC50","Mortality","74 mg/L","Fish","Chordata","Actinopterygii","Dechlorinated tap water","20°C","Acute ","Not measured","N.A.","Okamura,H., T. Watanabe, I. Aoyama, and M. Hasobe (2002). Toxicity Evaluation of New Antifouling Compounds Using Suspension-Cultured Fish Cells, Chemosphere 46(7): 945-951.","655"]
["Freshwater/non-metal/non- plant","655-2",66,0.72527472527472525,"The highest possible grade for this datum is acceptable.","Oncorhynchus mykiss","Juveniles (<24 hours after hatching)","14 days","LC50","Mortality","15 mg/L","Fish","Chordata","Actinopterygii","Dechlorinated tap water","20°C","Acute ","Not measured","N.A.","Okamura,H., T. Watanabe, I. Aoyama, and M. Hasobe (2002). Toxicity Evaluation of New Antifouling Compounds Using Suspension-Cultured Fish Cells, Chemosphere 46(7): 945-951.","655"]
["Freshwater/non-metal/non- plant","655-3",66,0.72527472527472525,"The highest possible grade for this datum is acceptable.","Oncorhynchus mykiss","Juveniles (<24 hours after hatching)","21 days","LC50","Mortality","5.9 mg/L","Fish","Chordata","Actinopterygii","Dechlorinated tap water","20°C","Chronic","Not measured","N.A.","Okamura,H., T. Watanabe, I. Aoyama, and M. Hasobe (2002). Toxicity Evaluation of New Antifouling Compounds Using Suspension-Cultured Fish Cells, Chemosphere 46(7): 945-951.","655"]
["Freshwater/non-metal/non- plant","655-4",66,0.72527472527472525,"The highest possible grade for this datum is acceptable.","Oncorhynchus mykiss","Juveniles (<24 hours after hatching)","28 days","LC50","Mortality","0.23 mg/L","Fish","Chordata","Actinopterygii","Dechlorinated tap water","20°C","Chronic","Not measured","N.A.","Okamura,H., T. Watanabe, I. Aoyama, and M. Hasobe (2002). Toxicity Evaluation of New Antifouling Compounds Using Suspension-Cultured Fish Cells, Chemosphere 46(7): 945-951.","655"]
["Freshwater/non-metal/non- plant","653-1",76,0.8351648351648352,"","Daphnia magna","Adults (5 days old)","7 days","NOAEL","Mortality: Survival","4.0 mg/L","Microinvertebrate","Arthropoda","Branchiopoda","0.45 um filtered well water","Not stated","Chronic","6.9 ± 0.1","N.A.","Nebeker,A.V., and G.S. Schuytema (1998). Chronic Effects of the Herbicide Diuron on Freshwater Cladocerans, Amphipods, Midges, Minnows, Worms, and Snails, Arch. Environ. Contam. Toxicol.35(3): 441-446.","653"]
["Freshwater/non-metal/non- plant","653-2",76,0.8351648351648352,"","Daphnia magna","Adults (5 days old)","7 days","LOAEL","Mortality: Survival","7.7 mg/L","Microinvertebrate","Arthropoda","Branchiopoda","0.45 um filtered well water","Not stated","Chronic","6.9 ± 0.1","N.A.","Nebeker,A.V., and G.S. Schuytema (1998). Chronic Effects of the Herbicide Diuron on Freshwater Cladocerans, Amphipods, Midges, Minnows, Worms, and Snails, Arch. Environ. Contam. Toxicol.35(3): 441-446.","653"]
["Freshwater/non-metal/non- plant","653-3",76,0.8351648351648352,"","Daphnia magna","Adults (5 days old)","7 days","NOAEL","Reproduction: Number of young produced","4.0 mg/L","Microinvertebrate","Arthropoda","Branchiopoda","0.45 um filtered well water","Not stated","Chronic","6.9 ± 0.1","N.A.","Nebeker,A.V., and G.S. Schuytema (1998). Chronic Effects of the Herbicide Diuron on Freshwater Cladocerans, Amphipods, Midges, Minnows, Worms, and Snails, Arch. Environ. Contam. Toxicol.35(3): 441-446.","653"]
["Freshwater/non-metal/non- plant","653-4",76,0.8351648351648352,"","Daphnia magna","Adults (5 days old)","7 days","LOAEL","Reproduction: Number of young produced","7.7 mg/L","Microinvertebrate","Arthropoda","Branchiopoda","0.45 um filtered well water","Not stated","Chronic","6.9 ± 0.1","N.A.","Nebeker,A.V., and G.S. Schuytema (1998). Chronic Effects of the Herbicide Diuron on Freshwater Cladocerans, Amphipods, Midges, Minnows, Worms, and Snails, Arch. Environ. Contam. Toxicol.35(3): 441-446.","653"]
["Freshwater/non-metal/non- plant","653-5",76,0.8351648351648352,"","Daphnia magna","Adults (5 days old)","7 days","LC50","Mortality: Survival","7.1 mg/L","Microinvertebrate","Arthropoda","Branchiopoda","0.45 um filtered well water","Not stated","Chronic","6.9 ± 0.1","N.A.","Nebeker,A.V., and G.S. Schuytema (1998). Chronic Effects of the Herbicide Diuron on Freshwater Cladocerans, Amphipods, Midges, Minnows, Worms, and Snails, Arch. Environ. Contam. Toxicol.35(3): 441-446.","653"]
["Freshwater/non-metal/non- plant","653-6",76,0.8351648351648352,"","Daphnia magna","Adults (5 days old)","96 hour","LC50","Mortality: Survival","17.9 mg/L","Microinvertebrate","Arthropoda","Branchiopoda","0.45 um filtered well water","Not stated","Acute ","6.9 ± 0.1","N.A.","Nebeker,A.V., and G.S. Schuytema (1998). Chronic Effects of the Herbicide Diuron on Freshwater Cladocerans, Amphipods, Midges, Minnows, Worms, and Snails, Arch. Environ. Contam. Toxicol.35(3): 441-446.","653"]
["Freshwater/non-metal/non- plant","653-7",77,0.84615384615384615,"","Hyalella azteca","2 day old young","10 days","NOAEL","Mortality: Survival","7.9 mg/L","Macroinvertebrate","Arthropoda","Malacostraca","0.45 um filtered well water","22 C","Acute ","6.9 ± 0.1","N.A.","Nebeker,A.V., and G.S. Schuytema (1998). Chronic Effects of the Herbicide Diuron on Freshwater Cladocerans, Amphipods, Midges, Minnows, Worms, and Snails, Arch. Environ. Contam. Toxicol.35(3): 441-446.","653"]
["Freshwater/non-metal/non- plant","653-8",77,0.84615384615384615,"","Hyalella azteca","2 day old young","10 days","LOAEL","Mortality: Survival","15.7 mg/L","Macroinvertebrate","Arthropoda","Malacostraca","0.45 um filtered well water","22 C","Acute ","6.9 ± 0.1","N.A.","Nebeker,A.V., and G.S. Schuytema (1998). Chronic Effects of the Herbicide Diuron on Freshwater Cladocerans, Amphipods, Midges, Minnows, Worms, and Snails, Arch. Environ. Contam. Toxicol.35(3): 441-446.","653"]
["Freshwater/non-metal/non- plant","653-9",82,0.90109890109890112,"","Hyalella azteca","2 day old young","10 days","NOAEL","Growth: Length","22.9 mg/L","Macroinvertebrate","Arthropoda","Malacostraca","0.45 um filtered well water","22 C","Acute ","6.9 ± 0.1","N.A.","Nebeker,A.V., and G.S. Schuytema (1998). Chronic Effects of the Herbicide Diuron on Freshwater Cladocerans, Amphipods, Midges, Minnows, Worms, and Snails, Arch. Environ. Contam. Toxicol.35(3): 441-446.","653"]
["Freshwater/non-metal/non- plant","653-10",82,0.90109890109890112,"","Hyalella azteca","2 day old young","10 days","NOAEL","Growth: Blotted wet weight","22.9 mg/L","Macroinvertebrate","Arthropoda","Malacostraca","0.45 um filtered well water","22 C","Acute ","6.9 ± 0.1","N.A.","Nebeker,A.V., and G.S. Schuytema (1998). Chronic Effects of the Herbicide Diuron on Freshwater Cladocerans, Amphipods, Midges, Minnows, Worms, and Snails, Arch. Environ. Contam. Toxicol.35(3): 441-446.","653"]
["Freshwater/non-metal/non- plant","653-11",77,0.84615384615384615,"","Hyalella azteca","2 day old young","10 days","LC50","Mortality: Survival","18.4 mg/L","Macroinvertebrate","Arthropoda","Malacostraca","0.45 um filtered well water","22 C","Acute ","6.9 ± 0.1","N.A.","Nebeker,A.V., and G.S. Schuytema (1998). Chronic Effects of the Herbicide Diuron on Freshwater Cladocerans, Amphipods, Midges, Minnows, Worms, and Snails, Arch. Environ. Contam. Toxicol.35(3): 441-446.","653"]
["Freshwater/non-metal/non- plant","653-12",77,0.84615384615384615,"","Hyalella azteca","2 day old young","96 hour","LC50","Mortality: Survival","19.4 mg/L","Macroinvertebrate","Arthropoda","Malacostraca","0.45 um filtered well water","22 C","Acute ","6.9 ± 0.1","N.A.","Nebeker,A.V., and G.S. Schuytema (1998). Chronic Effects of the Herbicide Diuron on Freshwater Cladocerans, Amphipods, Midges, Minnows, Worms, and Snails, Arch. Environ. Contam. Toxicol.35(3): 441-446.","653"]
["Freshwater/non-metal/non- plant","653-13",77,0.84615384615384615,"","Chironomus tentans","1st instar larvae (2 days old)","10 days","NOAEL","Mortality: Survival","1.9 mg/L","Macroinvertebrate","Arthropoda","Insecta","0.45 um filtered well water","24 C","Acute ","6.9 ± 0.1","N.A.","Nebeker,A.V., and G.S. Schuytema (1998). Chronic Effects of the Herbicide Diuron on Freshwater Cladocerans, Amphipods, Midges, Minnows, Worms, and Snails, Arch. Environ. Contam. Toxicol.35(3): 441-446.","653"]
["Freshwater/non-metal/non- plant","653-14",77,0.84615384615384615,"","Chironomus tentans","1st instar larvae (2 days old)","10 days","LOAEL","Mortality: Survival","3.4 mg/L","Macroinvertebrate","Arthropoda","Insecta","0.45 um filtered well water","24 C","Acute ","6.9 ± 0.1","N.A.","Nebeker,A.V., and G.S. Schuytema (1998). Chronic Effects of the Herbicide Diuron on Freshwater Cladocerans, Amphipods, Midges, Minnows, Worms, and Snails, Arch. Environ. Contam. Toxicol.35(3): 441-446.","653"]
["Freshwater/non-metal/non- plant","653-15",77,0.84615384615384615,"","Chironomus tentans","1st instar larvae (2 days old)","10 days","NOAEL","Growth. Larval weight","3.4 mg/L","Macroinvertebrate","Arthropoda","Insecta","0.45 um filtered well water","24 C","Acute ","6.9 ± 0.1","N.A.","Nebeker,A.V., and G.S. Schuytema (1998). Chronic Effects of the Herbicide Diuron on Freshwater Cladocerans, Amphipods, Midges, Minnows, Worms, and Snails, Arch. Environ. Contam. Toxicol.35(3): 441-446.","653"]
["Freshwater/non-metal/non- plant","653-16",77,0.84615384615384615,"","Chironomus tentans","1st instar larvae (2 days old)","10 days","LC50","Mortality: Survival","3.3 mg/L","Macroinvertebrate","Arthropoda","Insecta","0.45 um filtered well water","24 C","Acute ","6.9 ± 0.1","N.A.","Nebeker,A.V., and G.S. Schuytema (1998). Chronic Effects of the Herbicide Diuron on Freshwater Cladocerans, Amphipods, Midges, Minnows, Worms, and Snails, Arch. Environ. Contam. Toxicol.35(3): 441-446.","653"]
["Freshwater/non-metal/non- plant","653-17",76,0.8351648351648352,"","Pimephales promelas","Juveniles (1.5 months)","10 days","NOAEL","Mortality: Survival","20 mg/L","Fish","Chordata","Actinopterygii","0.45 um filtered well water","24 C","Acute ","6.8 ± 0.1","N.A.","Nebeker,A.V., and G.S. Schuytema (1998). Chronic Effects of the Herbicide Diuron on Freshwater Cladocerans, Amphipods, Midges, Minnows, Worms, and Snails, Arch. Environ. Contam. Toxicol.35(3): 441-446.","653"]
["Freshwater/non-metal/non- plant","653-18",76,0.8351648351648352,"","Pimephales promelas","Juveniles (1.5 months)","10 days","LOAEL","Mortality: Survival","27.1 mg/L","Fish","Chordata","Actinopterygii","0.45 um filtered well water","24 C","Acute ","6.8 ± 0.1","N.A.","Nebeker,A.V., and G.S. Schuytema (1998). Chronic Effects of the Herbicide Diuron on Freshwater Cladocerans, Amphipods, Midges, Minnows, Worms, and Snails, Arch. Environ. Contam. Toxicol.35(3): 441-446.","653"]
["Freshwater/non-metal/non- plant","653-19",76,0.8351648351648352,"","Pimephales promelas","Juveniles (1.5 months)","10 days","NOAEL","Growth: Weight","<3.4 mg/L","Fish","Chordata","Actinopterygii","0.45 um filtered well water","24 C","Acute ","6.8 ± 0.1","N.A.","Nebeker,A.V., and G.S. Schuytema (1998). Chronic Effects of the Herbicide Diuron on Freshwater Cladocerans, Amphipods, Midges, Minnows, Worms, and Snails, Arch. Environ. Contam. Toxicol.35(3): 441-446.","653"]
["Freshwater/non-metal/non- plant","653-20",76,0.8351648351648352,"","Pimephales promelas","Juveniles (1.5 months)","10 days","LOAEL","Growth: Weight","3.4 mg/L","Fish","Chordata","Actinopterygii","0.45 um filtered well water","24 C","Acute ","6.8 ± 0.1","N.A.","Nebeker,A.V., and G.S. Schuytema (1998). Chronic Effects of the Herbicide Diuron on Freshwater Cladocerans, Amphipods, Midges, Minnows, Worms, and Snails, Arch. Environ. Contam. Toxicol.35(3): 441-446.","653"]
["Freshwater/non-metal/non- plant","653-21",76,0.8351648351648352,"","Pimephales promelas","Juveniles (1.5 months)","10 days","NOAEL","Growth: Length","<3.4 mg/L","Fish","Chordata","Actinopterygii","0.45 um filtered well water","24 C","Acute ","6.8 ± 0.1","N.A.","Nebeker,A.V., and G.S. Schuytema (1998). Chronic Effects of the Herbicide Diuron on Freshwater Cladocerans, Amphipods, Midges, Minnows, Worms, and Snails, Arch. Environ. Contam. Toxicol.35(3): 441-446.","653"]
["Freshwater/non-metal/non- plant","653-22",76,0.8351648351648352,"","Pimephales promelas","Juveniles (1.5 months)","10 days","LOAEL","Growth: Length","3.4 mg/L","Fish","Chordata","Actinopterygii","0.45 um filtered well water","24 C","Acute ","6.8 ± 0.1","N.A.","Nebeker,A.V., and G.S. Schuytema (1998). Chronic Effects of the Herbicide Diuron on Freshwater Cladocerans, Amphipods, Midges, Minnows, Worms, and Snails, Arch. Environ. Contam. Toxicol.35(3): 441-446.","653"]
["Freshwater/non-metal/non- plant","653-23",76,0.8351648351648352,"","Pimephales promelas","Juveniles (1.5 months)","10 days","LC50","Mortality: Survival","27.1 mg/L","Fish","Chordata","Actinopterygii","0.45 um filtered well water","24 C","Acute ","6.8 ± 0.1","N.A.","Nebeker,A.V., and G.S. Schuytema (1998). Chronic Effects of the Herbicide Diuron on Freshwater Cladocerans, Amphipods, Midges, Minnows, Worms, and Snails, Arch. Environ. Contam. Toxicol.35(3): 441-446.","653"]
["Freshwater/non-metal/non- plant","653-24",72,0.79120879120879117,"","Pimephales promelas","Embryo/larval","7 days","NOAEL","Mortality: Survival","8.3 mg/L","Fish","Chordata","Actinopterygii","0.45 um filtered well water","24 C","Acute ","6.8 ± 0.1","N.A.","Nebeker,A.V., and G.S. Schuytema (1998). Chronic Effects of the Herbicide Diuron on Freshwater Cladocerans, Amphipods, Midges, Minnows, Worms, and Snails, Arch. Environ. Contam. Toxicol.35(3): 441-446.","653"]
["Freshwater/non-metal/non- plant","653-25",72,0.79120879120879117,"","Pimephales promelas","Embryo/larval","7 days","LOAEL","Mortality: Survival","15.1 mg/L","Fish","Chordata","Actinopterygii","0.45 um filtered well water","24 C","Acute ","6.8 ± 0.1","N.A.","Nebeker,A.V., and G.S. Schuytema (1998). Chronic Effects of the Herbicide Diuron on Freshwater Cladocerans, Amphipods, Midges, Minnows, Worms, and Snails, Arch. Environ. Contam. Toxicol.35(3): 441-446.","653"]
["Freshwater/non-metal/non- plant","653-26",72,0.79120879120879117,"","Pimephales promelas","Embryo/larval","7 days","NOAEL","Reproduction: Number of eggs hatched","31.2 mg/L","Fish","Chordata","Actinopterygii","0.45 um filtered well water","24 C","Acute ","6.8 ± 0.1","N.A.","Nebeker,A.V., and G.S. Schuytema (1998). Chronic Effects of the Herbicide Diuron on Freshwater Cladocerans, Amphipods, Midges, Minnows, Worms, and Snails, Arch. Environ. Contam. Toxicol.35(3): 441-446.","653"]
["Freshwater/non-metal/non- plant","653-27",77,0.84615384615384615,"","Pimephales promelas","Embryo/larval","7 days","NOAEL","Growth: Blotted wet weight","15.1 mg/L","Fish","Chordata","Actinopterygii","0.45 um filtered well water","24 C","Acute ","6.8 ± 0.1","N.A.","Nebeker,A.V., and G.S. Schuytema (1998). Chronic Effects of the Herbicide Diuron on Freshwater Cladocerans, Amphipods, Midges, Minnows, Worms, and Snails, Arch. Environ. Contam. Toxicol.35(3): 441-446.","653"]
["Freshwater/non-metal/non- plant","653-28",77,0.84615384615384615,"","Pimephales promelas","Embryo/larval","7 days","NOAEL","Growth: Length","4.2 mg/L","Fish","Chordata","Actinopterygii","0.45 um filtered well water","24 C","Acute ","6.8 ± 0.1","N.A.","Nebeker,A.V., and G.S. Schuytema (1998). Chronic Effects of the Herbicide Diuron on Freshwater Cladocerans, Amphipods, Midges, Minnows, Worms, and Snails, Arch. Environ. Contam. Toxicol.35(3): 441-446.","653"]
["Freshwater/non-metal/non- plant","653-29",77,0.84615384615384615,"","Pimephales promelas","Embryo/larval","7 days","LOAEL","Growth: Length","8.3 mg/L","Fish","Chordata","Actinopterygii","0.45 um filtered well water","24 C","Acute ","6.8 ± 0.1","N.A.","Nebeker,A.V., and G.S. Schuytema (1998). Chronic Effects of the Herbicide Diuron on Freshwater Cladocerans, Amphipods, Midges, Minnows, Worms, and Snails, Arch. Environ. Contam. Toxicol.35(3): 441-446.","653"]
["Freshwater/non-metal/non- plant","653-30",77,0.84615384615384615,"","Pimephales promelas","Embryo/larval","7 days","LC50","Mortality: Survival","11.7 mg/L","Fish","Chordata","Actinopterygii","0.45 um filtered well water","24 C","Acute ","6.8 ± 0.1","N.A.","Nebeker,A.V., and G.S. Schuytema (1998). Chronic Effects of the Herbicide Diuron on Freshwater Cladocerans, Amphipods, Midges, Minnows, Worms, and Snails, Arch. Environ. Contam. Toxicol.35(3): 441-446.","653"]
["Freshwater/non-metal/non- plant","653-31",77,0.84615384615384615,"","Lumbriculus variegatus","Adults","10 days","NOAEL","Mortality: Survival","29.1 mg/L","Macroinvertebrate","Annelida","Clitellata","0.45 um filtered well water","23 C","Acute ","6.8 ± 0.1","N.A.","Nebeker,A.V., and G.S. Schuytema (1998). Chronic Effects of the Herbicide Diuron on Freshwater Cladocerans, Amphipods, Midges, Minnows, Worms, and Snails, Arch. Environ. Contam. Toxicol.35(3): 441-446.","653"]
["Freshwater/non-metal/non- plant","653-32",77,0.84615384615384615,"","Lumbriculus variegatus","Adults","10 days","NOAEL","Growth: Blotted wet weight","1.8 mg/L","Macroinvertebrate","Annelida","Clitellata","0.45 um filtered well water","23 C","Acute ","6.8 ± 0.1","N.A.","Nebeker,A.V., and G.S. Schuytema (1998). Chronic Effects of the Herbicide Diuron on Freshwater Cladocerans, Amphipods, Midges, Minnows, Worms, and Snails, Arch. Environ. Contam. Toxicol.35(3): 441-446.","653"]
["Freshwater/non-metal/non- plant","653-33",77,0.84615384615384615,"","Lumbriculus variegatus","Adults","10 days","LOAEL","Growth: Blotted wet weight","3.5 mg/L","Macroinvertebrate","Annelida","Clitellata","0.45 um filtered well water","23 C","Acute ","6.8 ± 0.1","N.A.","Nebeker,A.V., and G.S. Schuytema (1998). Chronic Effects of the Herbicide Diuron on Freshwater Cladocerans, Amphipods, Midges, Minnows, Worms, and Snails, Arch. Environ. Contam. Toxicol.35(3): 441-446.","653"]
["Freshwater/non-metal/non- plant","653-34",72,0.79120879120879117,"","Physa gyrina","15 day old young","10 days","NOAEL","Mortality: Survival","29.1 mg/L","Macroinvertebrate","Mollusca","Gastropoda","0.45 um filtered well water","23 C","Acute ","6.8 ± 0.1","N.A.","Nebeker,A.V., and G.S. Schuytema (1998). Chronic Effects of the Herbicide Diuron on Freshwater Cladocerans, Amphipods, Midges, Minnows, Worms, and Snails, Arch. Environ. Contam. Toxicol.35(3): 441-446.","653"]
["Freshwater/non-metal/non- plant","653-35",72,0.79120879120879117,"","Physa gyrina","15 day old young","10 days","NOAEL","Growth: Blotted wet weight","13.4 mg/L","Macroinvertebrate","Mollusca","Gastropoda","0.45 um filtered well water","23 C","Acute ","6.8 ± 0.1","N.A.","Nebeker,A.V., and G.S. Schuytema (1998). Chronic Effects of the Herbicide Diuron on Freshwater Cladocerans, Amphipods, Midges, Minnows, Worms, and Snails, Arch. Environ. Contam. Toxicol.35(3): 441-446.","653"]
["Freshwater/non-metal/non- plant","653-36",72,0.79120879120879117,"","Physa gyrina","15 day old young","10 days","LOAEL","Growth: Blotted wet weight","22.8 mg/L","Macroinvertebrate","Mollusca","Gastropoda","0.45 um filtered well water","23 C","Acute ","6.8 ± 0.1","N.A.","Nebeker,A.V., and G.S. Schuytema (1998). Chronic Effects of the Herbicide Diuron on Freshwater Cladocerans, Amphipods, Midges, Minnows, Worms, and Snails, Arch. Environ. Contam. Toxicol.35(3): 441-446.","653"]
["Freshwater/non-metal/non- plant","650-1",76,0.8351648351648352,"","Paratya australiensis","Not stated","96 hour","LC50","Mortality","8800 ug/L","Macroinvertebrate","Arthropoda","Malacostraca","Not stated","23 ± 1","Acute ","7 - 8.5","N.A.","Kumar,A., R. Correll, S. Grocke, and C. Bajet (2010). Toxicity of Selected Pesticides to Freshwater Shrimp, Paratya australiensis (Decapoda: Atyidae): Use of Time Series Acute Toxicity Data to Predict Chronic Lethality, Ecotoxicol. Environ. Saf.73(3): 360-369.","650"]
["Freshwater/non-metal/non- plant","650-2",76,0.8351648351648352,"","Paratya australiensis","Not stated","96 hour","LC10","Mortality","4700 ug/L","Macroinvertebrate","Arthropoda","Malacostraca","Not stated","23 ± 1","Acute ","7 - 8.5","N.A.","Kumar,A., R. Correll, S. Grocke, and C. Bajet (2010). Toxicity of Selected Pesticides to Freshwater Shrimp, Paratya australiensis (Decapoda: Atyidae): Use of Time Series Acute Toxicity Data to Predict Chronic Lethality, Ecotoxicol. Environ. Saf.73(3): 360-369.","650"]
["Freshwater/non-metal/non- plant","650-3",68,0.74725274725274726,"","Paratya australiensis","Not stated","96 hour","NOEC","Mortality","5000 ug/L","Macroinvertebrate","Arthropoda","Malacostraca","Not stated","23 ± 1","Acute ","7 - 8.5","N.A.","Kumar,A., R. Correll, S. Grocke, and C. Bajet (2010). Toxicity of Selected Pesticides to Freshwater Shrimp, Paratya australiensis (Decapoda: Atyidae): Use of Time Series Acute Toxicity Data to Predict Chronic Lethality, Ecotoxicol. Environ. Saf.73(3): 360-369.","650"]
["Freshwater/non-metal/plant","914-1",63,0.71590909090909094,"The highest possible grade for this datum is acceptable.","Selenastrum capricornutum","5 days old","96 hour","IC50","Growth: ChlA","0.05 uM","Microalga","Chlorophyta","Mineral culture medium, freshwater","21°C","21°C","Chronic","Not stated","N.A.","El Jay,A., J.M. Ducruet, J.C. Duval, and J.P. Pelletier, 1997. A High-Sensitivity Chlorophyll Fluorescence Assay for Monitoring Herbicide Inhibition of Photosystem II in the Chlorophyte Selenastrum capricornutum: Comparison with Effect on Cell Growth, Arch. Hydrobiol.140(2): 273-286. ","914","Data failed the acceptability criteria (Q7) are automatically deemed to be of unacceptable quality and must not be used."]
["Freshwater/non-metal/non- plant","993-1",67,0.73626373626373631,"","Ceriodaphnia dubia","<24 hour old neonates","24 hour","EC50","Immobilisation","2300 ug/L","Microinvertebrate","Arthropoda","Branchiopoda","Soft diluted mineral water","25 ± 1 °C","Acute ","Not stated","N.A.","Foster,S., M. Thomas, and W. Korth (1998). Laboratory-Derived Acute Toxicity of Selected Pesticides to Ceriodaphnia dubia, Australas. J. Ecotoxicol.4(1): 53-59.","993","PURITY NOT STATED"]
["Freshwater/non-metal/non- plant","993-2",67,0.73626373626373631,"","Ceriodaphnia dubia","<24 hour old neonates","48 hour","EC50","Immobilisation","1700 ug/L","Microinvertebrate","Arthropoda","Branchiopoda","Soft diluted mineral water","25 ± 1 °C","Acute ","Not stated","N.A.","Foster,S., M. Thomas, and W. Korth (1998). Laboratory-Derived Acute Toxicity of Selected Pesticides to Ceriodaphnia dubia, Australas. J. Ecotoxicol.4(1): 53-59.","993","PURITY NOT STATED"]
["Freshwater/non-metal/non- plant","993-3",67,0.73626373626373631,"","Ceriodaphnia dubia","<24 hour old neonates","24 hour","EC50","Immobilisation","1200 ug/L","Microinvertebrate","Arthropoda","Branchiopoda","Supply water","25 ± 1 °C","Acute ","Not stated","N.A.","Foster,S., M. Thomas, and W. Korth (1998). Laboratory-Derived Acute Toxicity of Selected Pesticides to Ceriodaphnia dubia, Australas. J. Ecotoxicol.4(1): 53-59.","993","PURITY NOT STATED"]
["Freshwater/non-metal/non- plant","993-4",67,0.73626373626373631,"","Ceriodaphnia dubia","<24 hour old neonates","48 hour","EC50","Immobilisation","1000 ug/L","Microinvertebrate","Arthropoda","Branchiopoda","Supply water","25 ± 1 °C","Acute ","Not stated","N.A.","Foster,S., M. Thomas, and W. Korth (1998). Laboratory-Derived Acute Toxicity of Selected Pesticides to Ceriodaphnia dubia, Australas. J. Ecotoxicol.4(1): 53-59.","993","PURITY NOT STATED"]
["Freshwater/non-metal/plant","625-1",48,0.54545454545454541,"The highest possible grade for this datum is acceptable.","Selenastrum capricornutum","Not stated","96 hour","LOEC","Growth Rate: Optical cell density (750 nm)","1.0 uM","Microalga","Chlorophyta","Filter-sterilised double deionized water","25 - 27°C growth chamber","25 - 27°C growth chamber","Chronic","7.6-9.0","N.A.","Schrader,K.K., M.Q. De Regt, P.D. Tidwell, C.S. Tucker, and S.O. Duke (1998). Compounds with Selective Toxicity Towards the Off-Flavor Metabolite-Producing Cyanobacterium Oscillatoria cf. chalybea, Aquaculture163(1-2): 85-99.","625","Data failed the acceptability criteria (Q7) are automatically deemed to be of unacceptable quality and must not be used."]
["Freshwater/non-metal/plant","625-2",48,0.54545454545454541,"The highest possible grade for this datum is acceptable.","Selenastrum capricornutum","Not stated","96 hour","LC50","Mortality","36.4 ug/L","Microalga","Chlorophyta","Filter-sterilised double deionized water","25 - 27°C growth chamber","25 - 27°C growth chamber","Chronic","7.6-9.0","N.A.","Schrader,K.K., M.Q. De Regt, P.D. Tidwell, C.S. Tucker, and S.O. Duke (1998). Compounds with Selective Toxicity Towards the Off-Flavor Metabolite-Producing Cyanobacterium Oscillatoria cf. chalybea, Aquaculture163(1-2): 85-99.","625","Data failed the acceptability criteria (Q7) are automatically deemed to be of unacceptable quality and must not be used."]
["Freshwater/non-metal/plant","625-3",48,0.54545454545454541,"The highest possible grade for this datum is acceptable.","Oscillatoria cf. chalybea","Not stated","96 hour","LOEC","Growth Rate: Optical cell density (750 nm)","1 uM","Microalga","Chlorophyta","Filter-sterilised double deionized water","25 - 27°C growth chamber","25 - 27°C growth chamber","Chronic","7.6-9.0","N.A.","Schrader,K.K., M.Q. De Regt, P.D. Tidwell, C.S. Tucker, and S.O. Duke (1998). Compounds with Selective Toxicity Towards the Off-Flavor Metabolite-Producing Cyanobacterium Oscillatoria cf. chalybea, Aquaculture163(1-2): 85-99.","625","Data failed the acceptability criteria (Q7) are automatically deemed to be of unacceptable quality and must not be used."]
["Freshwater/non-metal/plant","625-4",48,0.54545454545454541,"The highest possible grade for this datum is acceptable.","Oscillatoria cf. chalybea","Not stated","96 hour","LC50","Mortality","28 ug/L","Microalga","Chlorophyta","Filter-sterilised double deionized water","25 - 27°C growth chamber","25 - 27°C growth chamber","Chronic","7.6-9.0","N.A.","Schrader,K.K., M.Q. De Regt, P.D. Tidwell, C.S. Tucker, and S.O. Duke (1998). Compounds with Selective Toxicity Towards the Off-Flavor Metabolite-Producing Cyanobacterium Oscillatoria cf. chalybea, Aquaculture163(1-2): 85-99.","625","Data failed the acceptability criteria (Q7) are automatically deemed to be of unacceptable quality and must not be used."]
["Freshwater/non-metal/plant","626-1",56,0.63636363636363635,"The highest possible grade for this datum is acceptable.","Anabaena doliolum","Exponential growth phase","12 days","IC50","Growth rate: Optical cell density","0.4 ug/ml","Microalga","Cyanobacteria","Allen and Arnon's medium","24 ± 1°C","24 ± 1°C","Chronic","Not stated","N.A.","Singh,D.P., and K. Kshatriya (2002). Characterization of Salinity-Tolerant Mutant of Anabaena doliolum Exhibiting Multiple Stress Tolerance, Curr. Microbiol.45(3): 165-170.","626","Data failed the acceptability criteria (Q7) are automatically deemed to be of unacceptable quality and must not be used.","PURITY NOT STATED"]
["Freshwater/non-metal/non- plant","994-1",60,0.65934065934065933,"The highest possible grade for this datum is acceptable.","Daphnia magna","<24 hour old neonates","48 hour","IC50","Immobilisation","8.6 mg/L","Microinvertebrate","Arthropoda","Branchiopoda","Non-chlorinated tap water and spring water 1:1","20 (+ - 1) C","Acute ","Not stated","N.A.","Hernando,M.D., M. Ejerhoon, A.R. Fernandez-Alba, and Y. Chisti (2003). Combined Toxicity Effects of MTBE and Pesticides Measured with Vibrio fischeri and Daphnia magna Bioassays, Water Res.37(17): 4091-4098.","994"]
["MEW_nonplant","995-1",75,0.7978723404255319,"The highest possible grade for this datum is acceptable.","Paracentrotus lividus","Not stated","48 hour","EC50","Reproduction: Fertilisation rate","5.09 mg/L","Macroinvertebrate","Echinodermata","Echinoidea","Natural filtered seawater (FSW)","18 (+ - 1) C","Acute","8.0 ± 0.2",0.38,"Manzo,S., S. Buono, and C. Cremisini (2006). Toxic Effects of Irgarol and Diuron on Sea Urchin Paracentrotus lividus Early Development, Fertilization, and Offspring Quality, Arch. Environ. Contam. Toxicol.51(1): 61-68. ","995"]
["MEW_nonplant","995-2",70,0.74468085106382975,"The highest possible grade for this datum is acceptable.","Paracentrotus lividus","Not stated","48 hour","NOEC","Reproduction: Fertilisation rate","0.5 mg/L","Macroinvertebrate","Echinodermata","Echinoidea","Natural filtered seawater (FSW)","18 (+ - 1) C","Acute","8.0 ± 0.2",0.38,"Manzo,S., S. Buono, and C. Cremisini (2006). Toxic Effects of Irgarol and Diuron on Sea Urchin Paracentrotus lividus Early Development, Fertilization, and Offspring Quality, Arch. Environ. Contam. Toxicol.51(1): 61-68. ","995"]
["MEW_nonplant","995-3",65,0.69148936170212771,"The highest possible grade for this datum is acceptable.","Paracentrotus lividus","Not stated","48 hour","LOEC","Reproduction: Fertilisation rate","1 mg/L","Macroinvertebrate","Echinodermata","Echinoidea","Natural filtered seawater (FSW)","18 (+ - 1) C","Acute","8.0 ± 0.2",0.38,"Manzo,S., S. Buono, and C. Cremisini (2006). Toxic Effects of Irgarol and Diuron on Sea Urchin Paracentrotus lividus Early Development, Fertilization, and Offspring Quality, Arch. Environ. Contam. Toxicol.51(1): 61-68. ","995"]
["MEW_plant","996-1",60,0.65934065934065933,"The highest possible grade for this datum is acceptable.","Dunaliaella tertiolecta","Exponential growth phase","96 hour","EC50","Population: Growth rate: Growth inhibition","5.9 ug/L","Microalga","Chlorophyta","Chlorophyceae","F2 marine media ","20 ± 1°C","Chronic","Not stated","Not stated","Gatidou,G., and N.S. Thomaidis (2007). Evaluation of Single and Joint Toxic Effects of Two Antifouling Biocides, Their Main Metabolites and Copper Using Phytoplankton Bioassays, Aquat. Toxicol.85(3): 184-191. ","996"]
["Freshwater/non-metal/plant","996-2",55,0.625,"The highest possible grade for this datum is acceptable.","Navicula forcipata","Exponential growth phase","96 hour","EC50","Population: Growth rate: Growth inhibition","27 ug/L","Microalga","Bacillariophyta","Not stated","20 ± 1 °C","20 ± 1 °C","Chronic","Not stated","N.A.","Gatidou,G., and N.S. Thomaidis (2007). Evaluation of Single and Joint Toxic Effects of Two Antifouling Biocides, Their Main Metabolites and Copper Using Phytoplankton Bioassays, Aquat. Toxicol.85(3): 184-191. ","996"]
["MEW_nonplant","997-1",74,0.78723404255319152,"The highest possible grade for this datum is acceptable.","Paracentrotus lividus","not stated","30 minutes","EC50","Reproduction: Fertilisation rate","2.87 mg/L","Macroinvertebrate","Echinodermata","Echinoidea","Natural filtered seawater (FSW)","18 (+ - 1) C","Acute","8.0 ± 0.2",0.38,"Manzo,S., S. Buono, and C. Cremisini (2008).Predictability of Copper, Irgarol, and Diuron Combined Effects on Sea Urchin Paracentrotus lividus, Arch. Environ. Contam. Toxicol.54(1): 57-68. ","997"]
["MEW_nonplant","998-1",81,0.86170212765957444,"The highest possible grade for this datum is acceptable.","Psetta maxima","Embryo","2 days","NOEC","Reproduction: % Hatching success","625 ug/L","Fish","Chordata","Actinopterygii","Natural filtered seawater (FSW)","18 (+ - 1) C","Acute","8.29 ± 0.11","34.20 ± 0.15 ppt","Mhadhbi,L., and R. Beiras (2012). Acute Toxicity of Seven Selected Pesticides (Alachlor, Atrazine, Dieldrin, Diuron, Pirimiphos-Methyl, Chlorpyrifos, Diazinon) to the Marine Fish (Turbot, Psetta maxima), Water Air Soil Pollut.223(9): 5917-5930.","998"]
["MEW_nonplant","998-2",81,0.86170212765957444,"The highest possible grade for this datum is acceptable.","Psetta maxima","Embryo","2 days","LOEC","Reproduction: % Hatching success","1250 ug/L","Fish","Chordata","Actinopterygii","Natural filtered seawater (FSW)","18 (+ - 1) C","Acute","8.29 ± 0.11","34.20 ± 0.15 ppt","Mhadhbi,L., and R. Beiras (2012). Acute Toxicity of Seven Selected Pesticides (Alachlor, Atrazine, Dieldrin, Diuron, Pirimiphos-Methyl, Chlorpyrifos, Diazinon) to the Marine Fish (Turbot, Psetta maxima), Water Air Soil Pollut.223(9): 5917-5930.","998"]
["MEW_nonplant","998-3",81,0.86170212765957444,"The highest possible grade for this datum is acceptable.","Psetta maxima","Larvae 96hr post-hatch","6 days","NOEC","Reproduction: % Hatching success","625 ug/L","Fish","Chordata","Actinopterygii","Natural filtered seawater (FSW)","18 (+ - 1) C","Acute","8.29 ± 0.11","34.20 ± 0.15 ppt","Mhadhbi,L., and R. Beiras (2012). Acute Toxicity of Seven Selected Pesticides (Alachlor, Atrazine, Dieldrin, Diuron, Pirimiphos-Methyl, Chlorpyrifos, Diazinon) to the Marine Fish (Turbot, Psetta maxima), Water Air Soil Pollut.223(9): 5917-5930.","998"]
["MEW_nonplant","998-4",81,0.86170212765957444,"The highest possible grade for this datum is acceptable.","Psetta maxima","Larvae 96hr post-hatch","6 days","LOEC","Reproduction: % Hatching success","1250 ug/L","Fish","Chordata","Actinopterygii","Natural filtered seawater (FSW)","18 (+ - 1) C","Acute","8.29 ± 0.11","34.20 ± 0.15 ppt","Mhadhbi,L., and R. Beiras (2012). Acute Toxicity of Seven Selected Pesticides (Alachlor, Atrazine, Dieldrin, Diuron, Pirimiphos-Methyl, Chlorpyrifos, Diazinon) to the Marine Fish (Turbot, Psetta maxima), Water Air Soil Pollut.223(9): 5917-5930.","998"]
["MEW_nonplant","998-5",86,0.91489361702127658,"The highest possible grade for this datum is acceptable.","Psetta maxima","Embryo","2 days","LC10","Mortality","1396 ug/L","Fish","Chordata","Actinopterygii","Natural filtered seawater (FSW)","18 (+ - 1) C","Acute","8.29 ± 0.11","34.20 ± 0.15 ppt","Mhadhbi,L., and R. Beiras (2012). Acute Toxicity of Seven Selected Pesticides (Alachlor, Atrazine, Dieldrin, Diuron, Pirimiphos-Methyl, Chlorpyrifos, Diazinon) to the Marine Fish (Turbot, Psetta maxima), Water Air Soil Pollut.223(9): 5917-5930.","998"]
["MEW_nonplant","998-6",86,0.91489361702127658,"The highest possible grade for this datum is acceptable.","Psetta maxima","Embryo","2 days","LC50","Mortality","10076 ug/L","Fish","Chordata","Actinopterygii","Natural filtered seawater (FSW)","18 (+ - 1) C","Acute","8.29 ± 0.11","34.20 ± 0.15 ppt","Mhadhbi,L., and R. Beiras (2012). Acute Toxicity of Seven Selected Pesticides (Alachlor, Atrazine, Dieldrin, Diuron, Pirimiphos-Methyl, Chlorpyrifos, Diazinon) to the Marine Fish (Turbot, Psetta maxima), Water Air Soil Pollut.223(9): 5917-5930.","998"]
["MEW_nonplant","998-7",86,0.91489361702127658,"The highest possible grade for this datum is acceptable.","Psetta maxima","Larvae 96hr post-hatch","6 days","LC10","Mortality","1617 ug/L","Fish","Chordata","Actinopterygii","Natural filtered seawater (FSW)","18 (+ - 1) C","Acute","8.29 ± 0.11","34.20 ± 0.15 ppt","Mhadhbi,L., and R. Beiras (2012). Acute Toxicity of Seven Selected Pesticides (Alachlor, Atrazine, Dieldrin, Diuron, Pirimiphos-Methyl, Chlorpyrifos, Diazinon) to the Marine Fish (Turbot, Psetta maxima), Water Air Soil Pollut.223(9): 5917-5930.","998"]
["MEW_nonplant","998-8",86,0.91489361702127658,"The highest possible grade for this datum is acceptable.","Psetta maxima","Larvae 96hr post-hatch","6 days","LC50","Mortality","7826 ug/L","Fish","Chordata","Actinopterygii","Natural filtered seawater (FSW)","18 (+ - 1) C","Acute","8.29 ± 0.11","34.20 ± 0.15 ppt","Mhadhbi,L., and R. Beiras (2012). Acute Toxicity of Seven Selected Pesticides (Alachlor, Atrazine, Dieldrin, Diuron, Pirimiphos-Methyl, Chlorpyrifos, Diazinon) to the Marine Fish (Turbot, Psetta maxima), Water Air Soil Pollut.223(9): 5917-5930.","998"]
["Freshwater/non-metal/plant","1000-1",65,0.73863636363636365,"The highest possible grade for this datum is acceptable.","Scenedesmus vacuolatus","Exponential growth phase","48 hour","EC50","Growth rate: Optical cell density","14.3 ug/L","Microalga","Chlorophyta","Not stated","25°C","25°C","Chronic","Not stated","N.A.","Copin,P.J., and N. Chevre (2015). Modelling the Effects of Pulse Exposure of Several PSII Inhibitors on Two Algae, Chemosphere137:70-77.","1000"]

{"sheet":"Instruction","index":3,"n_rows":21,"n_cols":10,"rows_kept":21,"cut":false,"hidden":false,"merged":[[27,6,27,16],[14,6,14,7],[5,4,5,7]]}
[]
[]
[null,"Click here to see \"All Result\" -->","All Result"]
[]
[]
[null,null,null,null,"Freshwater "]
[]
[null,"Tabs contain questionaries -->           ","Freshwater/metal/nonplant",null,"Freshwater/non-metal/non-plant ",null,null,"Freshwater/metal/plant",null,"Freshwater/non-metal/plant"]
[]
[]
[]
[null,"Tabs contain score of paper and short answers to questions -->","Freshwater/metal/nonplant Worksheet",null,"Freshwater/non-metal/non-plant Worksheet",null,null,"Freshwater/metal/plant Worksheet",null,"Freshwater/non-metal/plant/ Worksheet"]
[]
[]
[null,null,"Marine ",null,null,null,"Terrestrial",null,null,"Sediment "]
[]
[null,"Tab contain questionaries -->","Marine or estuarine/non-plant",null,"Marine or estuarine/Plant",null,null,"Terrestrial Data QA",null,"Sediment Data QA"]
[]
[]
[]
[null,"Tab Contains all scores of paper --> ","Marine or estuarine/non-Plant Worksheet",null,"Marine or estuarine/Plant_Worksheet",null,null,"Terrestrial Quality",null,"Sediment Quality"]

{"sheet":"Sheet1","index":4,"n_rows":70,"n_cols":29,"rows_kept":70,"cut":false,"hidden":true,"merged":[]}
[]
[{"$f":"#REF!","v":{"$error":"#REF!"}},{"$f":"#REF!","v":{"$error":"#REF!"}},{"$f":"#REF!","v":{"$error":"#REF!"}},{"$f":"#REF!","v":{"$error":"#REF!"}},{"$f":"#REF!","v":{"$error":"#REF!"}},{"$f":"#REF!","v":{"$error":"#REF!"}},{"$f":"#REF!","v":{"$error":"#REF!"}},{"$f":"#REF!","v":{"$error":"#REF!"}},{"$f":"#REF!","v":{"$error":"#REF!"}},{"$f":"#REF!","v":{"$error":"#REF!"}},{"$f":"#REF!","v":{"$error":"#REF!"}},{"$f":"#REF!","v":{"$error":"#REF!"}},{"$f":"#REF!","v":{"$error":"#REF!"}},{"$f":"#REF!","v":{"$error":"#REF!"}},{"$f":"#REF!","v":{"$error":"#REF!"}},{"$f":"#REF!","v":{"$error":"#REF!"}},{"$f":"#REF!","v":{"$error":"#REF!"}},{"$f":"#REF!","v":{"$error":"#REF!"}},{"$f":"#REF!","v":{"$error":"#REF!"}},{"$f":"#REF!","v":{"$error":"#REF!"}},{"$f":"#REF!","v":{"$error":"#REF!"}},{"$f":"#REF!","v":{"$error":"#REF!"}},{"$f":"#REF!","v":{"$error":"#REF!"}},{"$f":"#REF!","v":{"$error":"#REF!"}},{"$f":"#REF!","v":{"$error":"#REF!"}},{"$f":"#REF!","v":{"$error":"#REF!"}}]
[{"$f":"#REF!","v":{"$error":"#REF!"}},{"$f":"#REF!","v":{"$error":"#REF!"}},{"$f":"#REF!","v":{"$error":"#REF!"}},{"$f":"#REF!","v":{"$error":"#REF!"}}]
[{"$f":"#REF!","v":{"$error":"#REF!"}},{"$f":"#REF!","v":{"$error":"#REF!"}},{"$f":"#REF!","v":{"$error":"#REF!"}},{"$f":"#REF!","v":{"$error":"#REF!"}},{"$f":"#REF!","v":{"$error":"#REF!"}},{"$f":"#REF!","v":{"$error":"#REF!"}},{"$f":"#REF!","v":{"$error":"#REF!"}},{"$f":"#REF!","v":{"$error":"#REF!"}},{"$f":"#REF!","v":{"$error":"#REF!"}},{"$f":"#REF!","v":{"$error":"#REF!"}},{"$f":"#REF!","v":{"$error":"#REF!"}},{"$f":"#REF!","v":{"$error":"#REF!"}},{"$f":"#REF!","v":{"$error":"#REF!"}},{"$f":"#REF!","v":{"$error":"#REF!"}},{"$f":"#REF!","v":{"$error":"#REF!"}},{"$f":"#REF!","v":{"$error":"#REF!"}},{"$f":"#REF!","v":{"$error":"#REF!"}},{"$f":"#REF!","v":{"$error":"#REF!"}},{"$f":"#REF!","v":{"$error":"#REF!"}},{"$f":"#REF!","v":{"$error":"#REF!"}},{"$f":"#REF!","v":{"$error":"#REF!"}},{"$f":"#REF!","v":{"$error":"#REF!"}},{"$f":"#REF!","v":{"$error":"#REF!"}},{"$f":"#REF!","v":{"$error":"#REF!"}},{"$f":"#REF!","v":{"$error":"#REF!"}},{"$f":"#REF!","v":{"$error":"#REF!"}}]
["Answers",{"$f":"IF(#REF!=0,\"\",#REF!)","v":{"$error":"#REF!"}},{"$f":"IF(#REF!=0,\"\",#REF!)","v":{"$error":"#REF!"}},{"$f":"IF(#REF!=0,\"\",#REF!)","v":{"$error":"#REF!"}},{"$f":"IF(#REF!=0,\"\",#REF!)","v":{"$error":"#REF!"}},{"$f":"IF(#REF!=0,\"\",#REF!)","v":{"$error":"#REF!"}},{"$f":"IF(#REF!=0,\"\",#REF!)","v":{"$error":"#REF!"}},{"$f":"IF(#REF!=0,\"\",#REF!)","v":{"$error":"#REF!"}},{"$f":"IF(#REF!=0,\"\",#REF!)","v":{"$error":"#REF!"}},{"$f":"IF(#REF!=0,\"\",#REF!)","v":{"$error":"#REF!"}},{"$f":"IF(#REF!=0,\"\",#REF!)","v":{"$error":"#REF!"}},{"$f":"IF(#REF!=0,\"\",#REF!)","v":{"$error":"#REF!"}},{"$f":"IF(#REF!=0,\"\",#REF!)","v":{"$error":"#REF!"}},{"$f":"IF(#REF!=0,\"\",#REF!)","v":{"$error":"#REF!"}},{"$f":"IF(#REF!=0,\"\",#REF!)","v":{"$error":"#REF!"}},{"$f":"IF(#REF!=0,\"\",#REF!)","v":{"$error":"#REF!"}},{"$f":"IF(#REF!=0,\"\",#REF!)","v":{"$error":"#REF!"}},{"$f":"IF(#REF!=0,\"\",#REF!)","v":{"$error":"#REF!"}},{"$f":"IF(#REF!=0,\"\",#REF!)","v":{"$error":"#REF!"}},{"$f":"IF(#REF!=0,\"\",#REF!)","v":{"$error":"#REF!"}},{"$f":"IF(#REF!=0,\"\",#REF!)","v":{"$error":"#REF!"}},{"$f":"IF(#REF!=0,\"\",#REF!)","v":{"$error":"#REF!"}},{"$f":"IF(#REF!=0,\"\",#REF!)","v":{"$error":"#REF!"}},{"$f":"IF(#REF!=0,\"\",#REF!)","v":{"$error":"#REF!"}}]
[{"$f":"#REF!","v":{"$error":"#REF!"}},{"$f":"#REF!","v":{"$error":"#REF!"}},{"$f":"#REF!","v":{"$error":"#REF!"}},{"$f":"#REF!","v":{"$error":"#REF!"}},{"$f":"#REF!","v":{"$error":"#REF!"}},{"$f":"#REF!","v":{"$error":"#REF!"}},{"$f":"#REF!","v":{"$error":"#REF!"}},{"$f":"#REF!","v":{"$error":"#REF!"}}]
[{"$f":"#REF!","v":{"$error":"#REF!"}},{"$f":"#REF!","v":{"$error":"#REF!"}},{"$f":"#REF!","v":{"$error":"#REF!"}},{"$f":"#REF!","v":{"$error":"#REF!"}},{"$f":"#REF!","v":{"$error":"#REF!"}},{"$f":"IF(#REF!=0,\"\",#REF!)","v":{"$error":"#REF!"}},{"$f":"IF(#REF!=0,\"\",#REF!)","v":{"$error":"#REF!"}},{"$f":"IF(#REF!=0,\"\",#REF!)","v":{"$error":"#REF!"}}]
[]
[]
[]
[{"$f":"#REF!","v":{"$error":"#REF!"}},{"$f":"#REF!","v":{"$error":"#REF!"}},{"$f":"#REF!","v":{"$error":"#REF!"}},{"$f":"#REF!","v":{"$error":"#REF!"}},{"$f":"#REF!","v":{"$error":"#REF!"}},{"$f":"#REF!","v":{"$error":"#REF!"}},{"$f":"#REF!","v":{"$error":"#REF!"}},{"$f":"#REF!","v":{"$error":"#REF!"}},{"$f":"#REF!","v":{"$error":"#REF!"}},{"$f":"#REF!","v":{"$error":"#REF!"}},{"$f":"#REF!","v":{"$error":"#REF!"}},{"$f":"#REF!","v":{"$error":"#REF!"}},{"$f":"#REF!","v":{"$error":"#REF!"}},{"$f":"#REF!","v":{"$error":"#REF!"}},{"$f":"#REF!","v":{"$error":"#REF!"}},{"$f":"#REF!","v":{"$error":"#REF!"}},{"$f":"#REF!","v":{"$error":"#REF!"}},{"$f":"#REF!","v":{"$error":"#REF!"}},{"$f":"#REF!","v":{"$error":"#REF!"}},{"$f":"#REF!","v":{"$error":"#REF!"}},{"$f":"#REF!","v":{"$error":"#REF!"}},{"$f":"#REF!","v":{"$error":"#REF!"}},{"$f":"#REF!","v":{"$error":"#REF!"}},{"$f":"#REF!","v":{"$error":"#REF!"}},{"$f":"#REF!","v":{"$error":"#REF!"}},{"$f":"#REF!","v":{"$error":"#REF!"}},{"$f":"#REF!","v":{"$error":"#REF!"}}]
[{"$f":"#REF!","v":{"$error":"#REF!"}},{"$f":"#REF!","v":{"$error":"#REF!"}},{"$f":"#REF!","v":{"$error":"#REF!"}},{"$f":"#REF!","v":{"$error":"#REF!"}}]
[{"$f":"#REF!","v":{"$error":"#REF!"}},{"$f":"#REF!","v":{"$error":"#REF!"}},{"$f":"#REF!","v":{"$error":"#REF!"}},{"$f":"#REF!","v":{"$error":"#REF!"}},{"$f":"#REF!","v":{"$error":"#REF!"}},{"$f":"#REF!","v":{"$error":"#REF!"}},{"$f":"#REF!","v":{"$error":"#REF!"}},{"$f":"#REF!","v":{"$error":"#REF!"}},{"$f":"#REF!","v":{"$error":"#REF!"}},{"$f":"#REF!","v":{"$error":"#REF!"}},{"$f":"#REF!","v":{"$error":"#REF!"}},{"$f":"#REF!","v":{"$error":"#REF!"}},{"$f":"#REF!","v":{"$error":"#REF!"}},{"$f":"#REF!","v":{"$error":"#REF!"}},{"$f":"#REF!","v":{"$error":"#REF!"}},{"$f":"#REF!","v":{"$error":"#REF!"}},{"$f":"#REF!","v":{"$error":"#REF!"}},{"$f":"#REF!","v":{"$error":"#REF!"}},{"$f":"#REF!","v":{"$error":"#REF!"}},{"$f":"#REF!","v":{"$error":"#REF!"}},{"$f":"#REF!","v":{"$error":"#REF!"}},{"$f":"#REF!","v":{"$error":"#REF!"}},{"$f":"#REF!","v":{"$error":"#REF!"}},{"$f":"#REF!","v":{"$error":"#REF!"}},{"$f":"#REF!","v":{"$error":"#REF!"}},{"$f":"#REF!","v":{"$error":"#REF!"}},{"$f":"#REF!","v":{"$error":"#REF!"}}]
[{"$f":"#REF!","v":{"$error":"#REF!"}},{"$f":"IF(#REF!=0,\"\",#REF!)","v":{"$error":"#REF!"}},{"$f":"IF(#REF!=0,\"\",#REF!)","v":{"$error":"#REF!"}},{"$f":"IF(#REF!=0,\"\",#REF!)","v":{"$error":"#REF!"}},{"$f":"IF(#REF!=0,\"\",#REF!)","v":{"$error":"#REF!"}},null,{"$f":"IF(#REF!=0,\"\",#REF!)","v":{"$error":"#REF!"}},{"$f":"IF(#REF!=0,\"\",#REF!)","v":{"$error":"#REF!"}},{"$f":"IF(#REF!=0,\"\",#REF!)","v":{"$error":"#REF!"}},{"$f":"IF(#REF!=0,\"\",#REF!)","v":{"$error":"#REF!"}},{"$f":"IF(#REF!=0,\"\",#REF!)","v":{"$error":"#REF!"}},{"$f":"IF(#REF!=0,\"\",#REF!)","v":{"$error":"#REF!"}},{"$f":"IF(#REF!=0,\"\",#REF!)","v":{"$error":"#REF!"}},{"$f":"IF(#REF!=0,\"\",#REF!)","v":{"$error":"#REF!"}},{"$f":"IF(#REF!=0,\"\",#REF!)","v":{"$error":"#REF!"}},{"$f":"IF(#REF!=0,\"\",#REF!)","v":{"$error":"#REF!"}},{"$f":"IF(#REF!=0,\"\",#REF!)","v":{"$error":"#REF!"}},{"$f":"IF(#REF!=0,\"\",#REF!)","v":{"$error":"#REF!"}},{"$f":"IF(#REF!=0,\"\",#REF!)","v":{"$error":"#REF!"}},{"$f":"IF(#REF!=0,\"\",#REF!)","v":{"$error":"#REF!"}},{"$f":"IF(#REF!=0,\"\",#REF!)","v":{"$error":"#REF!"}},{"$f":"IF(#REF!=0,\"\",#REF!)","v":{"$error":"#REF!"}},{"$f":"IF(#REF!=0,\"\",#REF!)","v":{"$error":"#REF!"}},{"$f":"IF(#REF!=0,\"\",#REF!)","v":{"$error":"#REF!"}},{"$f":"IF(#REF!=0,\"\",#REF!)","v":{"$error":"#REF!"}}]
[{"$f":"#REF!","v":{"$error":"#REF!"}},{"$f":"#REF!","v":{"$error":"#REF!"}},{"$f":"#REF!","v":{"$error":"#REF!"}},{"$f":"#REF!","v":{"$error":"#REF!"}},{"$f":"#REF!","v":{"$error":"#REF!"}},{"$f":"#REF!","v":{"$error":"#REF!"}},{"$f":"#REF!","v":{"$error":"#REF!"}},{"$f":"#REF!","v":{"$error":"#REF!"}}]
[{"$f":"#REF!","v":{"$error":"#REF!"}},{"$f":"#REF!","v":{"$error":"#REF!"}},{"$f":"#REF!","v":{"$error":"#REF!"}},{"$f":"#REF!","v":{"$error":"#REF!"}},{"$f":"#REF!","v":{"$error":"#REF!"}},{"$f":"IF(#REF!=0,\"\",#REF!)","v":{"$error":"#REF!"}},{"$f":"IF(#REF!=0,\"\",#REF!)","v":{"$error":"#REF!"}},{"$f":"IF(#REF!=0,\"\",#REF!)","v":{"$error":"#REF!"}}]
[]
[]
[]
[{"$f":"'Terrestrial Data QA'!B11","v":"No."},{"$f":"'Terrestrial Data QA'!B13","v":1},{"$f":"'Terrestrial Data QA'!B16","v":2},{"$f":"'Terrestrial Data QA'!B19","v":3},{"$f":"'Terrestrial Data QA'!B21","v":4},{"$f":"'Terrestrial Data QA'!B23","v":5},{"$f":"'Terrestrial Data QA'!B26","v":6},{"$f":"'Terrestrial Data QA'!B29","v":7},{"$f":"'Terrestrial Data QA'!B32","v":8},{"$f":"'Terrestrial Data QA'!B35","v":9},{"$f":"'Terrestrial Data QA'!B39","v":10},{"$f":"'Terrestrial Data QA'!B42","v":11},{"$f":"'Terrestrial Data QA'!B45","v":12},{"$f":"'Terrestrial Data QA'!B48","v":13},{"$f":"'Terrestrial Data QA'!B50","v":14},{"$f":"'Terrestrial Data QA'!B55","v":15.1},{"$f":"'Terrestrial Data QA'!B59","v":15.2},{"$f":"'Terrestrial Data QA'!B63","v":15.3},{"$f":"'Terrestrial Data QA'!B67","v":15.4},{"$f":"'Terrestrial Data QA'!B71","v":16},{"$f":"'Terrestrial Data QA'!B74","v":17},{"$f":"'Terrestrial Data QA'!B78","v":18},{"$f":"'Terrestrial Data QA'!B82","v":19},{"$f":"'Terrestrial Data QA'!B85","v":20},{"$f":"'Terrestrial Data QA'!C90","v":"Total Score"},{"$f":"'Terrestrial Data QA'!C92","v":"Quality Score"}]
[{"$f":"'Terrestrial Data QA'!C2","v":"Category"},{"$f":"'Terrestrial Data QA'!E2","v":"Terrestrial Quality"},{"$f":"'Terrestrial Data QA'!C3","v":"Paper and data unique identifier(eg. 1-1,10-150)"},{"$f":"'Terrestrial Data QA'!E3","v":0}]
[{"$f":"'Terrestrial Data QA'!G11","v":"Scores"},{"$f":"'Terrestrial Data QA'!G12","v":0},{"$f":"'Terrestrial Data QA'!G15","v":0},{"$f":"'Terrestrial Data QA'!G18","v":0},{"$f":"'Terrestrial Data QA'!G21","v":0},{"$f":"'Terrestrial Data QA'!G23","v":0},{"$f":"'Terrestrial Data QA'!G26","v":0},{"$f":"'Terrestrial Data QA'!G29","v":0},{"$f":"'Terrestrial Data QA'!G32","v":0},{"$f":"'Terrestrial Data QA'!G35","v":0},{"$f":"'Terrestrial Data QA'!G38","v":0},{"$f":"'Terrestrial Data QA'!G41","v":0},{"$f":"'Terrestrial Data QA'!G44","v":0},{"$f":"'Terrestrial Data QA'!G47","v":0},{"$f":"'Terrestrial Data QA'!G50","v":0},{"$f":"'Terrestrial Data QA'!G54","v":0},{"$f":"'Terrestrial Data QA'!G58","v":0},{"$f":"'Terrestrial Data QA'!G62","v":0},{"$f":"'Terrestrial Data QA'!G66","v":0},{"$f":"'Terrestrial Data QA'!G70","v":0},{"$f":"'Terrestrial Data QA'!G73","v":0},{"$f":"'Terrestrial Data QA'!G77","v":0},{"$f":"'Terrestrial Data QA'!G81","v":0},{"$f":"'Terrestrial Data QA'!G84","v":0},{"$f":"'Terrestrial Data QA'!G90","v":""},{"$f":"'Terrestrial Data QA'!G92","v":{"$error":"#N/A"}}]
[{"$f":"'Terrestrial Data QA'!H11","v":"Answers"},{"$f":"IF('Terrestrial Data QA'!H12=0,\"\",'Terrestrial Data QA'!H12)","v":""},{"$f":"IF('Terrestrial Data QA'!H15=0,\"\",'Terrestrial Data QA'!H15)","v":""},{"$f":"IF('Terrestrial Data QA'!H18=0,\"\",'Terrestrial Data QA'!H18)","v":""},{"$f":"IF('Terrestrial Data QA'!H21=0,\"\",'Terrestrial Data QA'!H21)","v":""},{"$f":"IF('Terrestrial Data QA'!H23=0,\"\",'Terrestrial Data QA'!H23)","v":""},{"$f":"IF('Terrestrial Data QA'!H26=0,\"\",'Terrestrial Data QA'!H26)","v":""},{"$f":"IF('Terrestrial Data QA'!H29=0,\"\",'Terrestrial Data QA'!H29)","v":""},{"$f":"IF('Terrestrial Data QA'!H32=0,\"\",'Terrestrial Data QA'!H32)","v":""},{"$f":"IF('Terrestrial Data QA'!H35=0,\"\",'Terrestrial Data QA'!H35)","v":""},{"$f":"IF('Terrestrial Data QA'!H38=0,\"\",'Terrestrial Data QA'!H38)","v":""},{"$f":"IF('Terrestrial Data QA'!H41=0,\"\",'Terrestrial Data QA'!H41)","v":""},{"$f":"IF('Terrestrial Data QA'!H44=0,\"\",'Terrestrial Data QA'!H44)","v":""},{"$f":"IF('Terrestrial Data QA'!H47=0,\"\",'Terrestrial Data QA'!H47)","v":""},{"$f":"IF('Terrestrial Data QA'!H50=0,\"\",'Terrestrial Data QA'!H50)","v":""},{"$f":"IF('Terrestrial Data QA'!H54=0,\"\",'Terrestrial Data QA'!H54)","v":""},{"$f":"IF('Terrestrial Data QA'!H58=0,\"\",'Terrestrial Data QA'!H58)","v":""},{"$f":"IF('Terrestrial Data QA'!H62=0,\"\",'Terrestrial Data QA'!H62)","v":""},{"$f":"IF('Terrestrial Data QA'!H66=0,\"\",'Terrestrial Data QA'!H66)","v":""},{"$f":"IF('Terrestrial Data QA'!H70=0,\"\",'Terrestrial Data QA'!H70)","v":""},{"$f":"IF('Terrestrial Data QA'!H73=0,\"\",'Terrestrial Data QA'!H73)","v":""},{"$f":"IF('Terrestrial Data QA'!H77=0,\"\",'Terrestrial Data QA'!H77)","v":""},{"$f":"IF('Terrestrial Data QA'!H81=0,\"\",'Terrestrial Data QA'!H81)","v":""},{"$f":"IF('Terrestrial Data QA'!H84=0,\"\",'Terrestrial Data QA'!H84)","v":""}]
[{"$f":"'Terrestrial Data QA'!G3","v":"Species (Scientific name)"},{"$f":"'Terrestrial Data QA'!G4","v":"Lifestage"},{"$f":"'Terrestrial Data QA'!G5","v":"Exposure duration"},{"$f":"'Terrestrial Data QA'!G6","v":"Measure of toxicity"},{"$f":"'Terrestrial Data QA'!G7","v":"Toxicity endpoint"},{"$f":"'Terrestrial Data QA'!G8","v":"Toxicity value"},{"$f":"'Terrestrial Data QA'!C4","v":"Citation"},{"$f":"'Terrestrial Data QA'!G2","v":"Citation No."}]
[{"$f":"'Terrestrial Data QA'!M3","v":""},{"$f":"'Terrestrial Data QA'!P3","v":""},{"$f":"'Terrestrial Data QA'!S3","v":""},{"$f":"'Terrestrial Data QA'!V3","v":""},{"$f":"'Terrestrial Data QA'!Y3","v":""},{"$f":"IF('Terrestrial Data QA'!H8=0,\"\",'Terrestrial Data QA'!H8)","v":""},{"$f":"IF('Terrestrial Data QA'!E4=0,\"\",'Terrestrial Data QA'!E4)","v":""},{"$f":"IF('Terrestrial Data QA'!H2=0,\"\",'Terrestrial Data QA'!H2)","v":""}]
[]
[]
[]
[{"$f":"'Sediment Data QA'!B11","v":"No."},{"$f":"'Sediment Data QA'!B13","v":1},{"$f":"'Sediment Data QA'!B16","v":2},{"$f":"'Sediment Data QA'!B19","v":3},{"$f":"'Sediment Data QA'!B21","v":4},{"$f":"'Sediment Data QA'!B23","v":5},{"$f":"'Sediment Data QA'!B26","v":6},{"$f":"'Sediment Data QA'!B29","v":7},{"$f":"'Sediment Data QA'!B32","v":8},{"$f":"'Sediment Data QA'!B35","v":9},{"$f":"'Sediment Data QA'!B39","v":10},{"$f":"'Sediment Data QA'!B42","v":11},{"$f":"'Sediment Data QA'!B45","v":12},{"$f":"'Sediment Data QA'!B48","v":13},{"$f":"'Sediment Data QA'!B51","v":14},{"$f":"'Sediment Data QA'!B53","v":15},{"$f":"'Sediment Data QA'!B58","v":16.100000000000001},{"$f":"'Sediment Data QA'!B62","v":16.2},{"$f":"'Sediment Data QA'!B66","v":16.3},{"$f":"'Sediment Data QA'!B70","v":16.399999999999999},{"$f":"'Sediment Data QA'!B74","v":16.5},{"$f":"'Sediment Data QA'!B78","v":16.600000000000001},{"$f":"'Sediment Data QA'!B82","v":17},{"$f":"'Sediment Data QA'!B85","v":18},{"$f":"'Sediment Data QA'!B88","v":19},{"$f":"'Sediment Data QA'!B90","v":20},{"$f":"'Sediment Data QA'!B92","v":21},{"$f":"'Sediment Data QA'!C95","v":"Total score"},{"$f":"'Sediment Data QA'!C97","v":"Quality Score"}]
[{"$f":"'Sediment Data QA'!C2","v":"Category"},{"$f":"'Sediment Data QA'!E2","v":"Sediment "},{"$f":"'Sediment Data QA'!C3","v":"Paper and data unique identifier(eg. 1-1,10-150)"},{"$f":"'Sediment Data QA'!E3","v":0}]
[{"$f":"'Sediment Data QA'!G11","v":"Scores"},{"$f":"'Sediment Data QA'!G12","v":0},{"$f":"'Sediment Data QA'!G15","v":0},{"$f":"'Sediment Data QA'!G18","v":0},{"$f":"'Sediment Data QA'!G21","v":0},{"$f":"'Sediment Data QA'!G23","v":0},{"$f":"'Sediment Data QA'!G26","v":0},{"$f":"'Sediment Data QA'!G29","v":0},{"$f":"'Sediment Data QA'!G32","v":0},{"$f":"'Sediment Data QA'!G35","v":0},{"$f":"'Sediment Data QA'!G38","v":0},{"$f":"'Sediment Data QA'!G41","v":0},{"$f":"'Sediment Data QA'!G44","v":0},{"$f":"'Sediment Data QA'!G47","v":0},{"$f":"'Sediment Data QA'!G50","v":0},{"$f":"'Sediment Data QA'!G53","v":0},{"$f":"'Sediment Data QA'!G57","v":0},{"$f":"'Sediment Data QA'!G61","v":0},{"$f":"'Sediment Data QA'!G65","v":0},{"$f":"'Sediment Data QA'!G69","v":0},{"$f":"'Sediment Data QA'!G73","v":0},{"$f":"'Sediment Data QA'!G77","v":0},{"$f":"'Sediment Data QA'!G81","v":0},{"$f":"'Sediment Data QA'!G84","v":0},{"$f":"'Sediment Data QA'!G88","v":0},{"$f":"'Sediment Data QA'!G90","v":0},{"$f":"'Sediment Data QA'!G92","v":0},{"$f":"'Sediment Data QA'!G95","v":""},{"$f":"'Sediment Data QA'!G97","v":{"$error":"#N/A"}}]
[{"$f":"'Sediment Data QA'!H11","v":"Answers"},{"$f":"IF('Sediment Data QA'!H12=\"\",\"\",'Sediment Data QA'!H12)","v":""},{"$f":"IF('Sediment Data QA'!H15=\"\",\"\",'Sediment Data QA'!H15)","v":""},{"$f":"IF('Sediment Data QA'!H18=\"\",\"\",'Sediment Data QA'!H18)","v":""},{"$f":"IF('Sediment Data QA'!H21=\"\",\"\",'Sediment Data QA'!H21)","v":""},{"$f":"IF('Sediment Data QA'!H23=\"\",\"\",'Sediment Data QA'!H23)","v":""},{"$f":"IF('Sediment Data QA'!H26=\"\",\"\",'Sediment Data QA'!H26)","v":""},{"$f":"IF('Sediment Data QA'!H29=\"\",\"\",'Sediment Data QA'!H29)","v":""},{"$f":"IF('Sediment Data QA'!H32=\"\",\"\",'Sediment Data QA'!H32)","v":""},{"$f":"IF('Sediment Data QA'!H35=\"\",\"\",'Sediment Data QA'!H35)","v":""},{"$f":"IF('Sediment Data QA'!H38=\"\",\"\",'Sediment Data QA'!H38)","v":""},{"$f":"IF('Sediment Data QA'!H41=\"\",\"\",'Sediment Data QA'!H41)","v":""},{"$f":"IF('Sediment Data QA'!H44=\"\",\"\",'Sediment Data QA'!H44)","v":""},{"$f":"IF('Sediment Data QA'!H47=\"\",\"\",'Sediment Data QA'!H47)","v":""},{"$f":"IF('Sediment Data QA'!H50=\"\",\"\",'Sediment Data QA'!H50)","v":""},{"$f":"IF('Sediment Data QA'!H53=\"\",\"\",'Sediment Data QA'!H53)","v":""},{"$f":"IF('Sediment Data QA'!H57=\"\",\"\",'Sediment Data QA'!H57)","v":""},{"$f":"IF('Sediment Data QA'!H61=\"\",\"\",'Sediment Data QA'!H61)","v":""},{"$f":"IF('Sediment Data QA'!H65=\"\",\"\",'Sediment Data QA'!H65)","v":""},{"$f":"IF('Sediment Data QA'!H69=\"\",\"\",'Sediment Data QA'!H69)","v":""},{"$f":"IF('Sediment Data QA'!H73=\"\",\"\",'Sediment Data QA'!H73)","v":""},{"$f":"IF('Sediment Data QA'!H77=\"\",\"\",'Sediment Data QA'!H77)","v":""},{"$f":"IF('Sediment Data QA'!H81=\"\",\"\",'Sediment Data QA'!H81)","v":""},{"$f":"IF('Sediment Data QA'!H84=\"\",\"\",'Sediment Data QA'!H84)","v":""},{"$f":"IF('Sediment Data QA'!H88=\"\",\"\",'Sediment Data QA'!H88)","v":""},{"$f":"IF('Sediment Data QA'!H90=\"\",\"\",'Sediment Data QA'!H90)","v":""},{"$f":"IF('Sediment Data QA'!H92=\"\",\"\",'Sediment Data QA'!H92)","v":""}]
[{"$f":"'Sediment Data QA'!G3","v":"Species (Scientific name)"},{"$f":"'Sediment Data QA'!G4","v":"Lifestage"},{"$f":"'Sediment Data QA'!G5","v":"Exposure duration"},{"$f":"'Sediment Data QA'!G6","v":"Measure of toxicity"},{"$f":"'Sediment Data QA'!G7","v":"Toxicity endpoint"},{"$f":"'Sediment Data QA'!G8","v":"Toxicity value"},{"$f":"'Sediment Data QA'!C4","v":"Citation"},{"$f":"'Sediment Data QA'!G2","v":"Citation No."}]
[{"$f":"'Sediment Data QA'!M3","v":""},{"$f":"'Sediment Data QA'!P3","v":""},{"$f":"'Sediment Data QA'!S3","v":""},{"$f":"'Sediment Data QA'!V3","v":""},{"$f":"'Sediment Data QA'!Y3","v":""},{"$f":"IF('Sediment Data QA'!H8=\"\",\"\",'Sediment Data QA'!H8)","v":""},{"$f":"IF('Sediment Data QA'!E4=\"\",\"\",'Sediment Data QA'!E4)","v":""},{"$f":"IF('Sediment Data QA'!H2=\"\",\"\",'Sediment Data QA'!H2)","v":0}]
[{"$f":"'FW nonmetal plant'!B11","v":"No."},{"$f":"'FW nonmetal plant'!B13","v":1},{"$f":"'FW nonmetal plant'!B16","v":2},{"$f":"'FW nonmetal plant'!B19","v":3},{"$f":"'FW nonmetal plant'!B21","v":4},{"$f":"'FW nonmetal plant'!B23","v":5},{"$f":"'FW nonmetal plant'!B26","v":6},{"$f":"'FW nonmetal plant'!B29","v":7},{"$f":"'FW nonmetal plant'!B32","v":8},{"$f":"'FW nonmetal plant'!B35","v":9},{"$f":"'FW nonmetal plant'!B39","v":10},{"$f":"'FW nonmetal plant'!B42","v":11},{"$f":"'FW nonmetal plant'!B45","v":12},{"$f":"'FW nonmetal plant'!B48","v":13},{"$f":"'FW nonmetal plant'!B51","v":14},{"$f":"'FW nonmetal plant'!B53","v":15},{"$f":"'FW nonmetal plant'!B58","v":16.100000000000001},{"$f":"'FW nonmetal plant'!B62","v":17},{"$f":"'FW nonmetal plant'!B65","v":18},{"$f":"'FW nonmetal plant'!C70","v":"Total score"},{"$f":"'FW nonmetal plant'!C72","v":"Quality Score"}]
[{"$f":"'FW nonmetal plant'!C2","v":"Category"},{"$f":"'FW nonmetal plant'!E2","v":"Freshwater/non-metal/plant"},{"$f":"'FW nonmetal plant'!C3","v":"Paper and data unique identifier(eg. 1-1,10-150)"},{"$f":"'FW nonmetal plant'!E3","v":"1000-1"}]
[{"$f":"'FW nonmetal plant'!G11","v":"Scores"},{"$f":"'FW nonmetal plant'!G12","v":10},{"$f":"'FW nonmetal plant'!G15","v":10},{"$f":"'FW nonmetal plant'!G18","v":5},{"$f":"'FW nonmetal plant'!G21","v":5},{"$f":"'FW nonmetal plant'!G23","v":5},{"$f":"'FW nonmetal plant'!G26","v":5},{"$f":"'FW nonmetal plant'!G29","v":2},{"$f":"'FW nonmetal plant'!G32","v":5},{"$f":"'FW nonmetal plant'!G35","v":0},{"$f":"'FW nonmetal plant'!G38","v":0},{"$f":"'FW nonmetal plant'!G41","v":0},{"$f":"'FW nonmetal plant'!G44","v":0},{"$f":"'FW nonmetal plant'!G47","v":4},{"$f":"'FW nonmetal plant'!G50","v":4},{"$f":"'FW nonmetal plant'!G53","v":4},{"$f":"'FW nonmetal plant'!G57","v":0},{"$f":"'FW nonmetal plant'!G61","v":3},{"$f":"'FW nonmetal plant'!G64","v":3},{"$f":"'FW nonmetal plant'!G70","v":65},{"$f":"'FW nonmetal plant'!G72","v":0.73863636363636365},{"$f":"'FW nonmetal plant'!H72","v":"The highest possible grade for this datum is acceptable."}]
[{"$f":"'FW nonmetal plant'!H11","v":"Answers"},{"$f":"IF('FW nonmetal plant'!H12=\"\",\"\",'FW nonmetal plant'!H12)","v":"48 hour"},{"$f":"IF('FW nonmetal plant'!H15=\"\",\"\",'FW nonmetal plant'!H15)","v":"Population abundance: Growth Rate: Optical cell density."},{"$f":"IF('FW nonmetal plant'!H18=\"\",\"\",'FW nonmetal plant'!H18)","v":"EC"},{"$f":"IF('FW nonmetal plant'!H21=\"\",\"\",'FW nonmetal plant'!H21)","v":50},{"$f":"IF('FW nonmetal plant'!H23=\"\",\"\",'FW nonmetal plant'!H23)","v":"no toxicant control"},{"$f":"IF('FW nonmetal plant'!H26=\"\",\"\",'FW nonmetal plant'!H26)","v":"Triplicate"},{"$f":"IF('FW nonmetal plant'!H29=\"\",\"\",'FW nonmetal plant'!H29)","v":"OECD prodecure"},{"$f":"IF('FW nonmetal plant'!H32=\"\",\"\",'FW nonmetal plant'!H32)","v":"Unicellular microalgae S. vacuolatus (Chlorophyceae; strain 211-15, Shihira and Krauss, Melbourne, Australia) and P. subcapitata (Chlorophyceae; strain 61.81, Nygaard, Komárek, J. Kristiansen and Skulberg, Akershus, Norway)"},{"$f":"IF('FW nonmetal plant'!H35=\"\",\"\",'FW nonmetal plant'!H35)","v":"Growth media"},{"$f":"IF('FW nonmetal plant'!H38=\"\",\"\",'FW nonmetal plant'!H38)","v":"not stated"},{"$f":"IF('FW nonmetal plant'!H41=\"\",\"\",'FW nonmetal plant'!H41)","v":"nominal concentrations"},{"$f":"IF('FW nonmetal plant'!H44=\"\",\"\",'FW nonmetal plant'!H44)","v":""},{"$f":"IF('FW nonmetal plant'!H47=\"\",\"\",'FW nonmetal plant'!H47)","v":"Log-logistic dose response model."},{"$f":"IF('FW nonmetal plant'!H53=\"\",\"\",'FW nonmetal plant'!H53)","v":"95% confidence intervals."},{"$f":"IF('FW nonmetal plant'!H53=\"\",\"\",'FW nonmetal plant'!H53)","v":"95% confidence intervals."},{"$f":"IF('FW nonmetal plant'!H57=\"\",\"\",'FW nonmetal plant'!H57)","v":"not stated"},{"$f":"IF('FW nonmetal plant'!H61=\"\",\"\",'FW nonmetal plant'!H61)","v":"25 degrees C"},{"$f":"IF('FW nonmetal plant'!H64=\"\",\"\",'FW nonmetal plant'!H64)","v":"99% diuron"}]
[{"$f":"'FW nonmetal plant'!G3","v":"Species (Scientific name)"},{"$f":"'FW nonmetal plant'!G4","v":"Lifestage"},{"$f":"'FW nonmetal plant'!G5","v":"Exposure duration"},{"$f":"'FW nonmetal plant'!G6","v":"Measure of toxicity"},{"$f":"'FW nonmetal plant'!G7","v":"Toxicity endpoint"},{"$f":"'FW nonmetal plant'!G8","v":"Toxicity value"},{"$f":"'FW nonmetal plant'!J2","v":"Taxonomic group"},{"$f":"'FW nonmetal plant'!J3","v":"Phylum"},{"$f":"'FW nonmetal plant'!J4","v":"Class"},{"$f":"'FW nonmetal plant'!J5","v":"Media"},{"$f":"'FW nonmetal plant'!J6","v":"Temperature "},{"$f":"'FW nonmetal plant'!J7","v":"Acute Or Chronic "},{"$f":"'FW nonmetal plant'!J8","v":"PH"},{"$f":"'FW nonmetal plant'!J9","v":"Salinity/Conductivity"},{"$f":"'FW nonmetal plant'!C4","v":"Citation"},{"$f":"'FW nonmetal plant'!G2","v":"Citation No."}]
[{"$f":"'FW nonmetal plant'!Q3","v":"Scenedesmus vacuolatus"},{"$f":"'FW nonmetal plant'!T3","v":"Exponential growth phase"},{"$f":"'FW nonmetal plant'!W3","v":"48 hour"},{"$f":"'FW nonmetal plant'!Z3","v":"EC50"},{"$f":"'FW nonmetal plant'!AC3","v":"Growth rate: Optical cell density"},{"$f":"IF('FW nonmetal plant'!H8=\"\",\"\",'FW nonmetal plant'!H8)","v":"14.3 ug/L"},{"$f":"'FW nonmetal plant'!AF3","v":"Microalga"},{"$f":"'FW nonmetal plant'!AI3","v":"Chlorophyta"},{"$f":"'FW nonmetal plant'!AO3","v":"Not stated"},{"$f":"'FW nonmetal plant'!AR3","v":"25°C"},{"$f":"'FW nonmetal plant'!AR3","v":"25°C"},{"$f":"'FW nonmetal plant'!AU3","v":"Chronic"},{"$f":"'FW nonmetal plant'!AX3","v":"Not stated"},{"$f":"'FW nonmetal plant'!BA3","v":"N.A."},{"$f":"IF('FW nonmetal plant'!E4=\"\",\"\",'FW nonmetal plant'!E4)","v":"Copin,P.J., and N. Chevre (2015). Modelling the Effects of Pulse Exposure of Several PSII Inhibitors on Two Algae, Chemosphere137:70-77."},{"$f":"IF('FW nonmetal plant'!H2=\"\",\"\",'FW nonmetal plant'!H2)","v":"1000"}]
[{"$f":"'FW metal plant'!B11","v":"No."},{"$f":"'FW metal plant'!B13","v":1},{"$f":"'FW metal plant'!B16","v":2},{"$f":"'FW metal plant'!B19","v":3},{"$f":"'FW metal plant'!B21","v":4},{"$f":"'FW metal plant'!B23","v":5},{"$f":"'FW metal plant'!B26","v":6},{"$f":"'FW metal plant'!B29","v":7},{"$f":"'FW metal plant'!B32","v":8},{"$f":"'FW metal plant'!B35","v":9},{"$f":"'FW metal plant'!B39","v":10},{"$f":"'FW metal plant'!B42","v":11},{"$f":"'FW metal plant'!B45","v":12},{"$f":"'FW metal plant'!B48","v":13},{"$f":"'FW metal plant'!B51","v":14},{"$f":"'FW metal plant'!B53","v":15},{"$f":"'FW metal plant'!B58","v":16.100000000000001},{"$f":"'FW metal plant'!B61","v":16.2},{"$f":"'FW metal plant'!B64","v":16.3},{"$f":"'FW metal plant'!B67","v":16.399999999999999},{"$f":"'FW metal plant'!B70","v":17},{"$f":"'FW metal plant'!B73","v":18},{"$f":"'FW metal plant'!C78","v":"Total score"},{"$f":"'FW metal plant'!C80","v":"Quality Score"}]
[{"$f":"'FW metal plant'!C2","v":"Category"},{"$f":"'FW metal plant'!E2","v":"Freshwater/metal/plant"},{"$f":"'FW metal plant'!C3","v":"Paper and data unique identifier(eg. 1-1,10-150)"},{"$f":"'FW metal plant'!E3","v":0}]
[{"$f":"'FW metal plant'!G11","v":"Scores"},{"$f":"'FW metal plant'!G12","v":0},{"$f":"'FW metal plant'!G15","v":0},{"$f":"'FW metal plant'!G18","v":0},{"$f":"'FW metal plant'!G21","v":0},{"$f":"'FW metal plant'!G23","v":0},{"$f":"'FW metal plant'!G26","v":0},{"$f":"'FW metal plant'!G29","v":0},{"$f":"'FW metal plant'!G32","v":0},{"$f":"'FW metal plant'!G35","v":0},{"$f":"'FW metal plant'!G38","v":0},{"$f":"'FW metal plant'!G41","v":0},{"$f":"'FW metal plant'!G44","v":0},{"$f":"'FW metal plant'!G47","v":0},{"$f":"'FW metal plant'!G50","v":0},{"$f":"'FW metal plant'!G53","v":0},{"$f":"'FW metal plant'!G57","v":0},{"$f":"'FW metal plant'!G60","v":0},{"$f":"'FW metal plant'!G63","v":0},{"$f":"'FW metal plant'!G66","v":0},{"$f":"'FW metal plant'!G69","v":0},{"$f":"'FW metal plant'!G72","v":0},{"$f":"'FW metal plant'!G78","v":""},{"$f":"'FW metal plant'!G80","v":{"$error":"#N/A"}},{"$f":"'FW metal plant'!H80","v":""}]
[{"$f":"'FW metal plant'!H11","v":"Answers"},{"$f":"IF('FW metal plant'!H12=\"\",\"\",'FW metal plant'!H12)","v":""},{"$f":"IF('FW metal plant'!H15=\"\",\"\",'FW metal plant'!H15)","v":""},{"$f":"IF('FW metal plant'!H18=\"\",\"\",'FW metal plant'!H18)","v":""},{"$f":"IF('FW metal plant'!H21=\"\",\"\",'FW metal plant'!H21)","v":""},{"$f":"IF('FW metal plant'!H23=\"\",\"\",'FW metal plant'!H23)","v":""},{"$f":"IF('FW metal plant'!H26=\"\",\"\",'FW metal plant'!H26)","v":""},{"$f":"IF('FW metal plant'!H29=\"\",\"\",'FW metal plant'!H29)","v":""},{"$f":"IF('FW metal plant'!H32=\"\",\"\",'FW metal plant'!H32)","v":""},{"$f":"IF('FW metal plant'!H35=\"\",\"\",'FW metal plant'!H35)","v":""},{"$f":"IF('FW metal plant'!H38=\"\",\"\",'FW metal plant'!H38)","v":""},{"$f":"IF('FW metal plant'!H41=\"\",\"\",'FW metal plant'!H41)","v":""},{"$f":"IF('FW metal plant'!H44=\"\",\"\",'FW metal plant'!H44)","v":""},{"$f":"IF('FW metal plant'!H47=\"\",\"\",'FW metal plant'!H47)","v":""},{"$f":"IF('FW metal plant'!H50=\"\",\"\",'FW metal plant'!H50)","v":""},{"$f":"IF('FW metal plant'!H53=\"\",\"\",'FW metal plant'!H53)","v":""},{"$f":"IF('FW metal plant'!H57=\"\",\"\",'FW metal plant'!H57)","v":""},{"$f":"IF('FW metal plant'!H60=\"\",\"\",'FW metal plant'!H60)","v":""},{"$f":"IF('FW metal plant'!H63=\"\",\"\",'FW metal plant'!H63)","v":""},{"$f":"IF('FW metal plant'!H66=\"\",\"\",'FW metal plant'!H66)","v":""},{"$f":"IF('FW metal plant'!H69=\"\",\"\",'FW metal plant'!H69)","v":""},{"$f":"IF('FW metal plant'!H72=\"\",\"\",'FW metal plant'!H72)","v":""}]
[{"$f":"'FW metal plant'!G3","v":"Species (Scientific name)"},{"$f":"'FW metal plant'!G4","v":"Lifestage"},{"$f":"'FW metal plant'!G5","v":"Exposure duration"},{"$f":"'FW metal plant'!G6","v":"Measure of toxicity"},{"$f":"'FW metal plant'!G7","v":"Toxicity endpoint"},{"$f":"'FW metal plant'!G8","v":"Toxicity value"},{"$f":"'FW metal plant'!J2","v":"Taxonomic group"},{"$f":"'FW metal plant'!J3","v":"Phylum"},{"$f":"'FW metal plant'!J4","v":"Class"},{"$f":"'FW metal plant'!J5","v":"Media"},{"$f":"'FW metal plant'!J6","v":"Temperature "},{"$f":"'FW metal plant'!J7","v":"Acute Or Chronic "},{"$f":"'FW metal plant'!J8","v":"PH"},{"$f":"'FW metal plant'!J9","v":"Salinity/Conductivity"},{"$f":"'FW metal plant'!C4","v":"Citation"},{"$f":"'FW metal plant'!G2","v":"Citation No."}]
[{"$f":"'FW metal plant'!Q3","v":""},{"$f":"'FW metal plant'!T3","v":""},{"$f":"'FW metal plant'!W3","v":""},{"$f":"'FW metal plant'!Z3","v":""},{"$f":"'FW metal plant'!AC3","v":""},{"$f":"IF('FW metal plant'!H8=\"\",\"\",'FW metal plant'!H8)","v":""},{"$f":"'FW metal plant'!AF3","v":""},{"$f":"'FW metal plant'!AI3","v":""},{"$f":"'FW metal plant'!AL3","v":""},{"$f":"'FW metal plant'!AO3","v":""},{"$f":"'FW metal plant'!AR3","v":""},{"$f":"'FW metal plant'!AU3","v":""},{"$f":"'FW metal plant'!AX3","v":""},{"$f":"'FW metal plant'!BA3","v":"N.A."},{"$f":"IF('FW metal plant'!E4=\"\",\"\",'FW metal plant'!E4)","v":""},{"$f":"IF('FW metal plant'!H2=\"\",\"\",'FW metal plant'!H2)","v":0}]
[{"$f":"'FW nonmetal nonplant'!B11","v":"No."},{"$f":"'FW nonmetal nonplant'!B13","v":1},{"$f":"'FW nonmetal nonplant'!B16","v":2},{"$f":"'FW nonmetal nonplant'!B19","v":3},{"$f":"'FW nonmetal nonplant'!B21","v":4},{"$f":"'FW nonmetal nonplant'!B23","v":5},{"$f":"'FW nonmetal nonplant'!B26","v":6},{"$f":"'FW nonmetal nonplant'!B29","v":7},{"$f":"'FW nonmetal nonplant'!B32","v":8},{"$f":"'FW nonmetal nonplant'!B35","v":9},{"$f":"'FW nonmetal nonplant'!B39","v":10},{"$f":"'FW nonmetal nonplant'!B42","v":11},{"$f":"'FW nonmetal nonplant'!B45","v":12},{"$f":"'FW nonmetal nonplant'!B48","v":13},{"$f":"'FW nonmetal nonplant'!B51","v":14},{"$f":"'FW nonmetal nonplant'!B53","v":15},{"$f":"'FW nonmetal nonplant'!B58","v":16.100000000000001},{"$f":"'FW nonmetal nonplant'!B61","v":16.2},{"$f":"'FW nonmetal nonplant'!B64","v":17},{"$f":"'FW nonmetal nonplant'!B67","v":18},{"$f":"'FW nonmetal nonplant'!C72","v":"Total score"},{"$f":"'FW nonmetal nonplant'!C74","v":"Quality Score"}]
[{"$f":"'FW nonmetal nonplant'!C2","v":"Category"},{"$f":"'FW nonmetal nonplant'!E2","v":"Freshwater/non-metal/non- plant"},{"$f":"'FW nonmetal nonplant'!C3","v":"Paper and data unique identifier(eg. 1-1,10-150)"},{"$f":"'FW nonmetal nonplant'!E3","v":0}]
[{"$f":"'FW nonmetal nonplant'!G11","v":"Scores"},{"$f":"'FW nonmetal nonplant'!G12","v":0},{"$f":"'FW nonmetal nonplant'!G15","v":0},{"$f":"'FW nonmetal nonplant'!G18","v":0},{"$f":"'FW nonmetal nonplant'!G21","v":0},{"$f":"'FW nonmetal nonplant'!G23","v":0},{"$f":"'FW nonmetal nonplant'!G26","v":0},{"$f":"'FW nonmetal nonplant'!G29","v":0},{"$f":"'FW nonmetal nonplant'!G32","v":0},{"$f":"'FW nonmetal nonplant'!G35","v":0},{"$f":"'FW nonmetal nonplant'!G38","v":0},{"$f":"'FW nonmetal nonplant'!G41","v":0},{"$f":"'FW nonmetal nonplant'!G44","v":0},{"$f":"'FW nonmetal nonplant'!G47","v":0},{"$f":"'FW nonmetal nonplant'!G50","v":0},{"$f":"'FW nonmetal nonplant'!G53","v":0},{"$f":"'FW nonmetal nonplant'!G57","v":0},{"$f":"'FW nonmetal nonplant'!G60","v":0},{"$f":"'FW nonmetal nonplant'!G63","v":0},{"$f":"'FW nonmetal nonplant'!G66","v":0},{"$f":"'FW nonmetal nonplant'!G72","v":""},{"$f":"'FW nonmetal nonplant'!G74","v":{"$error":"#N/A"}},null,{"$f":"'FW nonmetal nonplant'!H74","v":""}]
[{"$f":"'FW nonmetal nonplant'!H11","v":"Answers"},{"$f":"IF('FW nonmetal nonplant'!H12=\"\",\"\",'FW nonmetal nonplant'!H12)","v":""},{"$f":"IF('FW nonmetal nonplant'!H15=\"\",\"\",'FW nonmetal nonplant'!H15)","v":""},{"$f":"IF('FW nonmetal nonplant'!H18=\"\",\"\",'FW nonmetal nonplant'!H18)","v":""},{"$f":"IF('FW nonmetal nonplant'!H21=\"\",\"\",'FW nonmetal nonplant'!H21)","v":""},{"$f":"IF('FW nonmetal nonplant'!H23=\"\",\"\",'FW nonmetal nonplant'!H23)","v":""},{"$f":"IF('FW nonmetal nonplant'!H26=\"\",\"\",'FW nonmetal nonplant'!H26)","v":""},{"$f":"IF('FW nonmetal nonplant'!H29=\"\",\"\",'FW nonmetal nonplant'!H29)","v":""},{"$f":"IF('FW nonmetal nonplant'!H32=\"\",\"\",'FW nonmetal nonplant'!H32)","v":""},{"$f":"IF('FW nonmetal nonplant'!H35=\"\",\"\",'FW nonmetal nonplant'!H35)","v":""},{"$f":"IF('FW nonmetal nonplant'!H38=\"\",\"\",'FW nonmetal nonplant'!H38)","v":""},{"$f":"IF('FW nonmetal nonplant'!H41=\"\",\"\",'FW nonmetal nonplant'!H41)","v":""},{"$f":"IF('FW nonmetal nonplant'!H44=\"\",\"\",'FW nonmetal nonplant'!H44)","v":""},{"$f":"IF('FW nonmetal nonplant'!H47=\"\",\"\",'FW nonmetal nonplant'!H47)","v":""},{"$f":"IF('FW nonmetal nonplant'!H50=\"\",\"\",'FW nonmetal nonplant'!H50)","v":""},{"$f":"IF('FW nonmetal nonplant'!H53=\"\",\"\",'FW nonmetal nonplant'!H53)","v":""},{"$f":"IF('FW nonmetal nonplant'!H57=\"\",\"\",'FW nonmetal nonplant'!H57)","v":""},{"$f":"IF('FW nonmetal nonplant'!H60=\"\",\"\",'FW nonmetal nonplant'!H60)","v":""},{"$f":"IF('FW nonmetal nonplant'!H63=\"\",\"\",'FW nonmetal nonplant'!H63)","v":""},{"$f":"IF('FW nonmetal nonplant'!H66=\"\",\"\",'FW nonmetal nonplant'!H66)","v":""}]
[{"$f":"'FW nonmetal nonplant'!G3","v":"Species (Scientific name)"},{"$f":"'FW nonmetal nonplant'!G4","v":"Lifestage"},{"$f":"'FW nonmetal nonplant'!G5","v":"Exposure duration"},{"$f":"'FW nonmetal nonplant'!G6","v":"Measure of toxicity"},{"$f":"'FW nonmetal nonplant'!G7","v":"Toxicity endpoint"},{"$f":"'FW nonmetal nonplant'!G8","v":"Toxicity value"},{"$f":"'FW nonmetal nonplant'!J2","v":"Taxonomic group"},{"$f":"'FW nonmetal nonplant'!J3","v":"Phylum"},{"$f":"'FW nonmetal nonplant'!J4","v":"Class"},{"$f":"'FW nonmetal nonplant'!J5","v":"Media"},{"$f":"'FW nonmetal nonplant'!J6","v":"Temperature "},{"$f":"'FW nonmetal nonplant'!J7","v":"Acute Or Chronic "},{"$f":"'FW nonmetal nonplant'!J8","v":"PH"},{"$f":"'FW nonmetal nonplant'!J9","v":"Salinity/Conductivity"},{"$f":"'FW nonmetal nonplant'!C4","v":"Citation"},{"$f":"'FW nonmetal nonplant'!G2","v":"Citation No."}]
[{"$f":"'FW nonmetal nonplant'!Q3","v":""},{"$f":"'FW nonmetal nonplant'!T3","v":""},{"$f":"'FW nonmetal nonplant'!W3","v":""},{"$f":"'FW nonmetal nonplant'!Z3","v":""},{"$f":"'FW nonmetal nonplant'!AC3","v":""},{"$f":"IF('FW nonmetal nonplant'!H8=\"\",\"\",'FW nonmetal nonplant'!H8)","v":""},{"$f":"'FW nonmetal nonplant'!AF3","v":""},{"$f":"'FW nonmetal nonplant'!AI3","v":""},{"$f":"'FW nonmetal nonplant'!AL3","v":""},{"$f":"'FW nonmetal nonplant'!AO3","v":""},{"$f":"'FW nonmetal nonplant'!AR3","v":""},{"$f":"'FW nonmetal nonplant'!AU3","v":""},{"$f":"'FW nonmetal nonplant'!AX3","v":""},{"$f":"'FW nonmetal nonplant'!BA3","v":"N.A."},{"$f":"IF('FW nonmetal nonplant'!E4=\"\",\"\",'FW nonmetal nonplant'!E4)","v":""},{"$f":"IF('FW nonmetal nonplant'!H2=\"\",\"\",'FW nonmetal nonplant'!H2)","v":0}]
[{"$f":"'FW metal nonplant'!B11","v":"No."},{"$f":"'FW metal nonplant'!B13","v":1},{"$f":"'FW metal nonplant'!B16","v":2},{"$f":"'FW metal nonplant'!B19","v":3},{"$f":"'FW metal nonplant'!B21","v":4},{"$f":"'FW metal nonplant'!B23","v":5},{"$f":"'FW metal nonplant'!B26","v":6},{"$f":"'FW metal nonplant'!B29","v":7},{"$f":"'FW metal nonplant'!B32","v":8},{"$f":"'FW metal nonplant'!B35","v":9},{"$f":"'FW metal nonplant'!B39","v":10},{"$f":"'FW metal nonplant'!B42","v":11},{"$f":"'FW metal nonplant'!B45","v":12},{"$f":"'FW metal nonplant'!B48","v":13},{"$f":"'FW metal nonplant'!B51","v":14},{"$f":"'FW metal nonplant'!B53","v":15},{"$f":"'FW metal nonplant'!B58","v":16.100000000000001},{"$f":"'FW metal nonplant'!B61","v":16.2},{"$f":"'FW metal nonplant'!B64","v":16.3},{"$f":"'FW metal nonplant'!B67","v":16.399999999999999},{"$f":"'FW metal nonplant'!B70","v":16.5},{"$f":"'FW metal nonplant'!B73","v":17},{"$f":"'FW metal nonplant'!B76","v":18},{"$f":"'FW metal nonplant'!C81","v":"Total score"},{"$f":"'FW metal nonplant'!C83","v":"Quality Score"}]
[{"$f":"'FW metal nonplant'!C2","v":"Category"},{"$f":"'FW metal nonplant'!E2","v":"Freshwater/metal/non- plant"},{"$f":"'FW metal nonplant'!C3","v":"Paper and data unique identifier(eg. 1-1,10-150)"},{"$f":"'FW metal nonplant'!E3","v":0}]
[{"$f":"'FW metal nonplant'!G11","v":"Scores"},{"$f":"'FW metal nonplant'!G12","v":0},{"$f":"'FW metal nonplant'!G15","v":0},{"$f":"'FW metal nonplant'!G18","v":0},{"$f":"'FW metal nonplant'!G21","v":0},{"$f":"'FW metal nonplant'!G23","v":0},{"$f":"'FW metal nonplant'!G26","v":0},{"$f":"'FW metal nonplant'!G29","v":2},{"$f":"'FW metal nonplant'!G32","v":0},{"$f":"'FW metal nonplant'!G35","v":0},{"$f":"'FW metal nonplant'!G38","v":0},{"$f":"'FW metal nonplant'!G41","v":0},{"$f":"'FW metal nonplant'!G44","v":0},{"$f":"'FW metal nonplant'!G47","v":0},{"$f":"'FW metal nonplant'!G50","v":0},{"$f":"'FW metal nonplant'!G53","v":0},{"$f":"'FW metal nonplant'!G57","v":0},{"$f":"'FW metal nonplant'!G60","v":0},{"$f":"'FW metal nonplant'!G63","v":0},{"$f":"'FW metal nonplant'!G66","v":0},{"$f":"'FW metal nonplant'!G69","v":0},{"$f":"'FW metal nonplant'!G72","v":0},{"$f":"'FW metal nonplant'!G75","v":3},{"$f":"'FW metal nonplant'!G81","v":5},{"$f":"'FW metal nonplant'!G83","v":0.05},{"$f":"'FW metal nonplant'!H83","v":""}]
[{"$f":"'FW metal nonplant'!H11","v":"Answers"},{"$f":"IF('FW metal nonplant'!H12=\"\",\"\",'FW metal nonplant'!H12)","v":""},{"$f":"IF('FW metal nonplant'!H15=\"\",\"\",'FW metal nonplant'!H15)","v":""},{"$f":"IF('FW metal nonplant'!H18=\"\",\"\",'FW metal nonplant'!H18)","v":""},{"$f":"IF('FW metal nonplant'!H21=\"\",\"\",'FW metal nonplant'!H21)","v":""},{"$f":"IF('FW metal nonplant'!H23=\"\",\"\",'FW metal nonplant'!H23)","v":""},{"$f":"IF('FW metal nonplant'!H26=\"\",\"\",'FW metal nonplant'!H26)","v":""},{"$f":"IF('FW metal nonplant'!H29=\"\",\"\",'FW metal nonplant'!H29)","v":"OECDGuideline 202 (1995) and ISO 6341"},{"$f":"IF('FW metal nonplant'!H32=\"\",\"\",'FW metal nonplant'!H32)","v":""},{"$f":"IF('FW metal nonplant'!H35=\"\",\"\",'FW metal nonplant'!H35)","v":""},{"$f":"IF('FW metal nonplant'!H38=\"\",\"\",'FW metal nonplant'!H38)","v":""},{"$f":"IF('FW metal nonplant'!H41=\"\",\"\",'FW metal nonplant'!H41)","v":""},{"$f":"IF('FW metal nonplant'!H44=\"\",\"\",'FW metal nonplant'!H44)","v":""},{"$f":"IF('FW metal nonplant'!H47=\"\",\"\",'FW metal nonplant'!H47)","v":""},{"$f":"IF('FW metal nonplant'!H50=\"\",\"\",'FW metal nonplant'!H50)","v":""},{"$f":"IF('FW metal nonplant'!H53=\"\",\"\",'FW metal nonplant'!H53)","v":""},{"$f":"IF('FW metal nonplant'!H57=\"\",\"\",'FW metal nonplant'!H57)","v":""},{"$f":"IF('FW metal nonplant'!H60=\"\",\"\",'FW metal nonplant'!H60)","v":""},{"$f":"IF('FW metal nonplant'!H63=\"\",\"\",'FW metal nonplant'!H63)","v":""},{"$f":"IF('FW metal nonplant'!H66=\"\",\"\",'FW metal nonplant'!H66)","v":""},{"$f":"IF('FW metal nonplant'!H69=\"\",\"\",'FW metal nonplant'!H69)","v":""},{"$f":"IF('FW metal nonplant'!H72=\"\",\"\",'FW metal nonplant'!H72)","v":""},{"$f":"IF('FW metal nonplant'!H75=\"\",\"\",'FW metal nonplant'!H75)","v":"Technical grade diuron 98.5%"}]
[{"$f":"'FW metal nonplant'!G3","v":"Species (Scientific name)"},{"$f":"'FW metal nonplant'!G4","v":"Lifestage"},{"$f":"'FW metal nonplant'!G5","v":"Exposure duration"},{"$f":"'FW metal nonplant'!G6","v":"Measure of toxicity"},{"$f":"'FW metal nonplant'!G7","v":"Toxicity endpoint"},{"$f":"'FW metal nonplant'!G8","v":"Toxicity value"},{"$f":"'FW metal nonplant'!J2","v":"Taxonomic group"},{"$f":"'FW metal nonplant'!J3","v":"Phylum"},{"$f":"'FW metal nonplant'!J4","v":"Class"},{"$f":"'FW metal nonplant'!J5","v":"Media"},{"$f":"'FW metal nonplant'!J6","v":"Temperature "},{"$f":"'FW metal nonplant'!J7","v":"Acute Or Chronic "},{"$f":"'FW metal nonplant'!J8","v":"PH"},{"$f":"'FW metal nonplant'!J9","v":"Salinity/Conductivity"},{"$f":"'FW metal nonplant'!C4","v":"Citation"},{"$f":"'FW metal nonplant'!G2","v":"Citation No."}]
[{"$f":"'FW metal nonplant'!Q3","v":""},{"$f":"'FW metal nonplant'!T3","v":""},{"$f":"'FW metal nonplant'!W3","v":""},{"$f":"'FW metal nonplant'!Z3","v":""},{"$f":"'FW metal nonplant'!AC3","v":""},{"$f":"IF('FW metal nonplant'!H8=\"\",\"\",'FW metal nonplant'!H8)","v":""},{"$f":"'FW metal nonplant'!AF3","v":""},{"$f":"'FW metal nonplant'!AI3","v":""},{"$f":"'FW metal nonplant'!AL3","v":""},{"$f":"'FW metal nonplant'!AO3","v":""},{"$f":"'FW metal nonplant'!AR3","v":""},{"$f":"'FW metal nonplant'!AU3","v":""},{"$f":"'FW metal nonplant'!AX3","v":""},{"$f":"'FW metal nonplant'!BA3","v":"N.A."},{"$f":"IF('FW metal nonplant'!E4=\"\",\"\",'FW metal nonplant'!E4)","v":""},{"$f":"IF('FW metal nonplant'!H2=\"\",\"\",'FW metal nonplant'!H2)","v":0}]
[{"$f":"'MEW nonplant'!B11","v":"No."},{"$f":"'MEW nonplant'!B13","v":1},{"$f":"'MEW nonplant'!B16","v":2},{"$f":"'MEW nonplant'!B19","v":3},{"$f":"'MEW nonplant'!B21","v":4},{"$f":"'MEW nonplant'!B23","v":5},{"$f":"'MEW nonplant'!B26","v":6},{"$f":"'MEW nonplant'!B29","v":7},{"$f":"'MEW nonplant'!B32","v":8},{"$f":"'MEW nonplant'!B35","v":9},{"$f":"'MEW nonplant'!B39","v":10},{"$f":"'MEW nonplant'!B42","v":11},{"$f":"'MEW nonplant'!B45","v":12},{"$f":"'MEW nonplant'!B48","v":13},{"$f":"'MEW nonplant'!B51","v":14},{"$f":"'MEW nonplant'!B53","v":15},{"$f":"'MEW nonplant'!B58","v":16.100000000000001},{"$f":"'MEW nonplant'!B61","v":16.2},{"$f":"'MEW nonplant'!B64","v":16.3},{"$f":"'MEW nonplant'!B67","v":17},{"$f":"'MEW nonplant'!B70","v":18},{"$f":"'MEW nonplant'!C75","v":"Total score"},{"$f":"'MEW nonplant'!C77","v":"Quality Score"}]
[{"$f":"'MEW nonplant'!C2","v":"Category"},{"$f":"'MEW nonplant'!E2","v":"MEW_nonplant"},{"$f":"'MEW nonplant'!C3","v":"Paper and data unique identifier(eg. 1-1,10-150)"},{"$f":"'MEW nonplant'!E3","v":0}]
[{"$f":"'MEW nonplant'!G11","v":"Scores"},{"$f":"'MEW nonplant'!G12","v":10},{"$f":"'MEW nonplant'!G15","v":10},{"$f":"'MEW nonplant'!G18","v":5},{"$f":"'MEW nonplant'!G21","v":5},{"$f":"'MEW nonplant'!G23","v":5},{"$f":"'MEW nonplant'!G26","v":5},{"$f":"'MEW nonplant'!G29","v":5},{"$f":"'MEW nonplant'!G32","v":5},{"$f":"'MEW nonplant'!G35","v":5},{"$f":"'MEW nonplant'!G38","v":4},{"$f":"'MEW nonplant'!G41","v":0},{"$f":"'MEW nonplant'!G44","v":0},{"$f":"'MEW nonplant'!G47","v":4},{"$f":"'MEW nonplant'!G50","v":4},{"$f":"'MEW nonplant'!G53","v":4},{"$f":"'MEW nonplant'!G57","v":3},{"$f":"'MEW nonplant'!G60","v":3},{"$f":"'MEW nonplant'!G63","v":3},{"$f":"'MEW nonplant'!G66","v":3},{"$f":"'MEW nonplant'!G69","v":3},{"$f":"'MEW nonplant'!G75","v":86},{"$f":"'MEW nonplant'!G77","v":0.91489361702127658},{"$f":"'MEW nonplant'!H77","v":"The highest possible grade for this datum is acceptable."}]
[{"$f":"'MEW nonplant'!H11","v":"Answers"},{"$f":"IF('MEW nonplant'!H12=\"\",\"\",'MEW nonplant'!H12)","v":"6 days"},{"$f":"IF('MEW nonplant'!H15=\"\",\"\",'MEW nonplant'!H15)","v":"Hatching was defined as the rupture of the egg membrane, and partially as well as fully hatched larvae were counted as hatched. Mortality was identified by coagulation of the embryos, missing heartbeat, failure to develop somites and a non-detached tail. "},{"$f":"IF('MEW nonplant'!H18=\"\",\"\",'MEW nonplant'!H18)","v":""},{"$f":"IF('MEW nonplant'!H21=\"\",\"\",'MEW nonplant'!H21)","v":""},{"$f":"IF('MEW nonplant'!H23=\"\",\"\",'MEW nonplant'!H23)","v":"Solvent control and no-toxicant control."},{"$f":"IF('MEW nonplant'!H26=\"\",\"\",'MEW nonplant'!H26)","v":"Quadruplicate (4 reps)"},{"$f":"IF('MEW nonplant'!H29=\"\",\"\",'MEW nonplant'!H29)","v":"OECD Guidelines (1998) & EU Commission Directive 92/69/EEC. The controls showed normal embryo–larval development, with control mortality always below 10 %, as required for test validity."},{"$f":"IF('MEW nonplant'!H32=\"\",\"\",'MEW nonplant'!H32)","v":"Embryos: 72 hour post fertilisation of eggs - the embryos used were those that exhibited normal development that had reached the blastula stage."},{"$f":"IF('MEW nonplant'!H35=\"\",\"\",'MEW nonplant'!H35)","v":"Natural filtered seawater (FSW)"},{"$f":"IF('MEW nonplant'!H38=\"\",\"\",'MEW nonplant'!H38)","v":"Semi-static (renewal every 48 hours)."},{"$f":"IF('MEW nonplant'!H41=\"\",\"\",'MEW nonplant'!H41)","v":"not stated"},{"$f":"IF('MEW nonplant'!H44=\"\",\"\",'MEW nonplant'!H44)","v":""},{"$f":"IF('MEW nonplant'!H47=\"\",\"\",'MEW nonplant'!H47)","v":"Dose-response relationships were described using the modified Weibull model. See Figure 1 (% survivorship)."},{"$f":"IF('MEW nonplant'!H50=\"\",\"\",'MEW nonplant'!H50)","v":"The maximum NOEC and LOEC were established through ANOVA and Dunnett’s post hoc test using the SPSS application, version 19.0. Non-parametric tests, Kruskal–Wallis and the Mann–Whitney U, were used when the data did not meet the requirements of normality and homoscedasticity. Differences were considered as significant when p < 0.05"},{"$f":"IF('MEW nonplant'!H53=\"\",\"\",'MEW nonplant'!H53)","v":"95% Confidence Interval. P=0.05. "},{"$f":"IF('MEW nonplant'!H57=\"\",\"\",'MEW nonplant'!H57)","v":"34.20 ± 0.15 ppt"},{"$f":"IF('MEW nonplant'!H60=\"\",\"\",'MEW nonplant'!H60)","v":"7.32 ±0.70 mg/L"},{"$f":"IF('MEW nonplant'!H63=\"\",\"\",'MEW nonplant'!H63)","v":"8.29 ± 0.11"},{"$f":"IF('MEW nonplant'!H66=\"\",\"\",'MEW nonplant'!H66)","v":"Isothermal room (18 ± 1 °C)"},{"$f":"IF('MEW nonplant'!H69=\"\",\"\",'MEW nonplant'!H69)","v":"98% purity diuron"}]
[{"$f":"'MEW nonplant'!G3","v":"Species (Scientific name)"},{"$f":"'MEW nonplant'!G4","v":"Lifestage"},{"$f":"'MEW nonplant'!G5","v":"Exposure duration"},{"$f":"'MEW nonplant'!G6","v":"Measure of toxicity"},{"$f":"'MEW nonplant'!G7","v":"Toxicity endpoint"},{"$f":"'MEW nonplant'!G8","v":"Toxicity value"},{"$f":"'MEW nonplant'!J2","v":"Taxonomic group"},{"$f":"'MEW nonplant'!J3","v":"Phylum"},{"$f":"'MEW nonplant'!J4","v":"Class"},{"$f":"'MEW nonplant'!J5","v":"Media"},{"$f":"'MEW nonplant'!J6","v":"Temperature "},{"$f":"'MEW nonplant'!J7","v":"Acute Or Chronic "},{"$f":"'MEW nonplant'!J8","v":"PH"},{"$f":"'MEW nonplant'!J9","v":"Salinity/Conductivity"},{"$f":"'MEW nonplant'!C4","v":"Citation"},{"$f":"'MEW nonplant'!G2","v":"Citation No."}]
[{"$f":"'MEW nonplant'!Q3","v":"Psetta maxima"},{"$f":"'MEW nonplant'!T3","v":"Embryo"},{"$f":"'MEW nonplant'!W3","v":"6 days"},{"$f":"'MEW nonplant'!Z3","v":"LC50"},{"$f":"'MEW nonplant'!AC3","v":"Mortality"},{"$f":"IF('MEW nonplant'!H8=\"\",\"\",'MEW nonplant'!H8)","v":""},{"$f":"'MEW nonplant'!AF3","v":"Fish"},{"$f":"'MEW nonplant'!AI3","v":"Chordata"},{"$f":"'MEW nonplant'!AL3","v":"Actinopterygii"},{"$f":"'MEW nonplant'!AO3","v":"Natural filtered seawater (FSW)"},{"$f":"'MEW nonplant'!AR3","v":"18 (+ - 1) C"},{"$f":"'MEW nonplant'!AU3","v":"Acute"},{"$f":"'MEW nonplant'!AX3","v":"8.29 ± 0.11"},{"$f":"'MEW nonplant'!BA3","v":"34.20 ± 0.15 ppt"},{"$f":"IF('MEW nonplant'!E4=\"\", \"\",'MEW nonplant'!E4)","v":""},{"$f":"IF('MEW nonplant'!H2=\"\", \"\",'MEW nonplant'!H2)","v":0}]
[{"$f":"'MEW plant'!B11","v":"No."},{"$f":"'MEW plant'!B13","v":1},{"$f":"'MEW plant'!B16","v":2},{"$f":"'MEW plant'!B19","v":3},{"$f":"'MEW plant'!B21","v":4},{"$f":"'MEW plant'!B23","v":5},{"$f":"'MEW plant'!B26","v":6},{"$f":"'MEW plant'!B29","v":7},{"$f":"'MEW plant'!B32","v":8},{"$f":"'MEW plant'!B35","v":9},{"$f":"'MEW plant'!B39","v":10},{"$f":"'MEW plant'!B42","v":11},{"$f":"'MEW plant'!B45","v":12},{"$f":"'MEW plant'!B48","v":13},{"$f":"'MEW plant'!B51","v":14},{"$f":"'MEW plant'!B53","v":15},{"$f":"'MEW plant'!B57","v":16.100000000000001},{"$f":"'MEW plant'!B61","v":16.2},{"$f":"'MEW plant'!B64","v":17},{"$f":"'MEW plant'!B67","v":18},{"$f":"'MEW plant'!C72","v":"Total score"},{"$f":"'MEW plant'!C74","v":"Quality Score"}]
[{"$f":"'MEW plant'!C2","v":"Category"},{"$f":"'MEW plant'!E2","v":"MEW_plant"},{"$f":"'MEW plant'!C3","v":"Paper and data unique identifier(eg. 1-1,10-150)"},{"$f":"'MEW plant'!E3","v":"NESP-1"}]
[{"$f":"'MEW plant'!G11","v":"Scores"},{"$f":"'MEW plant'!G12","v":10},{"$f":"'MEW plant'!G15","v":5},{"$f":"'MEW plant'!G18","v":{"$error":"#REF!"}},{"$f":"'MEW plant'!G21","v":5},{"$f":"'MEW plant'!G23","v":5},{"$f":"'MEW plant'!G26","v":5},{"$f":"'MEW plant'!G29","v":5},{"$f":"'MEW plant'!G32","v":5},{"$f":"'MEW plant'!G35","v":5},{"$f":"'MEW plant'!G38","v":4},{"$f":"'MEW plant'!G41","v":4},{"$f":"'MEW plant'!G44","v":4},{"$f":"'MEW plant'!G47","v":4},{"$f":"'MEW plant'!G50","v":4},{"$f":"'MEW plant'!G53","v":4},{"$f":"'MEW plant'!G57","v":3},{"$f":"'MEW plant'!G61","v":0},{"$f":"'MEW plant'!G64","v":0},{"$f":"'MEW plant'!G67","v":0},{"$f":"'MEW plant'!G72","v":{"$error":"#REF!"}},{"$f":"'MEW plant'!G74","v":{"$error":"#N/A"}},{"$f":"'MEW plant'!H74","v":""}]
[{"$f":"'MEW plant'!H11","v":"Answers"},{"$f":"IF('MEW plant'!H12=\"\",\"\",'MEW plant'!H12)","v":"72 hours"},{"$f":"IF('MEW plant'!H15=\"\",\"\",'MEW plant'!H15)","v":"Inhibition of specific growth rate, compared to controls"},{"$f":"IF('MEW plant'!H18=\"\",\"\",'MEW plant'!H18)","v":"NEC, EC10, EC50"},{"$f":"IF('MEW plant'!H21=\"\",\"\",'MEW plant'!H21)","v":"Yes - confidence intervals included for NEC"},{"$f":"IF('MEW plant'!H23=\"\",\"\",'MEW plant'!H23)","v":"Solvent control (ethanol) and normal controls"},{"$f":"IF('MEW plant'!H26=\"\",\"\",'MEW plant'!H26)","v":"5x replicates"},{"$f":"IF('MEW plant'!H29=\"\",\"\",'MEW plant'!H29)","v":"• Control SGR ≥ 0.92 day-1 as per (OECD, 2011). Observed mean control SGR of all tests: 1.20 ± 0.07 day-1 (mean ± SD, n = 50)\n• The coefficient of variation (CV) of mean SGR in controls ≤ 10% as per (OECD, 2011). Observed control CV: < 5% in all tests"},{"$f":"IF('MEW plant'!H32=\"\",\"\",'MEW plant'!H32)","v":"4-day old culture in exponential growth phase, starting density 3x103 cells mL-1"},{"$f":"IF('MEW plant'!H35=\"\",\"\",'MEW plant'!H35)","v":"Guillard’s f/2 medium. Natural, 0.5 µm polypropylene-filtered coastal seawater (19°16'19.60\"S; 147° 3'40.93\"E) spiked with test solution."},{"$f":"IF('MEW plant'!H38=\"\",\"\",'MEW plant'!H38)","v":"Static"},{"$f":"IF('MEW plant'!H41=\"\",\"\",'MEW plant'!H41)","v":"Herbicide concentrations (2-3 per pesticide) were measured at initiation and termination of test.  The measured concentrations for all treatments were calculated based on the linear relationship between nominal and the time weighted average of measured concentrations. All herbicide analyses were performed at the Queensland Alliance for Environmental Health Sciences (QAEHS), The University of Queensland using HPLC-MS/MS (SCIEX Triple QuadTM 6500 QTRAP® mass spectrometer Shimadzu Nexera X2 uHPLC system) (Mercurio et al., 2015; Mercurio, 2016)."},{"$f":"IF('MEW plant'!H44=\"\",\"\",'MEW plant'!H44)","v":"Diuron at 4 µg L-1 "},{"$f":"IF('MEW plant'!H47=\"\",\"\",'MEW plant'!H47)","v":"• ECx: 4-parameter sigmoidal models, fitted to the percent inhibition and measured herbicide concentrations using the program GraphPad Prism (v 8.0.0, San Diego, CA, USA). see Figure A1.\n• NEC: Binomial exponential decay regression using the R package jagsNEC (Fisher et al., 2019), See Figure A2."},{"$f":"IF('MEW plant'!H50=\"\",\"\",'MEW plant'!H50)","v":"• Regression analysis following prescribed procedures (OECD, 2006a). The concentrations of herbicide that inhibited 10% and 50% of the SGR (or ΔF/Fm′) relative to controls (EC10 and EC50, respectively) were calculated from concentration-response curves (4-parameter sigmoidal models) fitted to the percent inhibition and measured herbicide concentrations for each treatment using the program GraphPad Prism (V 8.0.0, San Diego, CA, USA). \n• No effect concentration (NEC) values were calculated in R statistical package (v 3.5.1) and the proportional decline in SGR (1-inhibition) was modelled as a function of square root measured concentration of each herbicide using a Bayesian non-linear gaussian model using the R package jagsNEC (Fisher et al., 2019).\n"},{"$f":"IF('MEW plant'!H53=\"\",\"\",'MEW plant'!H53)","v":"95% Confidence Limits (CL) "},{"$f":"IF('MEW plant'!H57=\"\",\"\",'MEW plant'!H57)","v":"34.2 ± 0.6 psu"},{"$f":"IF('MEW plant'!H60=\"\",\"\",'MEW plant'!H60)","v":"8.5 ± 0.4 "},{"$f":"IF('MEW plant'!H63=\"\",\"\",'MEW plant'!H63)","v":"26.0 ± 0.6 °C"},{"$f":"IF('MEW plant'!H66=\"\",\"\",'MEW plant'!H66)","v":"Controls were tested for contamination. Analytical grade herbicides (98-99.5% purity) were used for preparation of all stock solutions."}]
[{"$f":"'MEW plant'!G3","v":"Species (Scientific name)"},{"$f":"'MEW plant'!G4","v":"Lifestage"},{"$f":"'MEW plant'!G5","v":"Exposure duration"},{"$f":"'MEW plant'!G6","v":"Measure of toxicity"},{"$f":"'MEW plant'!G7","v":"Toxicity endpoint"},{"$f":"'MEW plant'!G8","v":"Toxicity value"},{"$f":"'MEW plant'!J2","v":"Taxonomic group"},{"$f":"'MEW plant'!J3","v":"Phylum"},{"$f":"'MEW plant'!J4","v":"Class"},{"$f":"'MEW plant'!J5","v":"Media"},{"$f":"'MEW plant'!J6","v":"Temperature "},{"$f":"'MEW plant'!J7","v":"Acute Or Chronic "},{"$f":"'MEW plant'!J8","v":"PH"},{"$f":"'MEW plant'!J9","v":"Salinity/Conductivity"},{"$f":"'MEW plant'!C4","v":"Citation"},{"$f":"'MEW plant'!G2","v":"Citation No."}]
[{"$f":"'MEW plant'!Q3","v":"Rhodomonas salina"},{"$f":"'MEW plant'!T3","v":"Exponential growth phase"},{"$f":"'MEW plant'!W3","v":"72 hour"},{"$f":"'MEW plant'!Z3","v":"NEC"},{"$f":"'MEW plant'!AC3","v":"Growth: Specific growth rate"},{"$f":"IF('MEW plant'!H8=\"\",\"\",'MEW plant'!H8)","v":"1.68 ug/L"},{"$f":"'MEW plant'!AF3","v":"Microalga"},{"$f":"'MEW plant'!AI3","v":"Cryptophyta"},{"$f":"'MEW plant'!AL3","v":"Cryptophyceae"},{"$f":"'MEW plant'!AO3","v":"Guillard’s f/2 medium"},{"$f":"'MEW plant'!AR3","v":"26 ± 1 °C"},{"$f":"'MEW plant'!AU3","v":"Chronic"},{"$f":"'MEW plant'!AX3","v":"8.5 ± 0.4 "},{"$f":"'MEW plant'!BA3","v":"34.2 ± 0.6 psu"},{"$f":"IF('MEW plant'!E4=\"\",\"\",'MEW plant'!E4)","v":"Negri, A.P., Templeman, S., Flores, F., van Dam, J., Thomas, M., McKenzie, M., Stapp, L., Kaserzon, S., Mann, R.M., Smith, R., Warne, M.St.J. and Mueller, J. (2020) Ecotoxicology of pesticides on the Great Barrier Reef for guideline development and risk assessments. Final report to the National Environmental Science Program. Reef and Rainforest Research Centre Limited, Cairns (120 pp.)."},{"$f":"IF('MEW plant'!H2=\"\",\"\",'MEW plant'!H2)","v":"NESP"}]

{"sheet":"FW metal nonplant","index":5,"n_rows":90,"n_cols":54,"rows_kept":90,"cut":false,"hidden":false,"merged":[[25,2,27,2],[25,7,27,7],[28,2,30,2],[3,4,7,4],[9,2,9,4],[11,2,13,2],[11,7,13,7],[14,2,16,2],[14,7,16,7],[17,2,19,2],[17,7,19,7],[20,2,21,2],[20,7,21,7],[22,2,24,2],[22,7,24,7],[74,2,77,2],[74,7,77,7],[52,2,54,2],[52,7,54,7],[56,7,58,7],[65,7,67,7],[68,7,70,7],[62,7,64,7],[59,7,61,7],[71,2,73,2],[71,7,73,7],[46,7,48,7],[49,2,51,2],[28,7,30,7],[31,2,33,2],[31,7,33,7],[43,2,45,2],[43,7,45,7],[46,2,48,2],[49,7,51,7],[34,7,36,7],[37,2,39,2],[37,7,39,7],[40,2,42,2],[40,7,42,7],[34,2,36,2]]}
[null,1,"Fill in the blank cells below, based on information provided in the paper being assessed. You can either pick an option from the dropdown list or add the appropriate detail using the 'Add to list' button. ",null,null,null,null,null,null,null,null,null,null,null,"* All the text in RED are used for drop down list ,make changes with caution."]
[null,null,"Category",{"$f":"IF(AF3=\"\",0,1)","v":0},"Freshwater/metal/non- plant",{"$f":"IF(E3=\"\",0,1)","v":0},"Citation No.",{"$f":"IF(ISERROR(FIND(\"-\",E3)),E3,LEFT(E3,FIND(\"-\",E3)-1))","v":0},null,"Taxonomic group",null,null,null,null,"Species",null,null,"Lifestage",null,null,"Exposure duration",null,null,"Measure of toxicity",null,null,"Toxicity endpoint",null,null,"Taxonomic group",null,null,"Phylum",null,null,"Class",null,null,"Media",null,null,"Temperature ",null,null,"Acute Or Chronic",null,null,"PH",null,null,"Salinity/Comdictivity"]
[null,null,"Paper and data unique identifier(eg. 1-1,10-150)",{"$f":"IF(AI3=\"\",0,1)","v":0},null,{"$f":"IF(E4=\"\",0,1)","v":0},"Species (Scientific name)",null,null,"Phylum",null,null,null,null,"Aedes albopictus",0,{"$f":"IF(P3=0,\"\",INDEX(O3:O111,P3))","v":""},"1 month",0,{"$f":"IF(S3=0,\"\",INDEX(R3:R111,S3))","v":""},"11 hour",0,{"$f":"IF(V3=0,\"\",INDEX(U3:U111,V3))","v":""},"LC50",0,{"$f":"IF(Y3=0,\"\",INDEX(X3:X111,Y3))","v":""},"Mortality",0,{"$f":"IF(AB3=0,\"\",INDEX(AA3:AA111,AB3))","v":""},"Fish",0,{"$f":"IF(AE3=0,\"\",INDEX(AD3:AD111,AE3))","v":""},"Chlorophyta",0,{"$f":"IF(AH3=0,\"\",INDEX(AG3:AG111,AH3))","v":""},"Branchiopoda",0,{"$f":"IF(AK3=0,\"\",INDEX(AJ3:AJ111,AK3))","v":""},"Freshwater",0,{"$f":"IF(AN3=0,\"\",INDEX(AM3:AM111,AN3))","v":""},"15°C",0,{"$f":"IF(AQ3=0,\"\",INDEX(AP3:AP111,AQ3))","v":""},"Acute ",0,{"$f":"IF(AT3=0,\"\",INDEX(AS3:AS111,AT3))","v":""},"N.A.",0,{"$f":"IF(AW3=0,\"\",INDEX(AV3:AV111,AW3))","v":""},null,null,"N.A.",1]
[null,null,"Citation",{"$f":"IF(AL3=\"\",0,1)","v":0},null,{"$f":"IF(H8=\"\",0,1)","v":0},"Lifestage",null,null,"Class",null,null,null,null,"Australian Bass",null,null,"1 year old",null,null,"13 days",null,null,"N.A.",null,null,"N.A.",null,null,"Microalga",null,null,"N.A.",null,null,"Chlorophyceae",null,null,"Marinewater",null,null,"25°C",null,null,"Chronic",null,null,"PH11"]
[null,null,null,{"$f":"IF(AO3=\"\",0,1)","v":0},null,{"$f":"IF(AX3=\"\",0,1)","v":0},"Exposure duration",null,null,"Media",null,null,null,null,"N.A.",null,null,"N.A.",null,null,"N.A.",null,null,"NOEC",null,null,"Reproduction",null,null,"N.A.",null,null,"Tracheophyta",null,null,"N.A.",null,null,"N.A.",null,null,"N.A.",null,null,"N.A.",null,null,"PH7.0"]
[null,null,null,{"$f":"IF(AR3=\"\",0,1)","v":0},null,{"$f":"IF(Q3=\"\",0,1)","v":0},"Measure of toxicity",null,null,"Temperature "]
[null,null,null,{"$f":"IF(AU3=\"\",0,1)","v":0},null,{"$f":"IF(T3=\"\",0,1)","v":0},"Toxicity endpoint",null,null,"Acute Or Chronic "]
[null,null,null,null,null,{"$f":"IF(W3=\"\",0,1)","v":0},"Toxicity value",null,null,"PH"]
[null,2,"Select the appropriate answer option to each question. Comments can be added to the cells in column H.",null,null,{"$f":"IF(Z3=\"\",0,1)","v":0},null,null,null,"Salinity/Conductivity","N.A."]
[null,"*","If the selected answer option does not work try clicking on any other cell first and then click back on the answer option again.",null,null,{"$f":"IF(AC3=\"\",0,1)","v":0}]
[null,"No.","Question","Marks Awarded","Answer Options","Option References","Scores","Answers"]
[null,null,"Was the duration of the exposure stated (e.g. 48 or 96 h)?",10,null,0,{"$f":"IF(F15=0,0,INDEX($D12:$D13,F12,1))","v":0}]
[null,1,null,0]
[]
[null,null,"Was the biological endpoint (e.g. immobilization or population growth) stated and defined (10 marks)? Award 5 marks if the biological endpoint is only stated.",10,null,0,{"$f":"IF(F15=0,0,INDEX($D15:$D17,F15,1))","v":0}]
[null,2,null,5]
[null,null,null,0]
[null,null,"Was the biological effect stated (e.g. LC or NOEC)?",5,null,0,{"$f":"IF(F18=0,0,INDEX($D18:$D19,F18,1))","v":0}]
[null,3,null,0]
[]
[null,4,"Was the biological effect quantified (e.g. 50% effect, 25% effect)? \nNote: The effect for NOEC and LOEC data must be quantified.",5,null,0,{"$f":"IF(F21=0,0,INDEX($D21:$D22,F21,1))","v":0}]
[null,null,null,0]
[null,5,"Were appropriate controls (e.g. a no-toxicant control and/or solvent control) used?",5,null,0,{"$f":"IF(F23=0,0,INDEX($D23:$D24,F23,1))","v":0}]
[null,null,null,0]
[]
[null,6,"Was each control and contaminant concentration at least duplicated?",5,null,0,{"$f":"IF(F26=0,0,INDEX($D26:$D27,F26,1))","v":0}]
[null,null,null,0]
[]
[null,7,"Were test acceptability criteria stated (e.g. mortality in controls must not exceed a certain percentage) (5 marks)?\nOR Were test acceptability criteria inferred (e.g. test method used [USEPA, OECD, ASTM etc.]) (award 2 marks). \nNote: Data that fail the acceptability criteria are automatically deemed to be of unacceptable quality and must not be used. ",5,null,2,{"$f":"IF(F29=0,0,INDEX($D29:$D31,F29,1))","v":2},"OECDGuideline 202 (1995) and ISO 6341"]
[null,null,null,2]
[null,null,null,0]
[null,8,"Were the characteristics of the test organism (e.g. length, mass, age) stated?",5,null,0,{"$f":"IF(F32=0,0,INDEX($D32:$D34,F32,1))","v":0}]
[null,null,null,0]
[]
[null,9,"Was the type of test media used stated?",5,null,0,{"$f":"IF(F35=0,0,INDEX($D35:$D37,F35,1))","v":0}]
[null,null,null,0]
[]
[null,null,"Was the type of exposure (e.g. static, flow through) stated? ",4,null,0,{"$f":"IF(F38=0,0,INDEX($D38:$D40,F38,1))","v":0}]
[null,10,null,0]
[]
[null,null,"Were the contaminant concentrations measured at the beginning and end of the exposure (4 marks)? Award 2 marks if they were measured only once during the test.\nNote: If the concentrations were not measured then automatically the data cannot be high quality. ",4,null,0,{"$f":"IF(F41=0,0,INDEX($D41:$D43,F41,1))","v":0}]
[null,11,null,2]
[null,null,null,0]
[null,null,"Were parallel reference toxicant toxicity tests conducted?",4,null,0,{"$f":"IF(F44=0,0,INDEX($D44:$D46,F44,1))","v":0}]
[null,12,null,0]
[]
[null,null,"Was there a concentration–response relationship either observable or stated?",4,null,0,{"$f":"IF(F47=0,0,INDEX($D47:$D49,F47,1))","v":0}]
[null,13,null,0]
[]
[null,null,"Was an appropriate statistical method or model used to determine the toxicity?\nNote: They should be accepted by a recognised national or international regulatory body (e.g. USEPA, OECD, ASTM). ",4,null,0,{"$f":"IF(F50=0,0,INDEX($D50:$D52,F50,1))","v":0}]
[null,14,null,0]
[]
[null,15,"For LC/EC/BEC data was an estimate of variability provided? \nOR \nFor NO EC/LOEC data was the significance level 0.05 or less?  \n\n",4,null,0,{"$f":"IF(F53=0,0,INDEX($D53:$D55,F53,1))","v":0}]
[null,null,null,0]
[]
[null,16,"Were the following parameters measured and stated? (3 marks if measured and stated, 1 mark if just measured)."]
[null,null,null,3,null,0,{"$f":"IF(F57=0,0,INDEX($D57:$D59,F57,1))","v":0}]
[null,16.100000000000001,"pH",1]
[null,null,null,0]
[null,null,null,3,null,0,{"$f":"IF(F60=0,0,INDEX($D60:$D62,F60,1))","v":0}]
[null,16.2,"Hardness",1]
[null,null,null,0]
[null,null,null,3,null,0,{"$f":"IF(F63=0,0,INDEX($D63:$D65,F63,1))","v":0}]
[null,16.3,"Alkalinity",1]
[null,null,null,0]
[null,null,null,3,null,0,{"$f":"IF(F66=0,0,INDEX($D66:$D68,F66,1))","v":0}]
[null,16.399999999999999,"Organic carbon concentration",1]
[null,null,null,0]
[null,null,null,3,null,0,{"$f":"IF(F69=0,0,INDEX($D69:$D71,F69,1))","v":0}]
[null,16.5,"Dissolved Oxygen",1]
[null,null,null,0]
[null,null,"Was the temperature measured and stated (3 marks)? Award 1 mark if the temperature was measured but not stated or if only the temperature settings of the room or chamber are stated.",3,null,0,{"$f":"IF(F72=0,0,INDEX($D72:$D74,F72,1))","v":0}]
[null,17,null,1]
[null,null,null,0]
[null,null,"Were test solutions, blanks and/or controls tested for contamination OR were analytical reagent grade chemicals used or the highest possible purity chemicals used for the experiment? (3 marks).",3,null,1,{"$f":"IF(F75=0,0,INDEX($D75:$D76,F75,1))","v":3},"Technical grade diuron 98.5%"]
[null,18,null,0]
[]
[null,null,null,null,null,null,null,null,{"$f":"(COUNTIF(F12:F76,\"=0\"))+COUNTIF(F2:F10,\"=0\")+COUNTIF(D2:D7,\"=0\")","v":35}]
[]
[]
[null,null,"Total score",null,null,null,{"$f":"IF(SUM(G12:G75)=0,\"\",SUM(G12:G75))","v":5}]
[null,null,"Total Max. possible score for the various types of data and contaminants ",null,{"$f":"D12+D15+D18+D21+D23+D26+D29+D32+D35+D38+D41+D44+D47+D50+D53+D57+D66+D69+D72+D75+D63+D60","v":100}]
[null,null,"Quality Score",null,{"$f":"\"= [Total score / Total possible score] * 100 = \"","v":"= [Total score / Total possible score] * 100 = "},null,{"$f":"IF(ISERROR(G81/E82),#N/A,G81/E82)","v":0.05},{"$f":"IF(F41=3,\"The highest possible grade for this datum is acceptable.\",\"\")","v":""}]
[]
[null,null,"H = high quality                           Quality score ≥ 80%     "]
[null,null,"A = acceptable quality         > 50% Quality score < 80%  "]
[null,null,"U = unacceptable quality              Quality score ≤ 50% "]
[]
[3,null,"Click the 'Save & Update' button to save and export the answers to the 'All results' worksheet. "]
[null,null,"Select the 'Reset Answers' button if you wish to clear all answers."]

{"sheet":"FW metal nonplant_WS","index":6,"n_rows":5,"n_cols":25,"rows_kept":5,"cut":false,"hidden":false,"merged":[]}
[]
["Question No.",1,2,3,4,5,6,7,8,9,10,11,12,13,14,15,16.100000000000001,16.2,16.3,16.399999999999999,16.600000000000001,17,18,"Total Score","Quality Score"]
["Short Questions","Duration of the exposure ","Biological endpoint","Biological effect stated or not","Biological effect quantified or not","Appropriate controls","Control & contaminant concentration","Test acceptability criteria","Characteristics of the test organism"," Type of test media","Type of exposure","Contaminant concentrations","Parallel reference toxicant toxicity tests","Concentration–response relationship","Determine the toxicity","NOEC/LOEC or LC/EC/BEC","pH","Hardness","Alkalinity","Organic carbon concentration","Dissolved Oxygen","Temperature","Grade or purity"]
["Marks Awarded ","10 or 0","10,5 or 0","5 or 0 ","5 or 0 ","5 or 0 ","5 or 0 ","5 or 0 ","5 or 0 ","5 or 0 ","4 or 0","4 or 2 or 0","4 or 2","4 or 2","4 or 2","4 or 2","3 or 1 or 0","3 or 1 or 0","3 or 1 or 0","3 or 1 or 0","3 or 1 or 0","3 or 0","3 or 0 "]
["Max. Possible Score",10,10,5,5,5,5,5,5,5,4,4,4,4,4,4,3,3,3,3,3,3,3,{"$f":"SUM(B5:W5)","v":100}]

{"sheet":"FW nonmetal nonplant","index":7,"n_rows":81,"n_cols":53,"rows_kept":81,"cut":false,"hidden":false,"merged":[[3,4,7,4],[9,2,9,4],[11,2,13,2],[11,7,13,7],[14,2,16,2],[14,7,16,7],[17,2,19,2],[17,7,19,7],[20,2,21,2],[20,7,21,7],[22,2,24,2],[22,7,24,7],[25,2,27,2],[25,7,27,7],[28,2,30,2],[28,7,30,7],[31,2,33,2],[31,7,33,7],[34,2,36,2],[34,7,36,7],[37,2,39,2],[37,7,39,7],[40,2,42,2],[40,7,42,7],[43,2,45,2],[43,7,45,7],[46,2,48,2],[46,7,48,7],[49,2,51,2],[49,7,51,7],[65,2,68,2],[65,7,68,7],[59,7,61,7],[52,2,54,2],[52,7,54,7],[56,7,58,7],[62,2,64,2],[62,7,64,7]]}
[null,1,"Fill in the blank cells below, based on information provided in the paper being assessed. You can either pick an option from the dropdown list or add the appropriate detail using the 'Add to list' button. ",null,null,null,null,null,null,null,null,null,null,null,"* All the text in RED are used for drop down list ,make changes with caution."]
[null,null,"Category",{"$f":"IF(AF3=\"\",0,1)","v":0},"Freshwater/non-metal/non- plant",{"$f":"IF(E3=\"\",0,1)","v":0},"Citation No.",{"$f":"IF(ISERROR(FIND(\"-\",E3)),E3,LEFT(E3,FIND(\"-\",E3)-1))","v":0},null,"Taxonomic group",null,null,null,null,"Species",null,null,"Lifestage",null,null,"Exposure duration",null,null,"Measure of toxicity",null,null,"Toxicity endpoint",null,null,"Taxonomic group",null,null,"Phylum",null,null,"Class",null,null,"Media",null,null,"Temperature ",null,null,"Acute Or Chronic",null,null,"PH",null,null,"Salinity/Comdictivity"]
[null,null,"Paper and data unique identifier(eg. 1-1,10-150)",{"$f":"IF(AI3=\"\",0,1)","v":0},null,{"$f":"IF(E4=\"\",0,1)","v":0},"Species (Scientific name)",null,null,"Phylum",null,null,null,null,"Aedes albopictus",0,{"$f":"IF(P3=0,\"\",INDEX(O3:O102,P3))","v":""},"< 24 hours",0,{"$f":"IF(S3=0,\"\",INDEX(R3:R102,S3))","v":""},"1 day",0,{"$f":"IF(V3=0,\"\",INDEX(U3:U102,V3))","v":""},"EC50",0,{"$f":"IF(Y3=0,\"\",INDEX(X3:X102,Y3))","v":""},"Cell density",0,{"$f":"IF(AB3=0,\"\",INDEX(AA3:AA102,AB3))","v":""},"Bacteria",0,{"$f":"IF(AE3=0,\"\",INDEX(AD3:AD102,AE3))","v":""},"Annelida",0,{"$f":"IF(AH3=0,\"\",INDEX(AG3:AG102,AH3))","v":""},"Actinopterygii",0,{"$f":"IF(AK3=0,\"\",INDEX(AJ3:AJ102,AK3))","v":""},"0.45 um filtered well water",0,{"$f":"IF(AN3=0,\"\",INDEX(AM3:AM102,AN3))","v":""},"13.5 (+ - 0.5) C",0,{"$f":"IF(AQ3=0,\"\",INDEX(AP3:AP102,AQ3))","v":""},"Acute ",0,{"$f":"IF(AT3=0,\"\",INDEX(AS3:AS102,AT3))","v":""},8.1,0,{"$f":"IF(AW3=0,\"\",INDEX(AV3:AV102,AW3))","v":""},null,null,"N.A."]
[null,null,"Citation",{"$f":"IF(AL3=\"\",0,1)","v":0},null,{"$f":"IF(H8=\"\",0,1)","v":0},"Lifestage",null,null,"Class",null,null,null,null,"Australian Bass",null,null,"<11 days",null,null,"10 days",null,null,"Growth: Cell growth inhibition",null,null,"Generation time",null,null,"Bacteria",null,null,"Arthropoda",null,null,"Branchiopoda",null,null,"Dechlorinated tap water",null,null,"15°C",null,null,"Chronic",null,null,"6.8 + - 0.1"]
[null,null,null,{"$f":"IF(AO3=\"\",0,1)","v":0},null,{"$f":"IF(W3=\"\",0,1)","v":0},"Exposure duration",null,null,"Media",null,null,null,null,"Ceriodaphnia dubia",null,null,"<24 hour old neonates",null,null,"11 hour",null,null,"Growth: Cell number",null,null,"Generation time: Cell density",null,null,"Fish",null,null,"Arthropoda",null,null,"Branchiopoda",null,null,"Dechlorinated tap water",null,null,"20 (+ - 1) C",null,null,"N.A.",null,null,"6.8 ± 0.1"]
[null,null,null,{"$f":"IF(AR3=\"\",0,1)","v":0},null,{"$f":"IF(Q3=\"\",0,1)","v":0},"Measure of toxicity",null,null,"Temperature ",null,null,null,null,"Chironomus tentans",null,null,"1 month",null,null,"12 hour",null,null,"IC50",null,null,"Growth rate: Cell growth inhibition",null,null,"Fish",null,null,"Arthropoda",null,null,"Branchiopoda",null,null,"Freshwater",null,null,"20°C",null,null,null,null,null,"6.9 + - 0.1"]
[null,null,null,{"$f":"IF(AU3=\"\",0,1)","v":0},null,{"$f":"IF(T3=\"\",0,1)","v":0},"Toxicity endpoint",null,null,"Acute Or Chronic ",null,null,null,null,"Chlorella vulgaris ",null,null,"1 year old",null,null,"13 days",null,null,"LC10",null,null,"Growth. Larval weight",null,null,"Macroinvertebrate",null,null,"Chlorophyta",null,null,"Branchiopoda",null,null,"Marinewater",null,null,"22 C",null,null,null,null,null,"6.9 ± 0.1"]
[null,null,null,null,null,{"$f":"IF(W3=\"\",0,1)","v":0},"Toxicity value",null,null,"PH",null,null,null,null,"Ctenopharyngodon idella",null,null,"1+ years",null,null,"14 days",null,null,"LC50",null,null,"Growth: Blotted wet weight",null,null,"Microalga",null,null,"Chlorophyta",null,null,"Chlorophyceae  ",null,null,"Mineral water with Milli-Q water",null,null,"23 ± 1",null,null,null,null,null,"6.9 ± 1"]
[null,2,"Select the appropriate answer option to each question. Comments can be added to the cells in column H.",null,null,{"$f":"IF(Z3=\"\",0,1)","v":0},null,null,null,"Salinity/Conductivity","N.A.",null,null,null,"Daphnia magna",null,null,"15 day old young",null,null,"15 min",null,null,"LOAEL",null,null,"Growth: Cell number",null,null,"Microinvertebrate",null,null,"Chordata",null,null,"Clitellata",null,null,"N.A.",null,null,"23 C",null,null,null,null,null,"7 - 8.5"]
[null,"*","If the selected answer option does not work try clicking on any other cell first and then click back on the answer option again.",null,null,{"$f":"IF(AC3=\"\",0,1)","v":0},null,null,null,null,null,null,null,null,"Daphnia pulex",null,null,"1st instar larvae (2 days old)",null,null,"21 days",null,null,"LOEC",null,null,"Growth: Chlorophyll-1",null,null,"N.A.",null,null,"Ciliophora",null,null,"Cyanophyceae",null,null,"Non-chlorinated tap water and spring water 1:1",null,null,"23.4 (+ - 0.8) C",null,null,null,null,null,"7.7 - 7.9"]
[null,"No.","Question","Marks Awarded","Answer Options","Option References","Scores","Answers",null,null,null,null,null,null,"hyalella azteca",null,null,"2 day old young",null,null,"24 hour",null,null,"Mortality",null,null,"Growth: Chlorophyll-a",null,null,"Protozoa",null,null,"Cyanobacteria",null,null,"Gammaproteobacteria",null,null,"Not stated",null,null,"24 C",null,null,null,null,null,"N.A."]
[null,null,"Was the duration of the exposure stated (e.g. 48 or 96 h)?",10,null,0,{"$f":"IF(F12=0,0,INDEX($D12:$D13,F12,1))","v":0},null,null,null,null,null,null,null,"Hyalella azteca",null,null,"2 days old",null,null,"28 days",null,null,"N.A.",null,null,"Growth: Length",null,null,"Unknown",null,null,"Mollusca",null,null,"Gammaproteobacteria",null,null,"Proteose-peptone yeast salts complex medium",null,null,"25 ± 1 °C",null,null,null,null,null,"Not measured"]
[null,1,null,0,null,null,null,null,null,null,null,null,null,null,"lumbriculus variegatus",null,null,"5 day old ",null,null,"28 days",null,null,"NOAEL",null,null,"Growth: Morphology (size)",null,null,null,null,null,"N.A.",null,null,"Gastropoda",null,null,"Reconstitution solution",null,null,"25°C",null,null,null,null,null,"Not stated"]
[null,null,null,null,null,null,null,null,null,null,null,null,null,null,"Lumbriculus variegatus",null,null,"Adults",null,null,"3 days",null,null,"NOEC",null,null,"Growth: Weight",null,null,null,null,null,"Proteobacteria",null,null,"Insecta",null,null,"Soft diluted mineral water",null,null,"28 C",null,null,null,null,null,"Not stated"]
[null,null,"Was the biological endpoint (e.g. immobilization or population growth) stated and defined (10 marks)? Award 5 marks if the biological endpoint is only stated.",10,null,0,{"$f":"IF(F15=0,0,INDEX($D15:$D17,F15,1))","v":0},null,null,null,null,null,null,null,"N.A.",null,null,"Adults (5 days old)",null,null,"30 min",null,null,"Survival: Mortality",null,null,"Immobilisation",null,null,null,null,null,"Proteobacteria",null,null,"Malacostraca",null,null,"Supply water",null,null,"35 C",null,null,null,null,null,"PH 6.8 - 7.0"]
[null,2,null,5,null,null,null,null,null,null,null,null,null,null,"Oncorhynchus mykiss",null,null,"Embryo/larval",null,null,"30 minutes",null,null,null,null,null,"Immobility",null,null,null,null,null,"Tracheophyta",null,null,"N.A.",null,null,null,null,null,"N.A.",null,null,null,null,null,"PH11"]
[null,null,null,0,null,null,null,null,null,null,null,null,null,null,"Paratya australiensis",null,null,"Exponential growth phase",null,null,"48 hour",null,null,null,null,null,"Luminescence inhibition",null,null,null,null,null,"Unknown",null,null,"Oligohymenophorea",null,null,null,null,null,"Not stated",null,null,null,null,null,"PH7.0"]
[null,null,"Was the biological effect stated (e.g. LC or NOEC)?",5,null,0,{"$f":"IF(F18=0,0,INDEX($D18:$D19,F18,1))","v":0},null,null,null,null,null,null,null,"Physa gyrina",null,null,"First instar",null,null,"5 days",null,null,null,null,null,"Mortality",null,null,null,null,null,null,null,null,"Trebouxiophyceae",null,null,null,null,null,"Not stated"]
[null,3,null,0,null,null,null,null,null,null,null,null,null,null,"Pimephales promelas",null,null,"First instar, 2 days old",null,null,"6 days",null,null,null,null,null,"Mortality & Reducted weight",null,null,null,null,null,null,null,null,"Unknown"]
[null,null,null,null,null,null,null,null,null,null,null,null,null,null,"Spirulina platensis",null,null,"Juveniles",null,null,"7 days",null,null,null,null,null,"Mortality: Bioluminescence inhibition"]
[null,4,"Was the biological effect quantified (e.g. 50% effect, 25% effect)? \nNote: The effect for NOEC and LOEC data must be quantified.",5,null,0,{"$f":"IF(F21=0,0,INDEX($D21:$D22,F21,1))","v":0},null,null,null,null,null,null,null,"Tetrahymena pyriformis",null,null,"Juveniles (<24 hours after hatching)",null,null,"9 days",null,null,null,null,null,"Mortality: Survival"]
[null,null,null,0,null,null,null,null,null,null,null,null,null,null,"Tetrahymena pyriformis",null,null,"Juveniles (1.5 months)",null,null,"9 hour",null,null,null,null,null,"N.A."]
[null,5,"Were appropriate controls (e.g. a no-toxicant control and/or solvent control) used?",5,null,0,{"$f":"IF(F23=0,0,INDEX($D23:$D24,F23,1))","v":0},null,null,null,null,null,null,null,"Vibrio fischeri",null,null,"N.A.",null,null,"96 hour",null,null,null,null,null,"Reduced weight"]
[null,null,null,0,null,null,null,null,null,null,null,null,null,null,"Vibrio fischeri",null,null,"Neonates",null,null,"96 hour",null,null,null,null,null,"Reproduction"]
[null,null,null,null,null,null,null,null,null,null,null,null,null,null,null,null,null,"Not stated",null,null,"N.A.",null,null,null,null,null,"Reproduction: Number of eggs hatched"]
[null,6,"Was each control and contaminant concentration at least duplicated?",5,null,0,{"$f":"IF(F26=0,0,INDEX($D26:$D27,F26,1))","v":0},null,null,null,null,null,null,null,null,null,null,"Small adults",null,null,null,null,null,null,null,null,"Reproduction: Number of young produced"]
[null,null,null,0,null,null,null,null,null,null,null,null,null,null,null,null,null,null,null,null,null,null,null,null,null,null,"Reproduction: Resting egg production"]
[null,null,null,null,null,null,null,null,null,null,null,null,null,null,null,null,null,null,null,null,null,null,null,null,null,null,"Reproduction: Sex ratio"]
[null,7,"Were test acceptability criteria stated (e.g. mortality in controls must not exceed a certain percentage) (5 marks)?\nOR Were test acceptability criteria inferred (e.g. test method used [USEPA, OECD, ASTM etc.]) (award 2 marks). \nNote: Data that fail the acceptability criteria are automatically deemed to be of unacceptable quality and must not be used. ",5,null,0,{"$f":"IF(F29=0,0,INDEX($D29:$D31,F29,1))","v":0},null,null,null,null,null,null,null,null,null,null,null,null,null,null,null,null,null,null,null,"Survival: Mortality"]
[null,null,null,2]
[null,null,null,0]
[null,8,"Were the characteristics of the test organism (e.g. length, mass, age) stated?",5,null,0,{"$f":"IF(F32=0,0,INDEX($D32:$D34,F32,1))","v":0}]
[null,null,null,0]
[]
[null,9,"Was the type of test media used stated?",5,null,0,{"$f":"IF(F35=0,0,INDEX($D35:$D37,F35,1))","v":0}]
[null,null,null,0]
[]
[null,null,"Was the type of exposure (e.g. static, flow through) stated? ",4,null,0,{"$f":"IF(F38=0,0,INDEX($D38:$D40,F38,1))","v":0}]
[null,10,null,0]
[]
[null,null,"Were the contaminant concentrations measured at the beginning and end of the exposure (4 marks)? Award 2 marks if they were measured only once during the test.\nNote: If the concentrations were not measured then automatically the data cannot be high quality. ",4,null,0,{"$f":"IF(F41=0,0,INDEX($D41:$D43,F41,1))","v":0}]
[null,11,null,2]
[null,null,null,0]
[null,null,"Were parallel reference toxicant toxicity tests conducted?",4,null,0,{"$f":"IF(F44=0,0,INDEX($D44:$D46,F44,1))","v":0}]
[null,12,null,0]
[]
[null,null,"Was there a concentration–response relationship either observable or stated?",4,null,0,{"$f":"IF(F47=0,0,INDEX($D47:$D49,F47,1))","v":0}]
[null,13,null,0]
[]
[null,null,"Was an appropriate statistical method or model used to determine the toxicity?\nNote: They should be accepted by a recognised national or international regulatory body (e.g. USEPA, OECD, ASTM). ",4,null,0,{"$f":"IF(F50=0,0,INDEX($D50:$D52,F50,1))","v":0}]
[null,14,null,0]
[]
[null,15,"For LC/EC/BEC data was an estimate of variability provided? \nOR \nFor NO EC/LOEC data was the significance level 0.05 or less?  \n\n",4,null,0,{"$f":"IF(F53=0,0,INDEX($D53:$D55,F53,1))","v":0}]
[null,null,null,0]
[]
[null,16,"Were the following parameters measured and stated? (3 marks if measured and stated, 1 mark if just measured)."]
[null,null,null,3,null,0,{"$f":"IF(F57=0,0,INDEX($D57:$D59,F57,1))","v":0}]
[null,16.100000000000001,"pH",1]
[null,null,null,0]
[null,null,null,3,null,0,{"$f":"IF(F60=0,0,INDEX($D60:$D62,F60,1))","v":0}]
[null,16.2,"Dissolved Oxygen",1]
[null,null,null,0]
[null,null,"Was the temperature measured and stated (3 marks)? Award 1 mark if the temperature was measured but not stated or if only the temperature settings of the room or chamber are stated.",3,null,0,{"$f":"IF(F63=0,0,INDEX(D63:D65,F63,1))","v":0}]
[null,17,null,1]
[null,null,null,0]
[null,null,"Were test solutions, blanks and/or controls tested for contamination OR were analytical reagent grade chemicals used or the highest possible purity chemicals used for the experiment? (3 marks).",3,null,0,{"$f":"IF(F66=0,0,INDEX($D66:$D67,F66,1))","v":0}]
[null,18,null,0]
[]
[null,null,null,null,null,null,null,null,{"$f":"(COUNTIF(F12:F67,\"=0\"))+COUNTIF(F2:F10,\"=0\")+COUNTIF(D2:D7,\"=0\")","v":34}]
[]
[]
[null,null,"Total score",null,null,null,{"$f":"IF(SUM(G12:G66)=0,\"\",SUM(G12:G66))","v":""}]
[null,null,"Total Max. possible score for the various types of data and contaminants ",null,{"$f":"D12+D15+D18+D21+D23+D26+D29+D32+D35+D38+D41+D44+D47+D50+D53+D57+D60+D63+D66","v":91}]
[null,null,"Quality Score",null,{"$f":"\"= [Total score / Total possible score] * 100 = \"","v":"= [Total score / Total possible score] * 100 = "},null,{"$f":"IF(ISERROR(G72/E73),#N/A,G72/E73)","v":{"$error":"#N/A"}},{"$f":"IF(F41=3,\"The highest possible grade for this datum is acceptable.\",\"\")","v":""}]
[]
[null,null,"H = high quality                           Quality score ≥ 80%      "]
[null,null,"A = acceptable quality         > 50% Quality score < 80%        "]
[null,null,"U = unacceptable quality              Quality score ≤ 50%  "]
[]
[3,null,"Click the 'Save & Update' button to save and export the answers to the 'All results' worksheet. "]
[null,null,"Select the 'Reset Answers' button if you wish to clear all answers."]

{"sheet":"FW nonmetal nonplant_WS","index":8,"n_rows":381,"n_cols":24,"rows_kept":381,"cut":false,"hidden":false,"merged":[]}
[]
["Question No.",1,2,3,4,5,6,7,8,9,10,11,12,13,14,15,16.100000000000001,16.600000000000001,17,18,"Total Score","Quality Score",null,"Comment "]
["Short Questions","Duration of the exposure ","Biological endpoint","Biological effect stated or not","Biological effect quantified or not","Appropriate controls","Control & contaminant concentration","Test acceptability criteria","Characteristics of the test organism"," Type of test media","Type of exposure","Contaminant concentrations","Parallel reference toxicant toxicity tests","Concentration–response relationship","Determine the toxicity","NOEC/LOEC or LC/EC/BEC","pH","Dissolved oxygen","Temperature","Grade or purity"]
["Category","Freshwater/non-metal/non- plant","Paper and data unique identifier(eg. 1-1,10-150)","948-1"]
["Scores",10,10,5,5,5,5,2,5,0,0,0,0,4,4,4,0,0,3,3,65,0.7142857142857143,null,"The highest possible grade for this datum is acceptable."]
["Answers","","","","","","","","","","","","","","","","","","",""]
["Category","Freshwater/non-metal/non- plant","Paper and data unique identifier(eg. 1-1,10-150)","948-2"]
["Scores",10,10,5,0,5,5,2,5,0,0,0,0,4,4,0,0,0,3,3,56,0.61538461538461542,null,"The highest possible grade for this datum is acceptable."]
["Answers","","","","","","","","","","","","","","","","","","",""]
["Category","Freshwater/non-metal/non- plant","Paper and data unique identifier(eg. 1-1,10-150)","721-1"]
["Scores",10,10,5,5,5,0,2,5,0,4,2,0,4,4,4,1,1,1,3,66,0.72527472527472525,null,""]
["Answers","","","","","","","","","","","","","","","","","","",""]
["Category","Freshwater/non-metal/non- plant","Paper and data unique identifier(eg. 1-1,10-150)","950-1"]
["Scores",10,10,5,5,5,5,5,5,0,4,4,0,0,4,4,3,3,3,3,78,0.8571428571428571,null,""]
["Answers","","","","","","","","","","","","","","","","","","",""]
["Category","Freshwater/non-metal/non- plant","Paper and data unique identifier(eg. 1-1,10-150)","952-1"]
["Scores",10,5,5,5,0,0,0,5,5,4,0,0,4,4,4,3,1,3,3,61,0.67032967032967028,null,"The highest possible grade for this datum is acceptable."]
["Answers","","","","","","","","","","","","","","","","","","",""]
["Category","Freshwater/non-metal/non- plant","Paper and data unique identifier(eg. 1-1,10-150)","952-2"]
["Scores",10,5,5,5,0,0,0,5,5,4,0,0,4,4,4,3,1,3,3,61,0.67032967032967028,null,"The highest possible grade for this datum is acceptable."]
["Answers","","","","","","","","","","","","","","","","","","",""]
["Category","Freshwater/non-metal/non- plant","Paper and data unique identifier(eg. 1-1,10-150)","952-3"]
["Scores",10,5,5,5,0,0,0,5,5,4,0,0,4,4,4,3,1,3,3,61,0.67032967032967028,null,"The highest possible grade for this datum is acceptable."]
["Answers","","","","","","","","","","","","","","","","","","",""]
["Category","Freshwater/non-metal/non- plant","Paper and data unique identifier(eg. 1-1,10-150)","956-1"]
["Scores",10,5,5,5,5,5,0,5,0,4,2,0,0,4,4,3,1,0,3,61,0.67032967032967028,null,""]
["Answers","","","","","","","","","","…solution was not renewed'","","","","","","","Actually only stated that it was measured, specific value not given. ","",""]
["Category","Freshwater/non-metal/non- plant","Paper and data unique identifier(eg. 1-1,10-150)","956-2"]
["Scores",10,5,5,5,5,5,0,5,0,4,2,0,0,4,4,3,1,0,3,61,0.67032967032967028,null,""]
["Answers","","","","","","","","","","…solution was not renewed'","","","","","","","Actually only stated that it was measured, specific value not given. ","",""]
["Category","Freshwater/non-metal/non- plant","Paper and data unique identifier(eg. 1-1,10-150)","956-3"]
["Scores",10,5,5,5,5,5,0,5,0,4,2,0,0,4,4,3,1,0,3,61,0.67032967032967028,null,""]
["Answers","","","","","","","","","","…solution was not renewed'","","","","","","","Actually only stated that it was measured, specific value not given. ","",""]
["Category","Freshwater/non-metal/non- plant","Paper and data unique identifier(eg. 1-1,10-150)","956-4"]
["Scores",10,5,5,5,5,5,0,5,0,4,2,0,0,4,4,3,1,0,3,61,0.67032967032967028,null,""]
["Answers","","","","","","","","","","…solution was not renewed'","","","","","","","Actually only stated that it was measured, specific value not given. ","",""]
["Category","Freshwater/non-metal/non- plant","Paper and data unique identifier(eg. 1-1,10-150)","956-5"]
["Scores",10,5,5,5,5,5,0,5,0,4,2,0,0,4,4,3,1,0,3,61,0.67032967032967028,null,""]
["Answers","","","","","","","","","","Half the test solution was renewed on day 5'","","","","","","","Actually only stated that it was measured, specific value not given. ","",""]
["Category","Freshwater/non-metal/non- plant","Paper and data unique identifier(eg. 1-1,10-150)","956-6"]
["Scores",10,5,5,5,5,5,0,5,0,4,2,0,0,4,4,3,1,0,3,61,0.67032967032967028,null,""]
["Answers","","","","","","","","","","Half the test solution was renewed on day 5'","","","","","","","Actually only stated that it was measured, specific value not given. ","",""]
["Category","Freshwater/non-metal/non- plant","Paper and data unique identifier(eg. 1-1,10-150)","956-7"]
["Scores",10,5,5,5,5,5,0,5,0,4,2,0,0,4,4,3,1,0,3,61,0.67032967032967028,null,""]
["Answers","","","","","","","","","","Half the test solution was renewed on day 5'","","","","","","","Actually only stated that it was measured, specific value not given. ","",""]
["Category","Freshwater/non-metal/non- plant","Paper and data unique identifier(eg. 1-1,10-150)","956-8"]
["Scores",10,5,5,5,5,5,0,5,0,4,2,0,0,4,4,3,1,0,3,61,0.67032967032967028,null,""]
["Answers","","","","","","","","","","Half the test solution was renewed on day 5'","","","","","","","Actually only stated that it was measured, specific value not given. ","",""]
["Category","Freshwater/non-metal/non- plant","Paper and data unique identifier(eg. 1-1,10-150)","956-9"]
["Scores",10,5,5,5,5,5,0,5,0,4,2,0,0,4,4,3,1,0,3,61,0.67032967032967028,null,""]
["Answers","","","","","","","","","","Test solution renewed (1/2 beaker volume) on day 7.","","","","","","","Actually only stated that it was measured, specific value not given. ","",""]
["Category","Freshwater/non-metal/non- plant","Paper and data unique identifier(eg. 1-1,10-150)","956-10"]
["Scores",10,5,5,5,5,5,0,5,0,4,2,0,0,4,4,3,1,0,3,61,0.67032967032967028,null,""]
["Answers","","","","","","","","","","Test solution renewed (1/2 beaker volume) on day 7.","","","","","","","Actually only stated that it was measured, specific value not given. ","",""]
["Category","Freshwater/non-metal/non- plant","Paper and data unique identifier(eg. 1-1,10-150)","956-11"]
["Scores",10,5,5,5,5,5,0,5,0,4,2,0,0,4,4,3,1,0,3,61,0.67032967032967028,null,""]
["Answers","","","","","","","","","","Test solution renewed (1/2 beaker volume) on day 7.","","","","","","","Actually only stated that it was measured, specific value not given. ","",""]
["Category","Freshwater/non-metal/non- plant","Paper and data unique identifier(eg. 1-1,10-150)","956-11"]
["Scores",10,5,5,5,5,5,0,5,0,4,2,0,0,4,4,3,1,0,3,61,0.67032967032967028,null,""]
["Answers","","","","","","","","","","Test solution renewed (1/2 beaker volume) on day 7.","","","","","","","Actually only stated that it was measured, specific value not given. ","",""]
["Category","Freshwater/non-metal/non- plant","Paper and data unique identifier(eg. 1-1,10-150)","956-12"]
["Scores",10,5,5,5,5,5,0,5,0,4,2,0,0,4,4,3,1,0,3,61,0.67032967032967028,null,""]
["Answers","","","","","","","","","","Test solution renewed (1/2 beaker volume) on day 7.","","","","","","","Actually only stated that it was measured, specific value not given. ","",""]
["Category","Freshwater/non-metal/non- plant","Paper and data unique identifier(eg. 1-1,10-150)","956-13"]
["Scores",10,5,5,5,5,5,0,5,0,4,2,0,0,4,0,3,1,0,3,57,0.62637362637362637,null,""]
["Answers","","","","","","","","","","Half the test solution was renewed on day 5'","","","","","","","Actually only stated that it was measured, specific value not given. ","",""]
["Category","Freshwater/non-metal/non- plant","Paper and data unique identifier(eg. 1-1,10-150)","956-14"]
["Scores",10,5,5,5,5,5,0,5,0,4,2,0,0,4,4,3,1,0,3,61,0.67032967032967028,null,""]
["Answers","","","","","","","","","","Half the test solution was renewed on day 5'","","","","","","","Actually only stated that it was measured, specific value not given. ","",""]
["Category","Freshwater/non-metal/non- plant","Paper and data unique identifier(eg. 1-1,10-150)","956-15"]
["Scores",10,5,5,5,5,5,0,5,0,4,2,0,0,4,4,3,1,0,3,61,0.67032967032967028,null,""]
["Answers","","","","","","","","","","Half the test solution was renewed on day 5'","","","","","","","Actually only stated that it was measured, specific value not given. ","",""]
["Category","Freshwater/non-metal/non- plant","Paper and data unique identifier(eg. 1-1,10-150)","956-16"]
["Scores",10,5,5,5,5,5,0,5,0,4,2,0,0,4,4,3,1,0,3,61,0.67032967032967028,null,""]
["Answers","","","","","","","","","","Half the test solution was renewed on day 5'","","","","","","","Actually only stated that it was measured, specific value not given. ","",""]
["Category","Freshwater/non-metal/non- plant","Paper and data unique identifier(eg. 1-1,10-150)","956-17"]
["Scores",10,5,5,5,5,5,0,5,0,4,2,0,0,4,4,3,1,0,3,61,0.67032967032967028,null,""]
["Answers","","","","","","","","","","Half the test solution was renewed on day 5'","","","","","","","Actually only stated that it was measured, specific value not given. ","",""]
["Category","Freshwater/non-metal/non- plant","Paper and data unique identifier(eg. 1-1,10-150)","956-18"]
["Scores",10,5,5,5,5,5,0,5,0,4,2,0,0,4,4,3,1,0,3,61,0.67032967032967028,null,""]
["Answers","","","","","","","","","","Half the test solution was renewed on day 5'","","","","","","","Actually only stated that it was measured, specific value not given. ","",""]
["Category","Freshwater/non-metal/non- plant","Paper and data unique identifier(eg. 1-1,10-150)","956-21"]
["Scores",10,5,5,5,5,5,0,5,0,4,2,0,0,4,4,3,1,0,3,61,0.67032967032967028,null,""]
["Answers","","","","","","","","","","Half the test solution was renewed on day 5'","","","","","","","Actually only stated that it was measured, specific value not given. ","",""]
["Category","Freshwater/non-metal/non- plant","Paper and data unique identifier(eg. 1-1,10-150)","956-22"]
["Scores",10,5,5,5,5,5,0,5,0,4,2,0,0,4,4,3,1,0,3,61,0.67032967032967028,null,""]
["Answers","","","","","","","","","","Half the test solution was renewed on day 5'","","","","","","","Actually only stated that it was measured, specific value not given. ","",""]
["Category","Freshwater/non-metal/non- plant","Paper and data unique identifier(eg. 1-1,10-150)","957-1"]
["Scores",10,5,5,5,5,5,5,5,5,4,0,0,0,4,4,0,3,0,0,65,0.7142857142857143,null,"The highest possible grade for this datum is acceptable."]
["Answers","","","","","","","","","","","","","","","","","","","Purity not stated"]
["Category","Freshwater/non-metal/non- plant","Paper and data unique identifier(eg. 1-1,10-150)","957-2"]
["Scores",10,5,5,5,5,5,5,5,5,4,0,0,0,4,4,0,3,0,0,65,0.7142857142857143,null,"The highest possible grade for this datum is acceptable."]
["Answers","","","","","","","","","","","","","","","","","","","Purity not stated"]
["Category","Freshwater/non-metal/non- plant","Paper and data unique identifier(eg. 1-1,10-150)","957-3"]
["Scores",10,5,5,5,5,5,5,5,5,4,0,0,0,4,4,0,3,0,0,65,0.7142857142857143,null,"The highest possible grade for this datum is acceptable."]
["Answers","","","","","","","","","","","","","","","","","","","Purity not stated"]
["Category","Freshwater/non-metal/non- plant","Paper and data unique identifier(eg. 1-1,10-150)","957-4"]
["Scores",10,5,5,5,5,5,5,5,5,4,0,0,0,4,4,0,3,0,0,65,0.7142857142857143,null,"The highest possible grade for this datum is acceptable."]
["Answers","","","","","","","","","","","","","","","","","","","Purity not stated"]
["Category","Freshwater/non-metal/non- plant","Paper and data unique identifier(eg. 1-1,10-150)","944-1"]
["Scores",10,10,5,5,5,5,0,5,5,0,0,0,4,4,4,0,0,3,3,68,0.74725274725274726,null,"The highest possible grade for this datum is acceptable."]
["Answers","","","","","","","","","","","","","","","","","","",""]
["Category","Freshwater/non-metal/non- plant","Paper and data unique identifier(eg. 1-1,10-150)","944-2"]
["Scores",10,10,5,5,5,5,0,5,5,0,0,0,4,4,4,0,0,3,3,68,0.74725274725274726,null,"The highest possible grade for this datum is acceptable."]
["Answers","","","","","","","","","","","","","","","","","","",""]
["Category","Freshwater/non-metal/non- plant","Paper and data unique identifier(eg. 1-1,10-150)","944-3"]
["Scores",10,10,5,5,5,5,0,5,5,0,0,0,4,4,4,0,0,3,3,68,0.74725274725274726,null,"The highest possible grade for this datum is acceptable."]
["Answers","","","","","","","","","","","","","","","","","","",""]
["Category","Freshwater/non-metal/non- plant","Paper and data unique identifier(eg. 1-1,10-150)","865-1-RE"]
["Scores",10,10,0,0,5,5,0,0,5,0,0,0,4,4,4,0,0,3,0,50,0.5494505494505495,null,"The highest possible grade for this datum is acceptable."]
["Answers","","","","","","","","","","","","","","","","","","",""]
["Category","Freshwater/non-metal/non- plant","Paper and data unique identifier(eg. 1-1,10-150)","865-2-RE"]
["Scores",10,10,0,0,5,5,0,0,5,0,0,0,4,4,4,0,0,3,0,50,0.5494505494505495,null,"The highest possible grade for this datum is acceptable."]
["Answers","","","","","","","","","","","","","","","","","","",""]
["Category","Freshwater/non-metal/non- plant","Paper and data unique identifier(eg. 1-1,10-150)","865-3-RE"]
["Scores",10,10,0,0,5,5,0,0,5,0,0,0,4,4,4,0,0,3,0,50,0.5494505494505495,null,"The highest possible grade for this datum is acceptable."]
["Answers","","","","","","","","","","","","","","","","","","",""]
["Category","Freshwater/non-metal/non- plant","Paper and data unique identifier(eg. 1-1,10-150)","865-4-RE"]
["Scores",10,10,0,0,5,5,0,0,5,0,0,0,4,4,4,0,0,3,0,50,0.5494505494505495,null,"The highest possible grade for this datum is acceptable."]
["Answers","","","","","","","","","","","","","","","","","","",""]
["Category","Freshwater/non-metal/non- plant","Paper and data unique identifier(eg. 1-1,10-150)","865-5-RE"]
["Scores",10,10,0,0,5,5,0,0,5,0,0,0,4,4,4,0,0,3,0,50,0.5494505494505495,null,"The highest possible grade for this datum is acceptable."]
["Answers","","","","","","","","","","","","","","","","","","",""]
["Category","Freshwater/non-metal/non- plant","Paper and data unique identifier(eg. 1-1,10-150)","865-6-RE"]
["Scores",10,10,0,0,5,5,0,0,5,0,0,0,4,4,4,0,0,3,0,50,0.5494505494505495,null,"The highest possible grade for this datum is acceptable."]
["Answers","","","","","","","","","","","","","","","","","","",""]
["Category","Freshwater/non-metal/non- plant","Paper and data unique identifier(eg. 1-1,10-150)","865-7-RE"]
["Scores",10,10,0,0,5,5,0,0,5,0,0,0,4,4,4,0,0,3,0,50,0.5494505494505495,null,"The highest possible grade for this datum is acceptable."]
["Answers","","","","","","","","","","","","","","","","","","",""]
["Category","Freshwater/non-metal/non- plant","Paper and data unique identifier(eg. 1-1,10-150)","865-8-RE"]
["Scores",10,10,0,0,5,5,0,0,5,0,0,0,4,4,4,0,0,3,0,50,0.5494505494505495,null,"The highest possible grade for this datum is acceptable."]
["Answers","","","","","","","","","","","","","","","","","","",""]
["Category","Freshwater/non-metal/non- plant","Paper and data unique identifier(eg. 1-1,10-150)","865-9-RE"]
["Scores",10,10,0,0,5,5,0,0,5,0,0,0,4,4,4,0,0,3,0,50,0.5494505494505495,null,"The highest possible grade for this datum is acceptable."]
["Answers","","","","","","","","","","","","","","","","","","",""]
["Category","Freshwater/non-metal/non- plant","Paper and data unique identifier(eg. 1-1,10-150)","865-10-RE"]
["Scores",10,10,0,0,5,5,0,0,5,0,0,0,4,4,4,0,0,3,0,50,0.5494505494505495,null,"The highest possible grade for this datum is acceptable."]
["Answers","","","","","","","","","","","","","","","","","","",""]
["Category","Freshwater/non-metal/non- plant","Paper and data unique identifier(eg. 1-1,10-150)","865-11-RE"]
["Scores",10,10,0,0,5,5,0,0,5,0,0,0,4,4,4,0,0,3,0,50,0.5494505494505495,null,"The highest possible grade for this datum is acceptable."]
["Answers","","","","","","","","","","","","","","","","","","",""]
["Category","Freshwater/non-metal/non- plant","Paper and data unique identifier(eg. 1-1,10-150)","865-12-RE"]
["Scores",10,10,0,0,5,5,0,0,5,0,0,0,4,4,4,0,0,3,0,50,0.5494505494505495,null,"The highest possible grade for this datum is acceptable."]
["Answers","","","","","","","","","","","","","","","","","","",""]
["Category","Freshwater/non-metal/non- plant","Paper and data unique identifier(eg. 1-1,10-150)","865-13-RE"]
["Scores",10,10,0,0,5,5,0,0,5,0,0,0,4,4,4,0,0,3,0,50,0.5494505494505495,null,"The highest possible grade for this datum is acceptable."]
["Answers","","","","","","","","","","","","","","","","","","",""]
["Category","Freshwater/non-metal/non- plant","Paper and data unique identifier(eg. 1-1,10-150)","865-14-RE"]
["Scores",10,10,0,0,5,5,0,0,5,0,0,0,4,4,4,0,0,3,0,50,0.5494505494505495,null,"The highest possible grade for this datum is acceptable."]
["Answers","","","","","","","","","","","","","","","","","","",""]
["Category","Freshwater/non-metal/non- plant","Paper and data unique identifier(eg. 1-1,10-150)","865-15-RE"]
["Scores",10,10,0,0,5,5,0,0,5,0,0,0,4,4,4,0,0,3,0,50,0.5494505494505495,null,"The highest possible grade for this datum is acceptable."]
["Answers","","","","","","","","","","","","","","","","","","",""]
["Category","Freshwater/non-metal/non- plant","Paper and data unique identifier(eg. 1-1,10-150)","865-16-RE"]
["Scores",10,10,0,0,5,5,0,0,5,0,0,0,4,4,4,0,0,3,0,50,0.5494505494505495,null,"The highest possible grade for this datum is acceptable."]
["Answers","","","","","","","","","","","","","","","","","","",""]
["Category","Freshwater/non-metal/non- plant","Paper and data unique identifier(eg. 1-1,10-150)","865-17-RE"]
["Scores",10,10,0,0,5,5,0,0,5,0,0,0,4,4,4,0,0,3,0,50,0.5494505494505495,null,"The highest possible grade for this datum is acceptable."]
["Answers","","","","","","","","","","","","","","","","","","",""]
["Category","Freshwater/non-metal/non- plant","Paper and data unique identifier(eg. 1-1,10-150)","865-18-RE"]
["Scores",10,10,0,0,5,5,0,0,5,0,0,0,4,4,4,0,0,3,0,50,0.5494505494505495,null,"The highest possible grade for this datum is acceptable."]
["Answers","","","","","","","","","","","","","","","","","","",""]
["Category","Freshwater/non-metal/non- plant","Paper and data unique identifier(eg. 1-1,10-150)","865-19-RE"]
["Scores",10,10,0,0,5,5,0,0,5,0,0,0,4,4,4,0,0,3,0,50,0.5494505494505495,null,"The highest possible grade for this datum is acceptable."]
["Answers","","","","","","","","","","","","","","","","","","",""]
["Category","Freshwater/non-metal/non- plant","Paper and data unique identifier(eg. 1-1,10-150)","865-20-RE"]
["Scores",10,10,0,0,5,5,0,0,5,0,0,0,4,4,4,0,0,3,0,50,0.5494505494505495,null,"The highest possible grade for this datum is acceptable."]
["Answers","","","","","","","","","","","","","","","","","","",""]
["Category","Freshwater/non-metal/non- plant","Paper and data unique identifier(eg. 1-1,10-150)","865-21-RE"]
["Scores",10,10,0,0,5,5,0,0,5,0,0,0,4,4,4,0,0,3,0,50,0.5494505494505495,null,"The highest possible grade for this datum is acceptable."]
["Answers","","","","","","","","","","","","","","","","","","",""]
["Category","Freshwater/non-metal/non- plant","Paper and data unique identifier(eg. 1-1,10-150)","865-22-RE"]
["Scores",10,10,0,0,5,5,0,0,5,0,0,0,4,4,4,0,0,3,0,50,0.5494505494505495,null,"The highest possible grade for this datum is acceptable."]
["Answers","","","","","","","","","","","","","","","","","","",""]
["Category","Freshwater/non-metal/non- plant","Paper and data unique identifier(eg. 1-1,10-150)","865-23-RE"]
["Scores",10,10,0,0,5,5,0,0,5,0,0,0,4,4,4,0,0,3,0,50,0.5494505494505495,null,"The highest possible grade for this datum is acceptable."]
["Answers","","","","","","","","","","","","","","","","","","",""]
["Category","Freshwater/non-metal/non- plant","Paper and data unique identifier(eg. 1-1,10-150)","865-24-RE"]
["Scores",10,10,0,0,5,5,0,0,5,0,0,0,4,4,4,0,0,3,0,50,0.5494505494505495,null,"The highest possible grade for this datum is acceptable."]
["Answers","","","","","","","","","","","","","","","","","","",""]
["Category","Freshwater/non-metal/non- plant","Paper and data unique identifier(eg. 1-1,10-150)","865-25-RE"]
["Scores",10,10,0,0,5,5,0,0,5,0,0,0,4,4,4,0,0,3,0,50,0.5494505494505495,null,"The highest possible grade for this datum is acceptable."]
["Answers","","","","","","","","","","","","","","","","","","",""]
["Category","Freshwater/non-metal/non- plant","Paper and data unique identifier(eg. 1-1,10-150)","865-26-RE"]
["Scores",10,10,0,0,5,5,0,0,5,0,0,0,4,4,4,0,0,3,0,50,0.5494505494505495,null,"The highest possible grade for this datum is acceptable."]
["Answers","","","","","","","","","","","","","","","","","","",""]
["Category","Freshwater/non-metal/non- plant","Paper and data unique identifier(eg. 1-1,10-150)","865-27-RE"]
["Scores",10,10,0,0,5,5,0,0,5,0,0,0,4,4,4,0,0,3,0,50,0.5494505494505495,null,"The highest possible grade for this datum is acceptable."]
["Answers","","","","","","","","","","","","","","","","","","",""]
["Category","Freshwater/non-metal/non- plant","Paper and data unique identifier(eg. 1-1,10-150)","865-28-RE"]
["Scores",10,10,0,0,5,5,0,0,5,0,0,0,4,4,4,0,0,3,0,50,0.5494505494505495,null,"The highest possible grade for this datum is acceptable."]
["Answers","","","","","","","","","","","","","","","","","","",""]
["Category","Freshwater/non-metal/non- plant","Paper and data unique identifier(eg. 1-1,10-150)","865-29-RE"]
["Scores",10,10,0,0,5,5,0,0,5,0,0,0,4,4,4,0,0,3,0,50,0.5494505494505495,null,"The highest possible grade for this datum is acceptable."]
["Answers","","","","","","","","","","","","","","","","","","",""]
["Category","Freshwater/non-metal/non- plant","Paper and data unique identifier(eg. 1-1,10-150)","865-30-RE"]
["Scores",10,10,0,0,5,5,0,0,5,0,0,0,4,4,4,0,0,3,0,50,0.5494505494505495,null,"The highest possible grade for this datum is acceptable."]
["Answers","","","","","","","","","","","","","","","","","","",""]
["Category","Freshwater/non-metal/non- plant","Paper and data unique identifier(eg. 1-1,10-150)","865-31-RE"]
["Scores",10,10,0,0,5,5,0,0,5,0,0,0,4,4,4,0,0,3,0,50,0.5494505494505495,null,"The highest possible grade for this datum is acceptable."]
["Answers","","","","","","","","","","","","","","","","","","",""]
["Category","Freshwater/non-metal/non- plant","Paper and data unique identifier(eg. 1-1,10-150)","865-32-RE"]
["Scores",10,10,0,0,5,5,0,0,5,0,0,0,4,4,4,0,0,3,0,50,0.5494505494505495,null,"The highest possible grade for this datum is acceptable."]
["Answers","","","","","","","","","","","","","","","","","","",""]
["Category","Freshwater/non-metal/non- plant","Paper and data unique identifier(eg. 1-1,10-150)","865-33-RE"]
["Scores",10,10,0,0,5,5,0,0,5,0,0,0,4,4,4,0,0,3,0,50,0.5494505494505495,null,"The highest possible grade for this datum is acceptable."]
["Answers","","","","","","","","","","","","","","","","","","",""]
["Category","Freshwater/non-metal/non- plant","Paper and data unique identifier(eg. 1-1,10-150)","865-34-RE"]
["Scores",10,10,0,0,5,5,0,0,5,0,0,0,4,4,4,0,0,3,0,50,0.5494505494505495,null,"The highest possible grade for this datum is acceptable."]
["Answers","","","","","","","","","","","","","","","","","","",""]
["Category","Freshwater/non-metal/non- plant","Paper and data unique identifier(eg. 1-1,10-150)","865-35-RE"]
["Scores",10,10,0,0,5,5,0,0,5,0,0,0,4,4,4,0,0,3,0,50,0.5494505494505495,null,"The highest possible grade for this datum is acceptable."]
["Answers","","","","","","","","","","","","","","","","","","",""]
["Category","Freshwater/non-metal/non- plant","Paper and data unique identifier(eg. 1-1,10-150)","865-36-RE"]
["Scores",10,10,0,0,5,5,0,0,5,0,0,0,4,4,4,0,0,3,0,50,0.5494505494505495,null,"The highest possible grade for this datum is acceptable."]
["Answers","","","","","","","","","","","","","","","","","","",""]
["Category","Freshwater/non-metal/non- plant","Paper and data unique identifier(eg. 1-1,10-150)","865-37-RE"]
["Scores",10,10,0,0,5,5,0,0,5,0,0,0,4,4,4,0,0,3,0,50,0.5494505494505495,null,"The highest possible grade for this datum is acceptable."]
["Answers","","","","","","","","","","","","","","","","","","",""]
["Category","Freshwater/non-metal/non- plant","Paper and data unique identifier(eg. 1-1,10-150)","646-1-RE2"]
["Scores",10,10,0,0,5,5,0,0,5,0,0,0,4,4,4,0,0,1,0,48,0.52747252747252749,null,"The highest possible grade for this datum is acceptable."]
["Answers","","","","","","","","","","","","","","","","","","",""]
["Category","Freshwater/non-metal/non- plant","Paper and data unique identifier(eg. 1-1,10-150)","646-2-RE2"]
["Scores",10,10,0,0,5,5,0,0,5,0,0,0,4,4,4,0,0,1,0,48,0.52747252747252749,null,"The highest possible grade for this datum is acceptable."]
["Answers","","","","","","","","","","","","","","","","","","",""]
["Category","Freshwater/non-metal/non- plant","Paper and data unique identifier(eg. 1-1,10-150)","646-3-RE2"]
["Scores",10,10,0,0,5,5,0,0,5,0,0,0,4,4,4,0,0,1,0,48,0.52747252747252749,null,"The highest possible grade for this datum is acceptable."]
["Answers","","","","","","","","","","","","","","","","","","",""]
["Category","Freshwater/non-metal/non- plant","Paper and data unique identifier(eg. 1-1,10-150)","646-4-RE2"]
["Scores",10,10,0,0,5,5,0,0,5,0,0,0,4,4,4,0,0,1,0,48,0.52747252747252749,null,"The highest possible grade for this datum is acceptable."]
["Answers","","","","","","","","","","","","","","","","","","",""]
["Category","Freshwater/non-metal/non- plant","Paper and data unique identifier(eg. 1-1,10-150)","646-5-RE2"]
["Scores",10,10,0,0,5,5,0,0,5,0,0,0,4,4,4,0,0,1,0,48,0.52747252747252749,null,"The highest possible grade for this datum is acceptable."]
["Answers","","","","","","","","","","","","","","","","","","",""]
["Category","Freshwater/non-metal/non- plant","Paper and data unique identifier(eg. 1-1,10-150)","655-1"]
["Scores",10,5,5,5,5,5,2,5,5,4,0,0,0,4,4,0,3,1,3,66,0.72527472527472525,null,"The highest possible grade for this datum is acceptable."]
["Answers","7, 14, 21, 28 days.","Mortality","LC",50,"No toxicant controls.","2 independent replicates","Experiments in which mortality of the control\nwas more than 15% were disregarded when calculating the LC50 of the test compounds.","Juveniles that hatched within 24 hours prior to the test.","Dechlorinated tap water - no aeration.","Static renewal (every 2-3 days).","Nominal concentrations.","No.","No.","Calculate dyusing EcoTox-Statistics version 1.1","95% Confidence Intervals","Not measured.",">85%","20°C of incubator",0.98699999999999999]
["Category","Freshwater/non-metal/non- plant","Paper and data unique identifier(eg. 1-1,10-150)","655-2"]
["Scores",10,5,5,5,5,5,2,5,5,4,0,0,0,4,4,0,3,1,3,66,0.72527472527472525,null,"The highest possible grade for this datum is acceptable."]
["Answers","7, 14, 21, 28 days.","Mortality","LC",50,"No toxicant controls.","2 independent replicates","Experiments in which mortality of the control\nwas more than 15% were disregarded when calculating the LC50 of the test compounds.","Juveniles that hatched within 24 hours prior to the test.","Dechlorinated tap water - no aeration.","Static renewal (every 2-3 days).","Nominal concentrations.","No.","No.","Calculate dyusing EcoTox-Statistics version 1.1","95% Confidence Intervals","Not measured.",">85%","20°C of incubator",0.98699999999999999]
["Category","Freshwater/non-metal/non- plant","Paper and data unique identifier(eg. 1-1,10-150)","655-3"]
["Scores",10,5,5,5,5,5,2,5,5,4,0,0,0,4,4,0,3,1,3,66,0.72527472527472525,null,"The highest possible grade for this datum is acceptable."]
["Answers","7, 14, 21, 28 days.","Mortality","LC",50,"No toxicant controls.","2 independent replicates","Experiments in which mortality of the control\nwas more than 15% were disregarded when calculating the LC50 of the test compounds.","Juveniles that hatched within 24 hours prior to the test.","Dechlorinated tap water - no aeration.","Static renewal (every 2-3 days).","Nominal concentrations.","No.","No.","Calculate dyusing EcoTox-Statistics version 1.1","95% Confidence Intervals","Not measured.",">85%","20°C of incubator",0.98699999999999999]
["Category","Freshwater/non-metal/non- plant","Paper and data unique identifier(eg. 1-1,10-150)","655-4"]
["Scores",10,5,5,5,5,5,2,5,5,4,0,0,0,4,4,0,3,1,3,66,0.72527472527472525,null,"The highest possible grade for this datum is acceptable."]
["Answers","7, 14, 21, 28 days.","Mortality","LC",50,"No toxicant controls.","2 independent replicates","Experiments in which mortality of the control\nwas more than 15% were disregarded when calculating the LC50 of the test compounds.","Juveniles that hatched within 24 hours prior to the test.","Dechlorinated tap water - no aeration.","Static renewal (every 2-3 days).","Nominal concentrations.","No.","No.","Calculate dyusing EcoTox-Statistics version 1.1","95% Confidence Intervals","Not measured.",">85%","20°C of incubator",0.98699999999999999]
["Category","Freshwater/non-metal/non- plant","Paper and data unique identifier(eg. 1-1,10-150)","653-1"]
["Scores",10,5,5,5,5,5,2,5,5,4,4,0,4,4,4,3,3,0,3,76,0.8351648351648352,null,""]
["Answers","7 days","Adult survival","NOAEL","Table 1","No-toxicant controls","3 replicates","ASTM 1997","Adults. 5 days old. ","0.45 um filtered well water","Stated that the water was not renewed. Assumed static - for Daphnia to avoid bubbled under carapace. ","Concentrations measured at the start of the test; selected concentrations from each test were also analysed at test conclusion.","","Tables throughout.","The 96-h, 7-day, and 10-day LC50 values (concentration lethal to 50% of organisms at given time) and 95% confidence limits were calculated by the trimmed Spearman-Karber method (Hamilton et al. 1977) using\npooled data from replicates.","p<0.05","6.9 ± 0.1","7.4-8.0 mg/L","","99.8% purity"]
["Category","Freshwater/non-metal/non- plant","Paper and data unique identifier(eg. 1-1,10-150)","653-2"]
["Scores",10,5,5,5,5,5,2,5,5,4,4,0,4,4,4,3,3,0,3,76,0.8351648351648352,null,""]
["Answers","7 days","Adult survival","NOAEL","Table 1","No-toxicant controls","3 replicates","ASTM 1997","Adults. 5 days old. ","0.45 um filtered well water","Stated that the water was not renewed. Assumed static - for Daphnia to avoid bubbled under carapace. ","Concentrations measured at the start of the test; selected concentrations from each test were also analysed at test conclusion.","","Tables throughout.","The 96-h, 7-day, and 10-day LC50 values (concentration lethal to 50% of organisms at given time) and 95% confidence limits were calculated by the trimmed Spearman-Karber method (Hamilton et al. 1977) using\npooled data from replicates.","p<0.05","6.9 ± 0.1","7.4-8.0 mg/L","","99.8% purity"]
["Category","Freshwater/non-metal/non- plant","Paper and data unique identifier(eg. 1-1,10-150)","653-3"]
["Scores",10,5,5,5,5,5,2,5,5,4,4,0,4,4,4,3,3,0,3,76,0.8351648351648352,null,""]
["Answers","7 days","Adult survival","NOAEL","Table 1","No-toxicant controls","3 replicates","ASTM 1997","Adults. 5 days old. ","0.45 um filtered well water","Stated that the water was not renewed. Assumed static - for Daphnia to avoid bubbled under carapace. ","Concentrations measured at the start of the test; selected concentrations from each test were also analysed at test conclusion.","","Tables throughout.","The 96-h, 7-day, and 10-day LC50 values (concentration lethal to 50% of organisms at given time) and 95% confidence limits were calculated by the trimmed Spearman-Karber method (Hamilton et al. 1977) using\npooled data from replicates.","p<0.05","6.9 ± 0.1","7.4-8.0 mg/L","","99.8% purity"]
["Category","Freshwater/non-metal/non- plant","Paper and data unique identifier(eg. 1-1,10-150)","653-4"]
["Scores",10,5,5,5,5,5,2,5,5,4,4,0,4,4,4,3,3,0,3,76,0.8351648351648352,null,""]
["Answers","7 days","Adult survival","NOAEL","Table 1","No-toxicant controls","3 replicates","ASTM 1997","Adults. 5 days old. ","0.45 um filtered well water","Stated that the water was not renewed. Assumed static - for Daphnia to avoid bubbled under carapace. ","Concentrations measured at the start of the test; selected concentrations from each test were also analysed at test conclusion.","","Tables throughout.","The 96-h, 7-day, and 10-day LC50 values (concentration lethal to 50% of organisms at given time) and 95% confidence limits were calculated by the trimmed Spearman-Karber method (Hamilton et al. 1977) using\npooled data from replicates.","p<0.05","6.9 ± 0.1","7.4-8.0 mg/L","","99.8% purity"]
["Category","Freshwater/non-metal/non- plant","Paper and data unique identifier(eg. 1-1,10-150)","653-5"]
["Scores",10,5,5,5,5,5,2,5,5,4,4,0,4,4,4,3,3,0,3,76,0.8351648351648352,null,""]
["Answers","7 days","Adult survival","LC",50,"No-toxicant controls","3 replicates","ASTM 1997","Adults. 5 days old. ","0.45 um filtered well water","Stated that the water was not renewed. Assumed static - for Daphnia to avoid bubbled under carapace. ","Concentrations measured at the start of the test; selected concentrations from each test were also analysed at test conclusion.","","Tables throughout.","The 96-h, 7-day, and 10-day LC50 values (concentration lethal to 50% of organisms at given time) and 95% confidence limits were calculated by the trimmed Spearman-Karber method (Hamilton et al. 1977) using\npooled data from replicates.","95% confidence intervals","6.9 ± 0.1","7.4-8.0 mg/L","","99.8% purity"]
["Category","Freshwater/non-metal/non- plant","Paper and data unique identifier(eg. 1-1,10-150)","653-6"]
["Scores",10,5,5,5,5,5,2,5,5,4,4,0,4,4,4,3,3,0,3,76,0.8351648351648352,null,""]
["Answers","96 hour","Adult survival","LC",50,"No-toxicant controls","3 replicates","ASTM 1997","Adults. 5 days old. ","0.45 um filtered well water","Stated that the water was not renewed. Assumed static - for Daphnia to avoid bubbled under carapace. ","Concentrations measured at the start of the test; selected concentrations from each test were also analysed at test conclusion.","","Tables throughout.","The 96-h, 7-day, and 10-day LC50 values (concentration lethal to 50% of organisms at given time) and 95% confidence limits were calculated by the trimmed Spearman-Karber method (Hamilton et al. 1977) using\npooled data from replicates.","95% confidence intervals","6.9 ± 0.1","7.4-8.0 mg/L","","99.8% purity"]
["Category","Freshwater/non-metal/non- plant","Paper and data unique identifier(eg. 1-1,10-150)","653-7"]
["Scores",10,5,5,5,5,5,2,5,5,4,4,0,4,4,4,3,3,1,3,77,0.84615384615384615,null,""]
["Answers","10 days","Survival","","","No-toxicant controls","3 replicates","ASTM 1997","2 day old young. Newly hatched.","0.45 um filtered well water","Stated that the water was renewed on day 5.","Concentrations measured at the start of the test; selected concentrations from each test were also analysed at test conclusion.","","Tables throughout.","Lowest Observed Adverse Effect Level\n(LOAEL) values, the lowest concentration producing adverse effects (reduced survival, reproduction, growth impairment) significantly\ndifferent from the controls (p < 0.05), and No Observed Adverse Effect Level (NOAEL) values, the highest concentration producing no adverse effects significantly different from the controls, were determined with the Dunnett’s multiple comparison procedure with a program developed by Computer Science Corp. (1988) for the Environmental\nProtection Agency.","p<0.05","6.9 ± 0.1","3.8-8.0 mg/L","22°C in water bath","99.8% purity"]
["Category","Freshwater/non-metal/non- plant","Paper and data unique identifier(eg. 1-1,10-150)","653-8"]
["Scores",10,5,5,5,5,5,2,5,5,4,4,0,4,4,4,3,3,1,3,77,0.84615384615384615,null,""]
["Answers","10 days","Survival","","","No-toxicant controls","3 replicates","ASTM 1997","2 day old young. Newly hatched.","0.45 um filtered well water","Stated that the water was renewed on day 5.","Concentrations measured at the start of the test; selected concentrations from each test were also analysed at test conclusion.","","Tables throughout.","Lowest Observed Adverse Effect Level\n(LOAEL) values, the lowest concentration producing adverse effects (reduced survival, reproduction, growth impairment) significantly\ndifferent from the controls (p < 0.05), and No Observed Adverse Effect Level (NOAEL) values, the highest concentration producing no adverse effects significantly different from the controls, were determined with the Dunnett’s multiple comparison procedure with a program developed by Computer Science Corp. (1988) for the Environmental\nProtection Agency.","p<0.05","6.9 ± 0.1","3.8-8.0 mg/L","22°C in water bath","99.8% purity"]
["Category","Freshwater/non-metal/non- plant","Paper and data unique identifier(eg. 1-1,10-150)","653-9"]
["Scores",10,10,5,5,5,5,2,5,5,4,4,0,4,4,4,3,3,1,3,82,0.90109890109890112,null,""]
["Answers","10 days","Length was measured with a calibrated (mm) digitizer interfaced with a computer where the\nprojected images of animals in a tray were measured, including curves, and the total length calculated by the computer program.","","","No-toxicant controls","3 replicates","ASTM 1997","2 day old young. Newly hatched.","0.45 um filtered well water","Stated that the water was renewed on day 5.","Concentrations measured at the start of the test; selected concentrations from each test were also analysed at test conclusion.","","Tables throughout.","Lowest Observed Adverse Effect Level\n(LOAEL) values, the lowest concentration producing adverse effects (reduced survival, reproduction, growth impairment) significantly\ndifferent from the controls (p < 0.05), and No Observed Adverse Effect Level (NOAEL) values, the highest concentration producing no adverse effects significantly different from the controls, were determined with the Dunnett’s multiple comparison procedure with a program developed by Computer Science Corp. (1988) for the Environmental\nProtection Agency.","p<0.05","6.9 ± 0.1","3.8-8.0 mg/L","22°C in water bath","99.8% purity"]
["Category","Freshwater/non-metal/non- plant","Paper and data unique identifier(eg. 1-1,10-150)","653-10"]
["Scores",10,10,5,5,5,5,2,5,5,4,4,0,4,4,4,3,3,1,3,82,0.90109890109890112,null,""]
["Answers","10 days","Weight was blotted wet weight","","","No-toxicant controls","3 replicates","ASTM 1997","2 day old young. Newly hatched.","0.45 um filtered well water","Stated that the water was renewed on day 5.","Concentrations measured at the start of the test; selected concentrations from each test were also analysed at test conclusion.","","Tables throughout.","Lowest Observed Adverse Effect Level\n(LOAEL) values, the lowest concentration producing adverse effects (reduced survival, reproduction, growth impairment) significantly\ndifferent from the controls (p < 0.05), and No Observed Adverse Effect Level (NOAEL) values, the highest concentration producing no adverse effects significantly different from the controls, were determined with the Dunnett’s multiple comparison procedure with a program developed by Computer Science Corp. (1988) for the Environmental\nProtection Agency.","p<0.05","6.9 ± 0.1","3.8-8.0 mg/L","22°C in water bath","99.8% purity"]
["Category","Freshwater/non-metal/non- plant","Paper and data unique identifier(eg. 1-1,10-150)","653-11"]
["Scores",10,5,5,5,5,5,2,5,5,4,4,0,4,4,4,3,3,1,3,77,0.84615384615384615,null,""]
["Answers","10 days","Survival","LC",50,"No-toxicant controls","3 replicates","ASTM 1997","2 day old young. Newly hatched.","0.45 um filtered well water","Stated that the water was renewed on day 5.","Concentrations measured at the start of the test; selected concentrations from each test were also analysed at test conclusion.","","Tables throughout.","The 96-h, 7-day, and 10-day LC50 values (concentration lethal to 50% of organisms at given time) and 95% confidence limits were calculated by the trimmed Spearman-Karber method (Hamilton et al. 1977) using\npooled data from replicates.","95% confidence intervals","6.9 ± 0.1","3.8-8.0 mg/L","22°C in water bath","99.8% purity"]
["Category","Freshwater/non-metal/non- plant","Paper and data unique identifier(eg. 1-1,10-150)","653-12"]
["Scores",10,5,5,5,5,5,2,5,5,4,4,0,4,4,4,3,3,1,3,77,0.84615384615384615,null,""]
["Answers","96 hour","Survival","LC",50,"No-toxicant controls","3 replicates","ASTM 1997","2 day old young. Newly hatched.","0.45 um filtered well water","Stated that the water was renewed on day 5.","Concentrations measured at the start of the test; selected concentrations from each test were also analysed at test conclusion.","","Tables throughout.","The 96-h, 7-day, and 10-day LC50 values (concentration lethal to 50% of organisms at given time) and 95% confidence limits were calculated by the trimmed Spearman-Karber method (Hamilton et al. 1977) using\npooled data from replicates.","95% confidence intervals","6.9 ± 0.1","3.8-8.0 mg/L","22°C in water bath","99.8% purity"]
["Category","Freshwater/non-metal/non- plant","Paper and data unique identifier(eg. 1-1,10-150)","653-13"]
["Scores",10,5,5,5,5,5,2,5,5,4,4,0,4,4,4,3,3,1,3,77,0.84615384615384615,null,""]
["Answers","10 days","Survival","","","No-toxicant controls","3 replicates","ASTM 1997","1st instar larvae (two days old) that had begun to build burrows. ","0.45 um filtered well water","Stated that the water was renewed on day 7.","Concentrations measured at the start of the test; selected concentrations from each test were also analysed at test conclusion.","","Tables throughout.","Lowest Observed Adverse Effect Level\n(LOAEL) values, the lowest concentration producing adverse effects (reduced survival, reproduction, growth impairment) significantly\ndifferent from the controls (p # 0.05), and No Observed Adverse Effect Level (NOAEL) values, the highest concentration producing no adverse effects significantly different from the controls, were determined with the Dunnett’s multiple comparison procedure with a program developed by Computer Science Corp. (1988) for the Environmental Protection Agency.","p<0.05","6.9 ± 0.1","6.6-7.2 mg/L","24°C in water bath","99.8% purity"]
["Category","Freshwater/non-metal/non- plant","Paper and data unique identifier(eg. 1-1,10-150)","653-14"]
["Scores",10,5,5,5,5,5,2,5,5,4,4,0,4,4,4,3,3,1,3,77,0.84615384615384615,null,""]
["Answers","10 days","Survival","","","No-toxicant controls","3 replicates","ASTM 1997","1st instar larvae (two days old) that had begun to build burrows. ","0.45 um filtered well water","Stated that the water was renewed on day 7.","Concentrations measured at the start of the test; selected concentrations from each test were also analysed at test conclusion.","","Tables throughout.","Lowest Observed Adverse Effect Level\n(LOAEL) values, the lowest concentration producing adverse effects (reduced survival, reproduction, growth impairment) significantly\ndifferent from the controls (p # 0.05), and No Observed Adverse Effect Level (NOAEL) values, the highest concentration producing no adverse effects significantly different from the controls, were determined with the Dunnett’s multiple comparison procedure with a program developed by Computer Science Corp. (1988) for the Environmental Protection Agency.","p<0.05","6.9 ± 0.1","6.6-7.2 mg/L","24°C in water bath","99.8% purity"]
["Category","Freshwater/non-metal/non- plant","Paper and data unique identifier(eg. 1-1,10-150)","653-15"]
["Scores",10,5,5,5,5,5,2,5,5,4,4,0,4,4,4,3,3,1,3,77,0.84615384615384615,null,""]
["Answers","10 days","Larval weight at the end of the test.","","","No-toxicant controls","3 replicates","ASTM 1997","1st instar larvae (two days old) that had begun to build burrows. ","0.45 um filtered well water","Stated that the water was renewed on day 7.","Concentrations measured at the start of the test; selected concentrations from each test were also analysed at test conclusion.","","Tables throughout.","Lowest Observed Adverse Effect Level\n(LOAEL) values, the lowest concentration producing adverse effects (reduced survival, reproduction, growth impairment) significantly\ndifferent from the controls (p # 0.05), and No Observed Adverse Effect Level (NOAEL) values, the highest concentration producing no adverse effects significantly different from the controls, were determined with the Dunnett’s multiple comparison procedure with a program developed by Computer Science Corp. (1988) for the Environmental Protection Agency.","p<0.05","6.9 ± 0.1","6.6-7.2 mg/L","24°C in water bath","99.8% purity"]
["Category","Freshwater/non-metal/non- plant","Paper and data unique identifier(eg. 1-1,10-150)","653-16"]
["Scores",10,5,5,5,5,5,2,5,5,4,4,0,4,4,4,3,3,1,3,77,0.84615384615384615,null,""]
["Answers","10 days","Survival","LC",50,"No-toxicant controls","3 replicates","ASTM 1997","1st instar larvae (two days old) that had begun to build burrows. ","0.45 um filtered well water","Stated that the water was renewed on day 7.","Concentrations measured at the start of the test; selected concentrations from each test were also analysed at test conclusion.","","Tables throughout.","The 96-h, 7-day, and 10-day LC50 values (concentration lethal to 50% of organisms at given time) and 95% confidence limits were calculated by the trimmed Spearman-Karber method (Hamilton et al. 1977) using\npooled data from replicates.","95% confidence intervals.","6.9 ± 0.1","6.6-7.2 mg/L","24°C in water bath","99.8% purity"]
["Category","Freshwater/non-metal/non- plant","Paper and data unique identifier(eg. 1-1,10-150)","653-17"]
["Scores",10,5,5,5,5,5,2,5,5,4,4,0,4,4,4,3,0,3,3,76,0.8351648351648352,null,""]
["Answers","10 days","Survival","","","No-toxicant controls","3 replicates","ASTM 1997","Juveniles 1.5 months old at test initiation.","0.45 um filtered well water","Stated that the water was renewed on day 5.","Concentrations measured at the start of the test; selected concentrations from each test were also analysed at test conclusion.","","Tables throughout.","The 96-h, 7-day, and 10-day LC50 values (concentration lethal to 50% of organisms at given time) and 95% confidence limits were calculated by the trimmed Spearman-Karber method (Hamilton et al. 1977) using\npooled data from replicates.","95% confidence intervals.","6.8 ± 0.1","Not stated.","24°C","99.8% purity"]
["Category","Freshwater/non-metal/non- plant","Paper and data unique identifier(eg. 1-1,10-150)","653-18"]
["Scores",10,5,5,5,5,5,2,5,5,4,4,0,4,4,4,3,0,3,3,76,0.8351648351648352,null,""]
["Answers","10 days","Survival","","","No-toxicant controls","3 replicates","ASTM 1997","Juveniles 1.5 months old at test initiation.","0.45 um filtered well water","Stated that the water was renewed on day 5.","Concentrations measured at the start of the test; selected concentrations from each test were also analysed at test conclusion.","","Tables throughout.","Lowest Observed Adverse Effect Level\n(LOAEL) values, the lowest concentration producing adverse effects (reduced survival, reproduction, growth impairment) significantly different from the controls (p < 0.05), and No Observed Adverse Effect Level (NOAEL) values, the highest concentration producing no adverse effects significantly different from the controls, were determined with the Dunnett’s multiple comparison procedure with a program developed by Computer Science Corp. (1988) for the Environmental\nProtection Agency.","p<0.05","6.8 ± 0.1","Not stated.","24°C","99.8% purity"]
["Category","Freshwater/non-metal/non- plant","Paper and data unique identifier(eg. 1-1,10-150)","653-19"]
["Scores",10,5,5,5,5,5,2,5,5,4,4,0,4,4,4,3,0,3,3,76,0.8351648351648352,null,""]
["Answers","10 days","Growth weight","","","No-toxicant controls","3 replicates","ASTM 1997","Juveniles 1.5 months old at test initiation.","0.45 um filtered well water","Stated that the water was renewed on day 5.","Concentrations measured at the start of the test; selected concentrations from each test were also analysed at test conclusion.","","Tables throughout.","Lowest Observed Adverse Effect Level\n(LOAEL) values, the lowest concentration producing adverse effects (reduced survival, reproduction, growth impairment) significantly different from the controls (p < 0.05), and No Observed Adverse Effect Level (NOAEL) values, the highest concentration producing no adverse effects significantly different from the controls, were determined with the Dunnett’s multiple comparison procedure with a program developed by Computer Science Corp. (1988) for the Environmental\nProtection Agency.","p<0.05","6.8 ± 0.1","Not stated.","24°C","99.8% purity"]
["Category","Freshwater/non-metal/non- plant","Paper and data unique identifier(eg. 1-1,10-150)","653-20"]
["Scores",10,5,5,5,5,5,2,5,5,4,4,0,4,4,4,3,0,3,3,76,0.8351648351648352,null,""]
["Answers","10 days","Growth weight","","","No-toxicant controls","3 replicates","ASTM 1997","Juveniles 1.5 months old at test initiation.","0.45 um filtered well water","Stated that the water was renewed on day 5.","Concentrations measured at the start of the test; selected concentrations from each test were also analysed at test conclusion.","","Tables throughout.","Lowest Observed Adverse Effect Level\n(LOAEL) values, the lowest concentration producing adverse effects (reduced survival, reproduction, growth impairment) significantly different from the controls (p < 0.05), and No Observed Adverse Effect Level (NOAEL) values, the highest concentration producing no adverse effects significantly different from the controls, were determined with the Dunnett’s multiple comparison procedure with a program developed by Computer Science Corp. (1988) for the Environmental\nProtection Agency.","p<0.05","6.8 ± 0.1","Not stated.","24°C","99.8% purity"]
["Category","Freshwater/non-metal/non- plant","Paper and data unique identifier(eg. 1-1,10-150)","653-21"]
["Scores",10,5,5,5,5,5,2,5,5,4,4,0,4,4,4,3,0,3,3,76,0.8351648351648352,null,""]
["Answers","10 days","Growth length","","","No-toxicant controls","3 replicates","ASTM 1997","Juveniles 1.5 months old at test initiation.","0.45 um filtered well water","Stated that the water was renewed on day 5.","Concentrations measured at the start of the test; selected concentrations from each test were also analysed at test conclusion.","","Tables throughout.","Lowest Observed Adverse Effect Level\n(LOAEL) values, the lowest concentration producing adverse effects (reduced survival, reproduction, growth impairment) significantly different from the controls (p < 0.05), and No Observed Adverse Effect Level (NOAEL) values, the highest concentration producing no adverse effects significantly different from the controls, were determined with the Dunnett’s multiple comparison procedure with a program developed by Computer Science Corp. (1988) for the Environmental\nProtection Agency.","p<0.05","6.8 ± 0.1","Not stated.","24°C","99.8% purity"]
["Category","Freshwater/non-metal/non- plant","Paper and data unique identifier(eg. 1-1,10-150)","653-22"]
["Scores",10,5,5,5,5,5,2,5,5,4,4,0,4,4,4,3,0,3,3,76,0.8351648351648352,null,""]
["Answers","10 days","Growth length","","","No-toxicant controls","3 replicates","ASTM 1997","Juveniles 1.5 months old at test initiation.","0.45 um filtered well water","Stated that the water was renewed on day 5.","Concentrations measured at the start of the test; selected concentrations from each test were also analysed at test conclusion.","","Tables throughout.","Lowest Observed Adverse Effect Level\n(LOAEL) values, the lowest concentration producing adverse effects (reduced survival, reproduction, growth impairment) significantly different from the controls (p < 0.05), and No Observed Adverse Effect Level (NOAEL) values, the highest concentration producing no adverse effects significantly different from the controls, were determined with the Dunnett’s multiple comparison procedure with a program developed by Computer Science Corp. (1988) for the Environmental\nProtection Agency.","p<0.05","6.8 ± 0.1","Not stated.","24°C","99.8% purity"]
["Category","Freshwater/non-metal/non- plant","Paper and data unique identifier(eg. 1-1,10-150)","653-23"]
["Scores",10,5,5,5,5,5,2,5,5,4,4,0,4,4,4,3,0,3,3,76,0.8351648351648352,null,""]
["Answers","10 days","Survival","LC",50,"No-toxicant controls","3 replicates","ASTM 1997","Juveniles 1.5 months old at test initiation.","0.45 um filtered well water","Stated that the water was renewed on day 5.","Concentrations measured at the start of the test; selected concentrations from each test were also analysed at test conclusion.","","Tables throughout.","The 96-h, 7-day, and 10-day LC50 values (concentration lethal to 50% of organisms at given time) and 95% confidence limits were calculated by the trimmed Spearman-Karber method (Hamilton et al. 1977) using\npooled data from replicates.","95% confidence intervals","6.8 ± 0.1","Not stated.","24°C","99.8% purity"]
["Category","Freshwater/non-metal/non- plant","Paper and data unique identifier(eg. 1-1,10-150)","653-24"]
["Scores",10,5,5,5,5,5,2,5,5,0,4,0,4,4,4,3,0,3,3,72,0.79120879120879117,null,""]
["Answers","7 days","Survival","","","No-toxicant controls","3 replicates","ASTM 1997","Embryo/larval (2.5 days old).","0.45 um filtered well water","","Concentrations measured at the start of the test; selected concentrations from each test were also analysed at test conclusion.","","Tables throughout.","Lowest Observed Adverse Effect Level\n(LOAEL) values, the lowest concentration producing adverse effects (reduced survival, reproduction, growth impairment) significantly\ndifferent from the controls (p < 0.05), and No Observed Adverse Effect Level (NOAEL) values, the highest concentration producing no adverse effects significantly different from the controls, were determined with the Dunnett’s multiple comparison procedure with a program developed by Computer Science Corp. (1988) for the Environmental\nProtection Agency.","p<0.05","6.8 ± 0.1","Not stated.","24°C","99.8% purity"]
["Category","Freshwater/non-metal/non- plant","Paper and data unique identifier(eg. 1-1,10-150)","653-25"]
["Scores",10,5,5,5,5,5,2,5,5,0,4,0,4,4,4,3,0,3,3,72,0.79120879120879117,null,""]
["Answers","7 days","Survival","","","No-toxicant controls","3 replicates","ASTM 1997","Embryo/larval (2.5 days old).","0.45 um filtered well water","","Concentrations measured at the start of the test; selected concentrations from each test were also analysed at test conclusion.","","Tables throughout.","Lowest Observed Adverse Effect Level\n(LOAEL) values, the lowest concentration producing adverse effects (reduced survival, reproduction, growth impairment) significantly\ndifferent from the controls (p < 0.05), and No Observed Adverse Effect Level (NOAEL) values, the highest concentration producing no adverse effects significantly different from the controls, were determined with the Dunnett’s multiple comparison procedure with a program developed by Computer Science Corp. (1988) for the Environmental\nProtection Agency.","p<0.05","6.8 ± 0.1","Not stated.","24°C","99.8% purity"]
["Category","Freshwater/non-metal/non- plant","Paper and data unique identifier(eg. 1-1,10-150)","653-26"]
["Scores",10,5,5,5,5,5,2,5,5,0,4,0,4,4,4,3,0,3,3,72,0.79120879120879117,null,""]
["Answers","7 days","Number of eggs hatched","","","No-toxicant controls","3 replicates","ASTM 1997","Embryo/larval (2.5 days old).","0.45 um filtered well water","","Concentrations measured at the start of the test; selected concentrations from each test were also analysed at test conclusion.","","Tables throughout.","Lowest Observed Adverse Effect Level\n(LOAEL) values, the lowest concentration producing adverse effects (reduced survival, reproduction, growth impairment) significantly\ndifferent from the controls (p < 0.05), and No Observed Adverse Effect Level (NOAEL) values, the highest concentration producing no adverse effects significantly different from the controls, were determined with the Dunnett’s multiple comparison procedure with a program developed by Computer Science Corp. (1988) for the Environmental\nProtection Agency.","p<0.05","6.8 ± 0.1","Not stated.","24°C","99.8% purity"]
["Category","Freshwater/non-metal/non- plant","Paper and data unique identifier(eg. 1-1,10-150)","653-27"]
["Scores",10,10,5,5,5,5,2,5,5,0,4,0,4,4,4,3,0,3,3,77,0.84615384615384615,null,""]
["Answers","7 days","Weight: blotted wet weight.","","","No-toxicant controls","3 replicates","ASTM 1997","Embryo/larval (2.5 days old).","0.45 um filtered well water","","Concentrations measured at the start of the test; selected concentrations from each test were also analysed at test conclusion.","","Tables throughout.","Lowest Observed Adverse Effect Level\n(LOAEL) values, the lowest concentration producing adverse effects (reduced survival, reproduction, growth impairment) significantly\ndifferent from the controls (p < 0.05), and No Observed Adverse Effect Level (NOAEL) values, the highest concentration producing no adverse effects significantly different from the controls, were determined with the Dunnett’s multiple comparison procedure with a program developed by Computer Science Corp. (1988) for the Environmental\nProtection Agency.","p<0.05","6.8 ± 0.1","Not stated.","24°C","99.8% purity"]
["Category","Freshwater/non-metal/non- plant","Paper and data unique identifier(eg. 1-1,10-150)","653-28"]
["Scores",10,10,5,5,5,5,2,5,5,0,4,0,4,4,4,3,0,3,3,77,0.84615384615384615,null,""]
["Answers","7 days","Length was measured with a computer-interfaces digitizer.","","","No-toxicant controls","3 replicates","ASTM 1997","Embryo/larval (2.5 days old).","0.45 um filtered well water","","Concentrations measured at the start of the test; selected concentrations from each test were also analysed at test conclusion.","","Tables throughout.","Lowest Observed Adverse Effect Level\n(LOAEL) values, the lowest concentration producing adverse effects (reduced survival, reproduction, growth impairment) significantly\ndifferent from the controls (p < 0.05), and No Observed Adverse Effect Level (NOAEL) values, the highest concentration producing no adverse effects significantly different from the controls, were determined with the Dunnett’s multiple comparison procedure with a program developed by Computer Science Corp. (1988) for the Environmental\nProtection Agency.","p<0.05","6.8 ± 0.1","Not stated.","24°C","99.8% purity"]
["Category","Freshwater/non-metal/non- plant","Paper and data unique identifier(eg. 1-1,10-150)","653-29"]
["Scores",10,10,5,5,5,5,2,5,5,0,4,0,4,4,4,3,0,3,3,77,0.84615384615384615,null,""]
["Answers","7 days","Length was measured with a computer-interfaces digitizer.","","","No-toxicant controls","3 replicates","ASTM 1997","Embryo/larval (2.5 days old).","0.45 um filtered well water","","Concentrations measured at the start of the test; selected concentrations from each test were also analysed at test conclusion.","","Tables throughout.","Lowest Observed Adverse Effect Level\n(LOAEL) values, the lowest concentration producing adverse effects (reduced survival, reproduction, growth impairment) significantly\ndifferent from the controls (p < 0.05), and No Observed Adverse Effect Level (NOAEL) values, the highest concentration producing no adverse effects significantly different from the controls, were determined with the Dunnett’s multiple comparison procedure with a program developed by Computer Science Corp. (1988) for the Environmental\nProtection Agency.","p<0.05","6.8 ± 0.1","Not stated.","24°C","99.8% purity"]
["Category","Freshwater/non-metal/non- plant","Paper and data unique identifier(eg. 1-1,10-150)","653-30"]
["Scores",10,10,5,5,5,5,2,5,5,0,4,0,4,4,4,3,0,3,3,77,0.84615384615384615,null,""]
["Answers","7 days","Survival","LC",50,"No-toxicant controls","3 replicates","ASTM 1997","Embryo/larval (2.5 days old).","0.45 um filtered well water","","Concentrations measured at the start of the test; selected concentrations from each test were also analysed at test conclusion.","","Tables throughout.","The 96-h, 7-day, and 10-day LC50 values (concentration lethal to 50% of organisms at given time) and 95% confidence limits were calculated by the trimmed Spearman-Karber method (Hamilton et al. 1977) using\npooled data from replicates.","95% confidence intervals","6.8 ± 0.1","Not stated.","24°C","99.8% purity"]
["Category","Freshwater/non-metal/non- plant","Paper and data unique identifier(eg. 1-1,10-150)","653-31"]
["Scores",10,10,5,5,5,5,2,5,5,0,4,0,4,4,4,3,0,3,3,77,0.84615384615384615,null,""]
["Answers","10 days","Survival","","","No-toxicant controls","3 replicates","ASTM 1997","Small, short adults.","0.45 um filtered well water","States the water was renewed at day 5.","Concentrations measured at the start of the test; selected concentrations from each test were also analysed at test conclusion.","","Tables throughout.","Lowest Observed Adverse Effect Level\n(LOAEL) values, the lowest concentration producing adverse effects\n(reduced survival, reproduction, growth impairment) significantly different from the controls (p # 0.05), and No Observed Adverse Effect Level (NOAEL) values, the highest concentration producing no adverse effects significantly different from the controls, were determined with the Dunnett’s multiple comparison procedure with a program developed by Computer Science Corp. (1988) for the Environmental\nProtection Agency.","p<0.05","6.8 ± 0.1","Not stated.","23°C","99.8% purity"]
["Category","Freshwater/non-metal/non- plant","Paper and data unique identifier(eg. 1-1,10-150)","653-32"]
["Scores",10,10,5,5,5,5,2,5,5,0,4,0,4,4,4,3,0,3,3,77,0.84615384615384615,null,""]
["Answers","10 days","Blotted wet weight. Small, short, adult worms (they reproduce by fragmentation) were carefully counted and used to provide for ample growth potential.","","","No-toxicant controls","3 replicates","ASTM 1997","Small, short adults.","0.45 um filtered well water","States the water was renewed at day 5.","Concentrations measured at the start of the test; selected concentrations from each test were also analysed at test conclusion.","","Tables throughout.","Lowest Observed Adverse Effect Level\n(LOAEL) values, the lowest concentration producing adverse effects\n(reduced survival, reproduction, growth impairment) significantly different from the controls (p # 0.05), and No Observed Adverse Effect Level (NOAEL) values, the highest concentration producing no adverse effects significantly different from the controls, were determined with the Dunnett’s multiple comparison procedure with a program developed by Computer Science Corp. (1988) for the Environmental\nProtection Agency.","p<0.05","6.8 ± 0.1","Not stated.","23°C","99.8% purity"]
["Category","Freshwater/non-metal/non- plant","Paper and data unique identifier(eg. 1-1,10-150)","653-33"]
["Scores",10,10,5,5,5,5,2,5,5,0,4,0,4,4,4,3,0,3,3,77,0.84615384615384615,null,""]
["Answers","10 days","Blotted wet weight. Small, short, adult worms (they reproduce by fragmentation) were carefully counted and used to provide for ample growth potential.","","","No-toxicant controls","3 replicates","ASTM 1997","Small, short adults.","0.45 um filtered well water","States the water was renewed at day 5.","Concentrations measured at the start of the test; selected concentrations from each test were also analysed at test conclusion.","","Tables throughout.","Lowest Observed Adverse Effect Level\n(LOAEL) values, the lowest concentration producing adverse effects\n(reduced survival, reproduction, growth impairment) significantly different from the controls (p # 0.05), and No Observed Adverse Effect Level (NOAEL) values, the highest concentration producing no adverse effects significantly different from the controls, were determined with the Dunnett’s multiple comparison procedure with a program developed by Computer Science Corp. (1988) for the Environmental\nProtection Agency.","p<0.05","6.8 ± 0.1","Not stated.","23°C","99.8% purity"]
["Category","Freshwater/non-metal/non- plant","Paper and data unique identifier(eg. 1-1,10-150)","653-34"]
["Scores",10,5,5,5,5,5,2,5,5,0,4,0,4,4,4,3,0,3,3,72,0.79120879120879117,null,""]
["Answers","10 days","Survival","","","No-toxicant controls","3 replicates","ASTM 1997","15-day old, 1-1.5mm in diameter","0.45 um filtered well water","States the water was renewed at day 6.","Concentrations measured at the start of the test; selected concentrations from each test were also analysed at test conclusion.","","Tables throughout.","Lowest Observed Adverse Effect Level\n(LOAEL) values, the lowest concentration producing adverse effects\n(reduced survival, reproduction, growth impairment) significantly different from the controls (p # 0.05), and No Observed Adverse Effect Level (NOAEL) values, the highest concentration producing no adverse effects significantly different from the controls, were determined with the Dunnett’s multiple comparison procedure with a program developed by Computer Science Corp. (1988) for the Environmental\nProtection Agency.","p<0.05","6.8 ± 0.1","Not stated.","23°C","99.8% purity"]
["Category","Freshwater/non-metal/non- plant","Paper and data unique identifier(eg. 1-1,10-150)","653-35"]
["Scores",10,5,5,5,5,5,2,5,5,0,4,0,4,4,4,3,0,3,3,72,0.79120879120879117,null,""]
["Answers","10 days","Growth: Blotted wet weight","","","No-toxicant controls","3 replicates","ASTM 1997","15-day old, 1-1.5mm in diameter","0.45 um filtered well water","States the water was renewed at day 6.","Concentrations measured at the start of the test; selected concentrations from each test were also analysed at test conclusion.","","Tables throughout.","Lowest Observed Adverse Effect Level\n(LOAEL) values, the lowest concentration producing adverse effects\n(reduced survival, reproduction, growth impairment) significantly different from the controls (p # 0.05), and No Observed Adverse Effect Level (NOAEL) values, the highest concentration producing no adverse effects significantly different from the controls, were determined with the Dunnett’s multiple comparison procedure with a program developed by Computer Science Corp. (1988) for the Environmental\nProtection Agency.","p<0.05","6.8 ± 0.1","Not stated.","23°C","99.8% purity"]
["Category","Freshwater/non-metal/non- plant","Paper and data unique identifier(eg. 1-1,10-150)","653-36"]
["Scores",10,5,5,5,5,5,2,5,5,0,4,0,4,4,4,3,0,3,3,72,0.79120879120879117,null,""]
["Answers","10 days","Growth: Blotted wet weight","","","No-toxicant controls","3 replicates","ASTM 1997","15-day old, 1-1.5mm in diameter","0.45 um filtered well water","States the water was renewed at day 6.","Concentrations measured at the start of the test; selected concentrations from each test were also analysed at test conclusion.","","Tables throughout.","Lowest Observed Adverse Effect Level\n(LOAEL) values, the lowest concentration producing adverse effects\n(reduced survival, reproduction, growth impairment) significantly different from the controls (p # 0.05), and No Observed Adverse Effect Level (NOAEL) values, the highest concentration producing no adverse effects significantly different from the controls, were determined with the Dunnett’s multiple comparison procedure with a program developed by Computer Science Corp. (1988) for the Environmental\nProtection Agency.","p<0.05","6.8 ± 0.1","Not stated.","23°C","99.8% purity"]
["Category","Freshwater/non-metal/non- plant","Paper and data unique identifier(eg. 1-1,10-150)","650-1"]
["Scores",10,10,5,5,5,5,5,5,0,4,2,0,0,4,4,3,3,3,3,76,0.8351648351648352,null,""]
["Answers","96 hours","Mortality was defined as lack of movement or response to gentle prodding (ASTM, 1998).","","","No toxicant control and solvent control.","Three replicates. ","The toxicity tests were considered valid if the mortality in each of the water and\nsolvent controls was not greater than 10% and the DO level in all the test solutions\nremained greater than 60% saturation.","10-15 mm long.","Diluton water (doesn't specify what type).","Static, with renewal every 24 hours.","Diuron concentrations at 24 hours were close to the nominal concentrations (70-100%).","","","The 24,48,72 and 96h LC50 for pesticide exposures to shrimp was computed by trimmed Spearman K¨arber method of Hamilton et al.(1977,1978).","95% confidence intervals","7-8.5",">80%","23.4 ± 0.8 C","97% purity"]
["Category","Freshwater/non-metal/non- plant","Paper and data unique identifier(eg. 1-1,10-150)","650-2"]
["Scores",10,10,5,5,5,5,5,5,0,4,2,0,0,4,4,3,3,3,3,76,0.8351648351648352,null,""]
["Answers","96 hours","Mortality was defined as lack of movement or response to gentle prodding (ASTM, 1998).","","","No toxicant control and solvent control.","Three replicates. ","The toxicity tests were considered valid if the mortality in each of the water and\nsolvent controls was not greater than 10% and the DO level in all the test solutions\nremained greater than 60% saturation.","10-15 mm long.","Diluton water (doesn't specify what type).","Static, with renewal every 24 hours.","Diuron concentrations at 24 hours were close to the nominal concentrations (70-100%).","","","The 24,48,72 and 96h LC50 for pesticide exposures to shrimp was computed by trimmed Spearman K¨arber method of Hamilton et al.(1977,1978).","95% confidence intervals","7-8.5",">80%","23.4 ± 0.8 C","97% purity"]
["Category","Freshwater/non-metal/non- plant","Paper and data unique identifier(eg. 1-1,10-150)","650-3"]
["Scores",10,10,5,5,5,5,5,5,0,4,2,0,0,0,0,3,3,3,3,68,0.74725274725274726,null,""]
["Answers","96 hours","Mortality was defined as lack of movement or response to gentle prodding (ASTM, 1998).","","","No toxicant control and solvent control.","Three replicates. ","The toxicity tests were considered valid if the mortality in each of the water and\nsolvent controls was not greater than 10% and the DO level in all the test solutions\nremained greater than 60% saturation.","10-15 mm long.","Diluton water (doesn't specify what type).","Static, with renewal every 24 hours.","Diuron concentrations at 24 hours were close to the nominal concentrations (70-100%).","","Not stated","Not stated","Not stated","7-8.5",">80%","23.4 ± 0.8 C","97% purity"]
["Category","Freshwater/non-metal/non- plant","Paper and data unique identifier(eg. 1-1,10-150)","914-1"]
["Scores",10,5,5,5,5,5,2,5,5,4,2,0,0,4,4,3,0,3,0,67,0.73626373626373631,null,""]
["Answers","24 and 48 hours","Immobilisation","EC",50,"No-toxicant control","5 replicates","USEPA (1991).","Neonates drawn from a pool of third or later brood neonates produced from cultures. ","Soft diluted mineral water (mineral water with Milli Q water).","Static","Measured concentrations were used to calculate EC values.","","","EC50 values and confidence intervals were determined using the trimmed Spearman-Karber method.","95% confidence intervals","7.3-8.2","","25 ± 1°C\n\n",""]
["Category","Freshwater/non-metal/non- plant","Paper and data unique identifier(eg. 1-1,10-150)","993-1"]
["Scores",10,5,5,5,5,5,2,5,5,4,2,0,0,4,4,3,0,3,0,67,0.73626373626373631,null,""]
["Answers","24 and 48 hours","Immobilisation","EC",50,"No-toxicant control","5 replicates","USEPA (1991).","Neonates drawn from a pool of third or later brood neonates produced from cultures. ","Soft diluted mineral water (mineral water with Milli Q water).","Static","Measured concentrations were used to calculate EC values.","","","EC50 values and confidence intervals were determined using the trimmed Spearman-Karber method.","95% confidence intervals","7.3-8.2","","25 ± 1°C\n\n",""]
["Category","Freshwater/non-metal/non- plant","Paper and data unique identifier(eg. 1-1,10-150)","993-2"]
["Scores",10,5,5,5,5,5,2,5,5,4,2,0,0,4,4,3,0,3,0,67,0.73626373626373631,null,""]
["Answers","24 and 48 hours","Immobilisation","EC",50,"No-toxicant control","5 replicates","USEPA (1991).","Neonates drawn from a pool of third or later brood neonates produced from cultures. ","Soft diluted mineral water (mineral water with Milli Q water).","Static","Measured concentrations were used to calculate EC values.","","","EC50 values and confidence intervals were determined using the trimmed Spearman-Karber method.","95% confidence intervals","7.3-8.2","","25 ± 1°C\n\n",""]
["Category","Freshwater/non-metal/non- plant","Paper and data unique identifier(eg. 1-1,10-150)","993-3"]
["Scores",10,5,5,5,5,5,2,5,5,4,2,0,0,4,4,3,0,3,0,67,0.73626373626373631,null,""]
["Answers","24 and 48 hours","Immobilisation","EC",50,"No-toxicant control","5 replicates","USEPA (1991).","Neonates drawn from a pool of third or later brood neonates produced from cultures. ","Ambient water source (supply water) collected from the main irrigation supply channel at Griffith, NSW, and was filtered through a 60 um nylon mesh to exclude algal food and predators.","Static","Measured concentrations were used to calculate EC values.","","","EC50 values and confidence intervals were determined using the trimmed Spearman-Karber method.","95% confidence intervals","7.3-8.2","","25 ± 1°C\n\n",""]
["Category","Freshwater/non-metal/non- plant","Paper and data unique identifier(eg. 1-1,10-150)","993-4"]
["Scores",10,5,5,5,5,5,2,5,5,4,2,0,0,4,4,3,0,3,0,67,0.73626373626373631,null,""]
["Answers","24 and 48 hours","Immobilisation","EC",50,"No-toxicant control","5 replicates","USEPA (1991).","Neonates drawn from a pool of third or later brood neonates produced from cultures. ","Ambient water source (supply water) collected from the main irrigation supply channel at Griffith, NSW, and was filtered through a 60 um nylon mesh to exclude algal food and predators.","Static","Measured concentrations were used to calculate EC values.","","","EC50 values and confidence intervals were determined using the trimmed Spearman-Karber method.","95% confidence intervals","7.3-8.2","","25 ± 1°C\n\n",""]
["Category","Freshwater/non-metal/non- plant","Paper and data unique identifier(eg. 1-1,10-150)","994-1"]
["Scores",10,10,5,5,0,5,5,5,5,0,0,0,0,0,4,0,0,3,3,60,0.65934065934065933,null,"The highest possible grade for this datum is acceptable."]
["Answers","48 hours","Immobility: if after 24 and 96 hours of incubation with the toxicant, they remained settled at the bottom of the multiwell test plate and did not resume swimming within 15s of observation. ","EC",50,"not stated","6 replicates","OECD Test Guidelines","24 hour old daphnid neonates hatched from dormant eggs (ephippia) according to the prescribed standard procedure for inducing the hatching.","Non-chlorinated tap water and spring water 1:1.","Toxicity bioassays were conducted in a flowthrough mode as well as in the standard static mode. In static experimental conditions, the test organisms were exposed to the toxicant at the required concentration by replacing a batch of toxicant with a fresh batch of the same initial concentrations in frequent intervals of time (5 h), and in flow-through tests, the toxicant was introduced at regular intervals with a corresponding outflow (24 h).","not stated","","","not stated","Standard deviation provided.","","","20 ± 1°C","Highest purity available from Ciba-Geigy (Barcelona, Spain), Rhom & Hass\n(Philadelphia, USA), Chemservice (West Chester, USA) and Riedel-de Ha.en (Seelze, Germany)"]

{"sheet":"FW metal plant","index":9,"n_rows":87,"n_cols":53,"rows_kept":87,"cut":false,"hidden":false,"merged":[[3,4,7,4],[9,2,9,4],[11,2,13,2],[11,7,13,7],[14,2,16,2],[14,7,16,7],[17,2,19,2],[17,7,19,7],[20,2,21,2],[20,7,21,7],[22,2,24,2],[22,7,24,7],[25,2,27,2],[25,7,27,7],[28,2,30,2],[28,7,30,7],[31,2,33,2],[31,7,33,7],[34,2,36,2],[34,7,36,7],[37,2,39,2],[37,7,39,7],[40,2,42,2],[40,7,42,7],[43,2,45,2],[43,7,45,7],[46,2,48,2],[46,7,48,7],[49,2,51,2],[49,7,51,7],[71,2,74,2],[71,7,74,7],[52,2,54,2],[52,7,54,7],[68,2,70,2],[68,7,70,7],[65,7,67,7],[56,7,58,7],[59,7,61,7],[62,7,64,7]]}
[null,1,"Fill in the blank cells below, based on information provided in the paper being assessed. You can either pick an option from the dropdown list or add the appropriate detail using the 'Add to list' button. ",null,null,null,null,null,null,null,null,null,null,null,"* All the text in RED are used for drop down list ,make changes with caution."]
[null,null,"Category",{"$f":"IF(AF3=\"\",0,1)","v":0},"Freshwater/metal/plant",{"$f":"IF(E3=\"\",0,1)","v":0},"Citation No.",{"$f":"IF(ISERROR(FIND(\"-\",E3)),E3,LEFT(E3,FIND(\"-\",E3)-1))","v":0},null,"Taxonomic group",null,null,null,null,"Species",null,null,"Lifestage",null,null,"Exposure duration",null,null,"Measure of toxicity",null,null,"Toxicity endpoint",null,null,"Taxonomic group",null,null,"Phylum",null,null,"Class",null,null,"Media",null,null,"Temperature ",null,null,"Acute Or Chronic",null,null,"PH",null,null,"Salinity/Comdictivity"]
[null,null,"Paper and data unique identifier(eg. 1-1,10-150)",{"$f":"IF(AI3=\"\",0,1)","v":0},null,{"$f":"IF(E4=\"\",0,1)","v":0},"Species (Scientific name)",null,null,"Phylum",null,null,null,null,"Aedes albopictus",0,{"$f":"IF(P3=0,\"\",INDEX(O3:O108,P3))","v":""},"1 month",0,{"$f":"IF(S3=0,\"\",INDEX(R3:R108,S3))","v":""},"11 hour",0,{"$f":"IF(V3=0,\"\",INDEX(U3:U108,V3))","v":""},"LC50",0,{"$f":"IF(Y3=0,\"\",INDEX(X3:X108,Y3))","v":""},"Mortality",0,{"$f":"IF(AB3=0,\"\",INDEX(AA3:AA108,AB3))","v":""},"Fish ",0,{"$f":"IF(AE3=0,\"\",INDEX(AD3:AD108,AE3))","v":""},"Chlorophyta",0,{"$f":"IF(AH3=0,\"\",INDEX(AG3:AG108,AH3))","v":""},"Branchiopoda",0,{"$f":"IF(AK3=0,\"\",INDEX(AJ3:AJ108,AK3))","v":""},"Freshwater",0,{"$f":"IF(AN3=0,\"\",INDEX(AM3:AM108,AN3))","v":""},"15°C",0,{"$f":"IF(AQ3=0,\"\",INDEX(AP3:AP108,AQ3))","v":""},"Acute ",0,{"$f":"IF(AT3=0,\"\",INDEX(AS3:AS108,AT3))","v":""},"N.A.",0,{"$f":"IF(AW3=0,\"\",INDEX(AV3:AV108,AW3))","v":""},"Salinity1",null,"N.A."]
[null,null,"Citation",{"$f":"IF(AL3=\"\",0,1)","v":0},null,{"$f":"IF(H8=\"\",0,1)","v":0},"Lifestage",null,null,"Class",null,null,null,null,"Australian Bass",null,null,"1 year old",null,null,"13 days",null,null,"N.A.",null,null,"N.A.",null,null,"Microalga",null,null,"N.A.",null,null,"Chlorophyceae",null,null,"Marinewater",null,null,"25°C",null,null,"Chronic",null,null,"PH11",null,null,"Salinity2"]
[null,null,null,{"$f":"IF(AO3=\"\",0,1)","v":0},null,{"$f":"IF(AX3=\"\",0,1)","v":0},"Exposure duration",null,null,"Media",null,null,null,null,"N.A.",null,null,"N.A.",null,null,"N.A.",null,null,"NOEC",null,null,"Reproduction",null,null,"N.A.",null,null,"Tracheophyta",null,null,"N.A.",null,null,"N.A.",null,null,"N.A.",null,null,"N.A.",null,null,"PH7.0 "]
[null,null,null,{"$f":"IF(AR3=\"\",0,1)","v":0},null,{"$f":"IF(Q3=\"\",0,1)","v":0},"Measure of toxicity",null,null,"Temperature "]
[null,null,null,{"$f":"IF(AU3=\"\",0,1)","v":0},null,{"$f":"IF(T3=\"\",0,1)","v":0},"Toxicity endpoint",null,null,"Acute Or Chronic "]
[null,null,null,null,null,{"$f":"IF(W3=\"\",0,1)","v":0},"Toxicity value",null,null,"PH"]
[null,2,"Select the appropriate answer option to each question. Comments can be added to the cells in column H.",null,null,{"$f":"IF(Z3=\"\",0,1)","v":0},null,null,null,"Salinity/Conductivity","N.A."]
[null,"*","If the selected answer option does not work try clicking on any other cell first and then click back on the answer option again.",null,null,{"$f":"IF(AC3=\"\",0,1)","v":0}]
[null,"No.","Question","Marks Awarded","Answer Options","Option References","Scores","Answers"]
[null,null,"Was the duration of the exposure stated (e.g. 48 or 96 h)?",10,null,0,{"$f":"IF(F15=0,0,INDEX($D12:$D13,F12,1))","v":0}]
[null,1,null,0]
[]
[null,null,"Was the biological endpoint (e.g., immobilization or population growth) stated and defined (10 marks)? Award 5 marks if the biological endpoint is only stated.",10,null,0,{"$f":"IF(F15=0,0,INDEX($D15:$D17,F15,1))","v":0}]
[null,2,null,5]
[null,null,null,0]
[null,null,"Was the biological effect stated (e.g. LC or NOEC)?",5,null,0,{"$f":"IF(F18=0,0,INDEX($D18:$D19,F18,1))","v":0}]
[null,3,null,0]
[]
[null,4,"Was the biological effect quantified (e.g. 50% effect, 25% effect)? \nNote: The effect for NOEC and LOEC data must be quantified.",5,null,0,{"$f":"IF(F21=0,0,INDEX($D21:$D22,F21,1))","v":0}]
[null,null,null,0]
[null,5,"Were appropriate controls (e.g. a no-toxicant control and/or solvent control) used?",5,null,0,{"$f":"IF(F23=0,0,INDEX($D23:$D24,F23,1))","v":0}]
[null,null,null,0]
[]
[null,6,"Was each control and contaminant concentration at least duplicated?",5,null,0,{"$f":"IF(F26=0,0,INDEX($D26:$D27,F26,1))","v":0}]
[null,null,null,0]
[]
[null,7,"Were test acceptability criteria stated (e.g. mortality in controls must not exceed a certain percentage) (5 marks)?\nOR Were test acceptability criteria inferred (e.g. test method used [USEPA, OECD, ASTM etc.]) (award 2 marks). \nNote: Data that fail the acceptability criteria are automatically deemed to be of unacceptable quality and must not be used. ",5,null,0,{"$f":"IF(F29=0,0,INDEX($D29:$D31,F29,1))","v":0}]
[null,null,null,2]
[null,null,null,0]
[null,8,"Were the characteristics of the test organism (e.g. length, mass, age) stated?",5,null,0,{"$f":"IF(F32=0,0,INDEX($D32:$D34,F32,1))","v":0}]
[null,null,null,0]
[]
[null,9,"Was the type of test media used stated?",5,null,0,{"$f":"IF(F35=0,0,INDEX($D35:$D37,F35,1))","v":0}]
[null,null,null,0]
[]
[null,null,"Was the type of exposure (e.g. static, flow through) stated? ",4,null,0,{"$f":"IF(F38=0,0,INDEX($D38:$D40,F38,1))","v":0}]
[null,10,null,0]
[]
[null,null,"Were the contaminant concentrations measured at the beginning and end of the exposure (4 marks)? Award 2 marks if they were measured only once during the test.\nNote: If the concentrations were not measured then automatically the data cannot be high quality. ",4,null,0,{"$f":"IF(F41=0,0,INDEX($D41:$D43,F41,1))","v":0}]
[null,11,null,2]
[null,null,null,0]
[null,null,"Were parallel reference toxicant toxicity tests conducted?",4,null,0,{"$f":"IF(F44=0,0,INDEX($D44:$D46,F44,1))","v":0}]
[null,12,null,0]
[]
[null,null,"Was there a concentration–response relationship either observable or stated?",4,null,0,{"$f":"IF(F47=0,0,INDEX($D47:$D49,F47,1))","v":0}]
[null,13,null,0]
[]
[null,null,"Was an appropriate statistical method or model used to determine the toxicity?\nNote: They should be accepted by a recognised national or international regulatory body (e.g. USEPA, OECD, ASTM). ",4,null,0,{"$f":"IF(F50=0,0,INDEX($D50:$D52,F50,1))","v":0}]
[null,14,null,0]
[]
[null,15,"For LC/EC/BEC data was an estimate of variability provided? \nOR \nFor NO EC/LOEC data was the significance level 0.05 or less?  \n\n",4,null,0,{"$f":"IF(F53=0,0,INDEX($D53:$D55,F53,1))","v":0}]
[null,null,null,0]
[]
[null,16,"Were the following parameters measured and stated? (3 marks if measured and stated, 1 mark if just measured)."]
[null,null,null,3,null,0,{"$f":"IF(F57=0,0,INDEX($D57:$D59,F57,1))","v":0}]
[null,16.100000000000001,"pH ",1]
[null,null,null,0]
[null,null,null,3,null,0,{"$f":"IF(F60=0,0,INDEX($D60:$D62,F60,1))","v":0}]
[null,16.2,"Hardness",1]
[null,null,null,0]
[null,null,null,3,null,0,{"$f":"IF(F63=0,0,INDEX($D63:$D65,F63,1))","v":0}]
[null,16.3,"Alkalinity ",1]
[null,null,null,0]
[null,null,null,3,null,0,{"$f":"IF(F66=0,0,INDEX($D66:$D68,F66,1))","v":0}]
[null,16.399999999999999,"Organic carbon concentration",1]
[null,null,null,0]
[null,null,"Was the temperature measured and stated (3 marks)? Award 1 mark if the temperature was measured but not stated or if only the temperature settings of the room or chamber are stated.",3,null,0,{"$f":"IF(F69=0,0,INDEX($D69:$D71,F69,1))","v":0}]
[null,17,null,1]
[null,null,null,0]
[null,null,"Were test solutions, blanks and/or controls tested for contamination OR were analytical reagent grade chemicals used or the highest possible purity chemicals used for the experiment? (3 marks).",3,null,0,{"$f":"IF(F72=0,0,INDEX($D72:$D73,F72,1))","v":0}]
[null,18,null,0]
[]
[null,null,null,null,null,null,null,null,{"$f":"(COUNTIF(F12:F73,\"=0\"))+COUNTIF(F2:F10,\"=0\")+COUNTIF(D2:D7,\"=0\")","v":36}]
[]
[]
[null,null,"Total score",null,null,null,{"$f":"IF(SUM(G12:G72)=0,\"\",SUM(G12:G72))","v":""}]
[null,null,"Total Max. possible score for the various types of data and contaminants ",null,{"$f":"D12+D15+D18+D21+D23+D26+D29+D32+D35+D38+D41+D44+D47+D50+D53+D57+D66+D69+D72+D60+D63","v":97}]
[null,null,"Quality Score",null,{"$f":"\"= [Total score / Total possible score] * 100 = \"","v":"= [Total score / Total possible score] * 100 = "},null,{"$f":"IF(ISERROR(G78/E79),#N/A,G78/E79)","v":{"$error":"#N/A"}},{"$f":"IF(F41=3,\"The highest possible grade for this datum is acceptable.\",\"\")","v":""}]
[]
[null,null,"H = high quality                           Quality score ≥ 80%      "]
[null,null,"A = acceptable quality         > 50% Quality score < 80%      "]
[null,null,"U = unacceptable quality              Quality score ≤ 50%  "]
[]
[3,null,"Click the 'Save & Update' button to save and export the answers to the 'All results' worksheet. "]
[null,null,"Select the 'Reset Answers' button if you wish to clear all answers."]

{"sheet":"FW metal plant_WS","index":10,"n_rows":5,"n_cols":24,"rows_kept":5,"cut":false,"hidden":false,"merged":[]}
[]
["Question No.",1,2,3,4,5,6,7,8,9,10,11,12,13,14,15,16.100000000000001,16.2,16.3,16.399999999999999,17,18,"Total Score","Quality Score"]
["Short Questions","Duration of the exposure ","Biological endpoint","Biological effect stated or not","Biological effect quantified or not","Appropriate controls","Control & contaminant concentration","Test acceptability criteria","Characteristics of the test organism"," Type of test media","Type of exposure","Contaminant concentrations","Parallel reference toxicant toxicity tests","Concentration–response relationship","Determine the toxicity","NOEC/LOEC or LC/EC/BEC","pH","Hardness","Alkalinity ","Organic carbon concentration","Temperature","Grade or purity"]
["Marks Awarded ","10 or 0","10,5 or 0","5 or 0 ","5 or 0 ","5 or 0 ","5 or 0 ","5 or 0 ","5 or 0 ","5 or 0 ","4 or 0","4 or 2 or 0","4 or 2","4 or 2","4 or 2","4 or 2","3 or 1 or 0","3 or 1 or 0","3 or 1 or 0","3 or 1 or 0","3 or 0","3 or 0 "]
["Max. Possible Score",10,10,5,5,5,5,5,5,5,4,4,4,4,4,4,3,3,3,3,3,3,{"$f":"SUM(B5:V5)","v":97}]

{"sheet":"FW nonmetal plant","index":11,"n_rows":79,"n_cols":53,"rows_kept":79,"cut":false,"hidden":false,"merged":[[3,4,7,4],[9,2,9,4],[11,2,13,2],[11,7,13,7],[14,2,16,2],[14,7,16,7],[17,2,19,2],[17,7,19,7],[20,2,21,2],[20,7,21,7],[22,2,24,2],[22,7,24,7],[25,2,27,2],[25,7,27,7],[28,2,30,2],[28,7,30,7],[31,2,33,2],[31,7,33,7],[34,2,36,2],[34,7,36,7],[37,2,39,2],[37,7,39,7],[40,2,42,2],[40,7,42,7],[43,2,45,2],[43,7,45,7],[46,2,48,2],[46,7,48,7],[49,2,51,2],[49,7,51,7],[60,2,62,2],[60,7,62,7],[63,2,66,2],[63,7,66,7],[52,2,54,2],[52,7,54,7],[56,2,59,2],[56,7,59,7]]}
[null,1,"Fill in the blank cells below, based on information provided in the paper being assessed. You can either pick an option from the dropdown list or add the appropriate detail using the 'Add to list' button. ",null,null,null,null,null,null,null,null,null,null,null,"* All the text in RED are used for drop down list ,make changes with caution."]
[null,null,"Category",{"$f":"IF(AF3=\"\",0,1)","v":1},"Freshwater/non-metal/plant",{"$f":"IF(E3=\"\",0,1)","v":1},"Citation No.",{"$f":"IF(ISERROR(FIND(\"-\",E3)),E3,LEFT(E3,FIND(\"-\",E3)-1))","v":"1000"},null,"Taxonomic group",null,null,null,null,"Species",null,null,"Lifestage",null,null,"Exposure duration",null,null,"Measure of toxicity",null,null,"Toxicity endpoint",null,null,"Taxonomic group",null,null,"Phylum",null,null,"Class",null,null,"Media",null,null,"Temperature ",null,null,"Acute Or Chronic",null,null,"PH",null,null,"Salinity/Conductivity"]
[null,null,"Paper and data unique identifier(eg. 1-1,10-150)",{"$f":"IF(AI3=\"\",0,1)","v":1},"1000-1",{"$f":"IF(E4=\"\",0,1)","v":1},"Species (Scientific name)",null,null,"Phylum",null,null,null,null,"Achnanthidium minutissimum",22,{"$f":"IF(P3=0,\"\",INDEX(O3:O100,P3))","v":"Scenedesmus vacuolatus"},"1 month",6,{"$f":"IF(S3=0,\"\",INDEX(R3:R100,S3))","v":"Exponential growth phase"},"1 hour",15,{"$f":"IF(V3=0,\"\",INDEX(U3:U100,V3))","v":"48 hour"},"EC10",2,{"$f":"IF(Y3=0,\"\",INDEX(X3:X100,Y3))","v":"EC50"},"Cell density",8,{"$f":"IF(AB3=0,\"\",INDEX(AA3:AA100,AB3))","v":"Growth rate: Optical cell density"},"Bacteria",5,{"$f":"IF(AE3=0,\"\",INDEX(AD3:AD100,AE3))","v":"Microalga"},"Bacillariophyta",2,{"$f":"IF(AH3=0,\"\",INDEX(AG3:AG100,AH3))","v":"Chlorophyta"},"Bacillariophyceae",3,{"$f":"IF(AK3=0,\"\",INDEX(AJ3:AJ102,AK3))","v":"Chlorophyceae"},"AAP growth medium",10,{"$f":"IF(AN3=0,\"\",INDEX(AM3:AM100,AN3))","v":"Not stated"},"15°C",9,{"$f":"IF(AQ3=0,\"\",INDEX(AP3:AP100,AQ3))","v":"25°C"},"20 ± 1 °C",3,{"$f":"IF(AT3=0,\"\",INDEX(AS3:AS100,AT3))","v":"Chronic"},8.4,7,{"$f":"IF(AW3=0,\"\",INDEX(AV3:AV100,AW3))","v":"Not stated"},"30 ppt",null,"N.A."]
[null,null,"Citation",{"$f":"IF(AL3=\"\",0,1)","v":1},"Copin,P.J., and N. Chevre (2015). Modelling the Effects of Pulse Exposure of Several PSII Inhibitors on Two Algae, Chemosphere137:70-77.",{"$f":"IF(AX3=\"\",0,1)","v":1},"Lifestage",null,null,"Class",null,null,null,null,"Aedes albopictus",null,null,"1 year old",null,null,"10 days",null,null,"EC50",null,null,"Cellular response (inhibition)",null,null,"Fish",null,null,"Chlorophyta",null,null,"Branchiopoda",null,null,"Allen and Arnon's medium",null,null,"20 ± 1 °C",null,null,"Acute ",null,null,"6.5 - 8.5",null,null,"150 uS/cm"]
[null,null,null,{"$f":"IF(AO3=\"\",0,1)","v":1},null,{"$f":"IF(H8=\"\",0,1)","v":1},"Exposure duration",null,null,"Media",null,null,null,null,"Anabaena doliolum",null,null,"3 - 4 day old culture",null,null,"11 hours",null,null,"EC60.37",null,null,"Growth Rate (Fluorescence)",null,null,"Macroalgae",null,null,"Ciliophora",null,null,"Chlorophyceae",null,null,"Artificial seawater",null,null,"21 C - 24 C (+ - @ C)",null,null,"Chronic",null,null,"6.5 + - 0.2",null,null,"N.A."]
[null,null,null,{"$f":"IF(AR3=\"\",0,1)","v":1},null,{"$f":"IF(Q3=\"\",0,1)","v":1},"Measure of toxicity",null,null,"Temperature ",null,null,null,null,"Anabaena variabilis",null,null,"5 days old",null,null,"12 days",null,null,"IC50",null,null,"Growth Rate: Area",null,null,"Macrophyte",null,null,"Cyanobacteria",null,null,"Cyanophyceae",null,null,"DV culture medium",null,null,"21°C",null,null,"N.A.",null,null,"6.8-7.0"]
[null,null,null,{"$f":"IF(AU3=\"\",0,1)","v":1},null,{"$f":"IF(T3=\"\",0,1)","v":1},"Toxicity endpoint",null,null,"Acute Or Chronic ",null,null,null,null,"Australian Bass",null,null,"Exponential",null,null,"13 days ",null,null,"IC50",null,null,"Growth rate: Fluoresence",null,null,"Microalga",null,null,"N.A.",null,null,"Fragilariophyceae",null,null,"Filter-sterilised double deionized water",null,null,"21-24 C",null,null,null,null,null,"7.6-9.0"]
[null,null,null,null,null,{"$f":"IF(W3=\"\",0,1)","v":1},"Toxicity value","14.3 ug/L",null,"PH",null,null,null,null,"Craticula accomoda",null,null,"Exponential growth phase",null,null,"15 days",null,null,"LC50",null,null,"Growth rate: Fresh weight",null,null,"Microbe",null,null,"Ochrophyta",null,null,"Gammaproteobacteria",null,null,"Freshwater",null,null,"24 (+ -2 C)",null,null,null,null,null,"N.A."]
[null,2,"Select the appropriate answer option to each question. Comments can be added to the cells in column H.",null,null,{"$f":"IF(Z3=\"\",0,1)","v":1},null,null,null,"Salinity/Conductivity","N.A.",null,null,null,"Cyclotella meneghiniana",null,null,"Exponential growth phase",null,null,"15 minutes",null,null,"LOEC",null,null,"Growth rate: Frond number",null,null,"N.A.",null,null,"Proteobacteria",null,null,"Liliopsida",null,null,"Marinewater",null,null,"24 ± 1°C",null,null,null,null,null,"Not stated"]
[null,"*","If the selected answer option does not work try clicking on any other cell first and then click back on the answer option again.",null,null,{"$f":"IF(AC3=\"\",0,1)","v":1},null,null,null,null,null,null,null,null,"Encyonema silesiacum",null,null,"Exponential growth phase",null,null,"30 minutes",null,null,"N.A.",null,null,"Growth rate: Optical cell density",null,null,"Protozoa",null,null,"Tracheophyta",null,null,"N.A.",null,null,"Mineral culture medium, freshwater",null,null,"25 - 27°C growth chamber",null,null,null,null,null,"PH11"]
[null,"No.","Question","Marks Awarded","Answer Options","Option References","Scores","Answers",null,null,null,null,null,null,"Fistulifera saprophila",null,null,"N.A.",null,null,"7 day",null,null,"NOEC",null,null,"Growth Rate: Optical cell density (750 nm)",null,null,null,null,null,"Tracheophyta",null,null,"Oligohymenophorea",null,null,"N.A.",null,null,"25°C",null,null,null,null,null,"PH7.0"]
[null,null,"Was the duration of the exposure stated (e.g. 48 or 96 h)?",10,null,1,{"$f":"IF(F15=0,0,INDEX($D12:$D13,F12,1))","v":10},"48 hour",null,null,null,null,null,null,"Fragilaria capucina var vaucheriae",null,null,"Not stated",null,null,"72 hour",null,null,null,null,null,"Growth Rate: Optical density (650 nm)",null,null,null,null,null,null,null,null,"Phaeophyceae",null,null,"Not stated",null,null,"28 C"]
[null,1,null,0,null,null,null,null,null,null,null,null,null,null,"Fragilaria crotonensis",null,null,"Thalli",null,null,"72 ug/L",null,null,null,null,null,"Growth rate: Optical density (670 nm)",null,null,null,null,null,null,null,null,null,null,null,"Proteose-peptone yeast salts defined medium",null,null,"N.A."]
[null,null,null,null,null,null,null,null,null,null,null,null,null,null,"Fragilaria rumpens",null,null,null,null,null,"9 hour",null,null,null,null,null,"Growth: Cell density",null,null,null,null,null,null,null,null,null,null,null,"Volvic mineral water",null,null,"Not stated"]
[null,null,"Was the biological endpoint (e.g., immobilization or population growth) stated and defined (10 marks)? Award 5 marks if the biological endpoint is only stated.",10,null,1,{"$f":"IF(F15=0,0,INDEX($D15:$D17,F15,1))","v":10},"Population abundance: Growth Rate: Optical cell density.",null,null,null,null,null,null,"Gomphonema clavatum",null,null,null,null,null,"96 hour",null,null,null,null,null,"Growth: ChlA"]
[null,2,null,5,null,null,null,null,null,null,null,null,null,null,"Gomphonema parvulum",null,null,null,null,null,"N.A.",null,null,null,null,null,"Mortality"]
[null,null,null,0,null,null,null,null,null,null,null,null,null,null,"Lemna minor",null,null,null,null,null,"48 hour",null,null,null,null,null,"N.A."]
[null,null,"Was the biological effect stated (e.g. LC or NOEC)?",5,null,1,{"$f":"IF(F18=0,0,INDEX($D18:$D19,F18,1))","v":5},"EC",null,null,null,null,null,null,"Mayamaea fossalis",null,null,null,null,null,null,null,null,null,null,null,"Population Abundance: Growth: Chlorophyll a"]
[null,3,null,0,null,null,null,null,null,null,null,null,null,null,"N.A.",null,null,null,null,null,null,null,null,null,null,null,"Population: Growth inhibition (cell yield)"]
[null,null,null,null,null,null,null,null,null,null,null,null,null,null,"Navicula forcipata",null,null,null,null,null,null,null,null,null,null,null,"Population: Growth inhibition (fluorescence)"]
[null,4,"Was the biological effect quantified (e.g. 50% effect, 25% effect)? \nNote: The effect for NOEC and LOEC data must be quantified.",5,null,1,{"$f":"IF(F21=0,0,INDEX($D21:$D22,F21,1))","v":5},50,null,null,null,null,null,null,"Nitzschia palea",null,null,null,null,null,null,null,null,null,null,null,"Population: Growth rate: Growth inhibition"]
[null,null,null,0,null,null,null,null,null,null,null,null,null,null,"Oscillatoria cf. chalybea",null,null,null,null,null,null,null,null,null,null,null,"Reproduction"]
[null,5,"Were appropriate controls (e.g. a no-toxicant control and/or solvent control) used?",5,null,1,{"$f":"IF(F23=0,0,INDEX($D23:$D24,F23,1))","v":5},"no toxicant control",null,null,null,null,null,null,"Saccharina japonica"]
[null,null,null,0,null,null,null,null,null,null,null,null,null,null,"Scenedesmus vacuolatus"]
[null,null,null,null,null,null,null,null,null,null,null,null,null,null,"Selenastrum capricornutum"]
[null,6,"Was each control and contaminant concentration at least duplicated?",5,null,1,{"$f":"IF(F26=0,0,INDEX($D26:$D27,F26,1))","v":5},"Triplicate",null,null,null,null,null,null,"Sellaphora minima"]
[null,null,null,0,null,null,null,null,null,null,null,null,null,null,"Tetrahymena pyriformis"]
[null,null,null,null,null,null,null,null,null,null,null,null,null,null,"Ulnaria ulna"]
[null,7,"Were test acceptability criteria stated (e.g. mortality in controls must not exceed a certain percentage) (5 marks)?\nOR Were test acceptability criteria inferred (e.g. test method used [USEPA, OECD, ASTM etc.]) (award 2 marks). \nNote: Data that fail the acceptability criteria are automatically deemed to be of unacceptable quality and must not be used. ",5,null,2,{"$f":"IF(F29=0,0,INDEX($D29:$D31,F29,1))","v":2},"OECD prodecure",null,null,null,null,null,null,"Vibrio fischeri"]
[null,null,null,2,null,null,null,null,null,null,null,null,null,null,"Vibrio fischeri"]
[null,null,null,0]
[null,8,"Were the characteristics of the test organism (e.g. length, mass, age) stated?",5,null,1,{"$f":"IF(F32=0,0,INDEX($D32:$D34,F32,1))","v":5},"Unicellular microalgae S. vacuolatus (Chlorophyceae; strain 211-15, Shihira and Krauss, Melbourne, Australia) and P. subcapitata (Chlorophyceae; strain 61.81, Nygaard, Komárek, J. Kristiansen and Skulberg, Akershus, Norway)"]
[null,null,null,0]
[]
[null,9,"Was the type of test media used stated?",5,null,2,{"$f":"IF(F35=0,0,INDEX($D35:$D37,F35,1))","v":0},"Growth media"]
[null,null,null,0]
[]
[null,null,"Was the type of exposure (e.g. static, flow through) stated? ",4,null,2,{"$f":"IF(F38=0,0,INDEX($D38:$D40,F38,1))","v":0},"not stated"]
[null,10,null,0]
[]
[null,null,"Were the contaminant concentrations measured at the beginning and end of the exposure (4 marks)? Award 2 marks if they were measured only once during the test.\nNote: If the concentrations were not measured then automatically the data cannot be high quality. ",4,null,3,{"$f":"IF(F41=0,0,INDEX($D41:$D43,F41,1))","v":0},"nominal concentrations"]
[null,11,null,2]
[null,null,null,0]
[null,null,"Were parallel reference toxicant toxicity tests conducted?",4,null,2,{"$f":"IF(F44=0,0,INDEX($D44:$D46,F44,1))","v":0}]
[null,12,null,0]
[]
[null,null,"Was there a concentration–response relationship either observable or stated?",4,null,1,{"$f":"IF(F47=0,0,INDEX($D47:$D49,F47,1))","v":4},"Log-logistic dose response model."]
[null,13,null,0]
[]
[null,null,"Was an appropriate statistical method or model used to determine the toxicity?\nNote: They should be accepted by a recognised national or international regulatory body (e.g. USEPA, OECD, ASTM). ",4,null,1,{"$f":"IF(F50=0,0,INDEX($D50:$D52,F50,1))","v":4},"This dose-response curve is calculated by using the statistics software Prism."]
[null,14,null,0]
[]
[null,15,"For LC/EC/BEC data was an estimate of variability provided? \nOR \nFor NO EC/LOEC data was the significance level 0.05 or less?  \n\n",4,null,1,{"$f":"IF(F53=0,0,INDEX($D53:$D55,F53,1))","v":4},"95% confidence intervals."]
[null,null,null,0]
[]
[null,16,"Were the following parameters measured and stated? (3 marks if measured and stated, 1 mark if just measured)."]
[null,null,"pH",3,null,3,{"$f":"IF(F57=0,0,INDEX($D57:$D59,F57,1))","v":0},"not stated"]
[null,16.100000000000001,null,1]
[null,null,null,0]
[]
[null,null,"Was the temperature measured and stated (3 marks)? Award 1 mark if the temperature was measured but not stated or if only the temperature settings of the room or chamber are stated.",3,null,1,{"$f":"IF(F61=0,0,INDEX($D61:$D63,F61,1))","v":3},"25 degrees C"]
[null,17,null,1]
[null,null,null,0]
[null,null,"Were test solutions, blanks and/or controls tested for contamination OR were analytical reagent grade chemicals used or the highest possible purity chemicals used for the experiment? (3 marks).",3,null,1,{"$f":"IF(F64=0,0,INDEX($D64:$D65,F64,1))","v":3},"99% diuron"]
[null,18,null,0]
[]
[null,null,null,null,null,null,null,null,{"$f":"COUNTIF(D2:D7,\"=0\")+COUNTIF(F2:F10,\"=0\")+COUNTIF(F12:F64,\"=0\")","v":0}]
[]
[]
[null,null,"Total score",null,null,null,{"$f":"IF(SUM(G12:G67)=0,\"\",SUM(G12:G67))","v":65}]
[null,null,"Total Max. possible score for the various types of data and contaminants ",null,{"$f":"D12+D15+D18+D21+D23+D26+D29+D32+D35+D38+D41+D44+D47+D50+D53+D57+D61+D64","v":88}]
[null,null,"Quality Score",null,{"$f":"\"= [Total score / Total possible score] * 100 = \"","v":"= [Total score / Total possible score] * 100 = "},null,{"$f":"IF(ISERROR(G70/E71),#N/A,G70/E71)","v":0.73863636363636365},{"$f":"IF(F41=3,\"The highest possible grade for this datum is acceptable.\",\"\")","v":"The highest possible grade for this datum is acceptable."}]
[]
[null,null,"H = high quality                           Quality score ≥ 80%  "]
[null,null,"A = acceptable quality         > 50% Quality score < 80%     "]
[null,null,"U = unacceptable quality              Quality score ≤ 50%"]
[]
[3,null,"Click the 'Save & Update' button to save and export the answers to the 'All results' worksheet. "]
[null,null,"Select the 'Reset Answers' button if you wish to clear all answers."]

{"sheet":"FW nonmetal plant_WS","index":12,"n_rows":264,"n_cols":22,"rows_kept":264,"cut":false,"hidden":false,"merged":[]}
[]
["Question No.",1,2,3,4,5,6,7,8,9,10,11,12,13,14,15,16.100000000000001,17,18,"Total Score","Quality Score","Comment "]
["Short Questions","Duration of the exposure ","Biological endpoint","Biological effect stated or not","Biological effect quantified or not","Appropriate controls","Control & contaminant concentration","Test acceptability criteria","Characteristics of the test organism"," Type of test media","Type of exposure","Contaminant concentrations","Parallel reference toxicant toxicity tests","Concentration–response relationship","Determine the toxicity","NOEC/LOEC or LC/EC/BEC","pH","Temperature","Grade or purity"]
["Category","Freshwater/non-metal/plant","Paper and data unique identifier(eg. 1-1,10-150)","955-1"]
["Scores",10,10,5,5,5,5,5,5,0,4,2,0,4,4,4,1,1,3,73,0.82954545454545459,""]
["Answers","","","","","","","","","","","","","","","","","",""]
["Category","Freshwater/non-metal/plant","Paper and data unique identifier(eg. 1-1,10-150)","955-2"]
["Scores",10,10,5,5,5,5,0,0,0,4,2,0,0,4,4,0,0,3,57,0.64772727272727271,""]
["Answers","","","","","","","","","","","","","","","","","",""]
["Category","Freshwater/non-metal/plant","Paper and data unique identifier(eg. 1-1,10-150)","959-1"]
["Scores",10,10,5,5,5,5,0,0,5,0,4,0,4,4,4,0,0,3,64,0.72727272727272729,""]
["Answers","","","","","","","","","","","","","","","","","",""]
["Category","Freshwater/non-metal/plant","Paper and data unique identifier(eg. 1-1,10-150)","959-2"]
["Scores",10,10,5,5,5,5,0,0,5,0,4,0,4,4,4,0,0,3,64,0.72727272727272729,""]
["Answers","","","","","","","","","","","","","","","","","",""]
["Category","Freshwater/non-metal/plant","Paper and data unique identifier(eg. 1-1,10-150)","959-3"]
["Scores",10,10,5,5,5,5,0,0,5,0,4,0,4,4,4,0,0,3,64,0.72727272727272729,""]
["Answers","","","","","","","","","","","","","","","","","",""]
["Category","Freshwater/non-metal/plant","Paper and data unique identifier(eg. 1-1,10-150)","959-4"]
["Scores",10,10,5,5,5,5,0,0,5,0,4,0,4,4,4,0,0,3,64,0.72727272727272729,""]
["Answers","","","","","","","","","","","","","","","","","",""]
["Category","Freshwater/non-metal/plant","Paper and data unique identifier(eg. 1-1,10-150)","959-5"]
["Scores",10,10,5,5,5,5,0,0,5,0,4,0,4,4,4,0,0,3,64,0.72727272727272729,""]
["Answers","","","","","","","","","","","","","","","","","",""]
["Category","Freshwater/non-metal/plant","Paper and data unique identifier(eg. 1-1,10-150)","959-6"]
["Scores",10,10,5,5,5,5,0,0,5,0,4,0,4,4,4,0,0,3,64,0.72727272727272729,""]
["Answers","","","","","","","","","","","","","","","","","",""]
["Category","Freshwater/non-metal/plant","Paper and data unique identifier(eg. 1-1,10-150)","959-7"]
["Scores",10,10,5,5,5,5,0,0,5,0,4,0,4,4,4,0,0,3,64,0.72727272727272729,""]
["Answers","","","","","","","","","","","","","","","","","",""]
["Category","Freshwater/non-metal/plant","Paper and data unique identifier(eg. 1-1,10-150)","959-8"]
["Scores",10,10,5,5,5,5,0,0,5,0,4,0,4,4,4,0,0,3,64,0.72727272727272729,""]
["Answers","","","","","","","","","","","","","","","","","",""]
["Category","Freshwater/non-metal/plant","Paper and data unique identifier(eg. 1-1,10-150)","959-9"]
["Scores",10,10,5,5,5,5,0,0,5,0,4,0,4,4,4,0,0,3,64,0.72727272727272729,""]
["Answers","","","","","","","","","","","","","","","","","",""]
["Category","Freshwater/non-metal/plant","Paper and data unique identifier(eg. 1-1,10-150)","959-10"]
["Scores",10,10,5,5,5,5,0,0,5,0,4,0,4,4,4,0,0,3,64,0.72727272727272729,""]
["Answers","","","","","","","","","","","","","","","","","",""]
["Category","Freshwater/non-metal/plant","Paper and data unique identifier(eg. 1-1,10-150)","959-11"]
["Scores",10,10,5,5,5,5,0,0,5,0,4,0,4,4,4,0,0,3,64,0.72727272727272729,""]
["Answers","","","","","","","","","","","","","","","","","",""]
["Category","Freshwater/non-metal/plant","Paper and data unique identifier(eg. 1-1,10-150)","959-12"]
["Scores",10,10,5,5,5,5,0,0,5,0,4,0,4,4,4,0,0,3,64,0.72727272727272729,""]
["Answers","","","","","","","","","","","","","","","","","",""]
["Category","Freshwater/non-metal/plant","Paper and data unique identifier(eg. 1-1,10-150)","959-13"]
["Scores",10,10,5,5,5,5,0,0,5,0,4,0,4,4,4,0,0,3,64,0.72727272727272729,""]
["Answers","","","","","","","","","","","","","","","","","",""]
["Category","Freshwater/non-metal/plant","Paper and data unique identifier(eg. 1-1,10-150)","959-14"]
["Scores",10,10,5,5,5,5,0,0,5,0,4,0,4,4,4,0,0,3,64,0.72727272727272729,""]
["Answers","","","","","","","","","","","","","","","","","",""]
["Category","Freshwater/non-metal/plant","Paper and data unique identifier(eg. 1-1,10-150)","959-14"]
["Scores",10,10,5,5,5,5,0,0,5,0,4,0,4,4,4,0,0,3,64,0.72727272727272729,""]
["Answers","","","","","","","","","","","","","","","","","",""]
["Category","Freshwater/non-metal/plant","Paper and data unique identifier(eg. 1-1,10-150)","959-15"]
["Scores",10,10,5,5,5,5,0,0,5,0,4,0,4,4,4,0,0,3,64,0.72727272727272729,""]
["Answers","","","","","","","","","","","","","","","","","",""]
["Category","Freshwater/non-metal/plant","Paper and data unique identifier(eg. 1-1,10-150)","959-16"]
["Scores",10,10,5,5,5,5,0,0,5,0,4,0,4,4,4,0,0,3,64,0.72727272727272729,""]
["Answers","","","","","","","","","","","","","","","","","",""]
["Category","Freshwater/non-metal/plant","Paper and data unique identifier(eg. 1-1,10-150)","959-17"]
["Scores",10,10,5,5,5,5,0,0,5,0,4,0,4,4,4,0,0,3,64,0.72727272727272729,""]
["Answers","","","","","","","","","","","","","","","","","",""]
["Category","Freshwater/non-metal/plant","Paper and data unique identifier(eg. 1-1,10-150)","959-18"]
["Scores",10,10,5,5,5,5,0,0,5,0,4,0,4,4,4,0,0,3,64,0.72727272727272729,""]
["Answers","","","","","","","","","","","","","","","","","",""]
["Category","Freshwater/non-metal/plant","Paper and data unique identifier(eg. 1-1,10-150)","959-19"]
["Scores",10,10,5,5,5,5,0,0,5,0,4,0,4,4,4,0,0,3,64,0.72727272727272729,""]
["Answers","","","","","","","","","","","","","","","","","",""]
["Category","Freshwater/non-metal/plant","Paper and data unique identifier(eg. 1-1,10-150)","959-20"]
["Scores",10,10,5,5,5,5,0,0,5,0,4,0,4,4,4,0,0,3,64,0.72727272727272729,""]
["Answers","","","","","","","","","","","","","","","","","",""]
["Category","Freshwater/non-metal/plant","Paper and data unique identifier(eg. 1-1,10-150)","959-21"]
["Scores",10,10,5,5,5,5,0,0,5,0,4,0,4,4,4,0,0,3,64,0.72727272727272729,""]
["Answers","","","","","","","","","","","","","","","","","",""]
["Category","Freshwater/non-metal/plant","Paper and data unique identifier(eg. 1-1,10-150)","959-22"]
["Scores",10,10,5,5,5,5,0,0,5,0,4,0,4,4,4,0,0,3,64,0.72727272727272729,""]
["Answers","","","","","","","","","","","","","","","","","",""]
["Category","Freshwater/non-metal/plant","Paper and data unique identifier(eg. 1-1,10-150)","959-23"]
["Scores",10,10,5,5,5,5,0,0,5,0,4,0,4,4,4,0,0,3,64,0.72727272727272729,""]
["Answers","","","","","","","","","","","","","","","","","",""]
["Category","Freshwater/non-metal/plant","Paper and data unique identifier(eg. 1-1,10-150)","959-24"]
["Scores",10,10,5,5,5,5,0,0,5,0,4,0,4,4,4,0,0,3,64,0.72727272727272729,""]
["Answers","","","","","","","","","","","","","","","","","",""]
["Category","Freshwater/non-metal/plant","Paper and data unique identifier(eg. 1-1,10-150)","959-25"]
["Scores",10,10,5,5,5,5,0,0,5,0,4,0,4,4,4,0,0,3,64,0.72727272727272729,""]
["Answers","","","","","","","","","","","","","","","","","",""]
["Category","Freshwater/non-metal/plant","Paper and data unique identifier(eg. 1-1,10-150)","959-26"]
["Scores",10,10,5,5,5,5,0,0,5,0,4,0,4,4,4,0,0,3,64,0.72727272727272729,""]
["Answers","","","","","","","","","","","","","","","","","",""]
["Category","Freshwater/non-metal/plant","Paper and data unique identifier(eg. 1-1,10-150)","959-27"]
["Scores",10,10,5,5,5,5,0,0,5,0,4,0,4,4,4,0,0,3,64,0.72727272727272729,""]
["Answers","","","","","","","","","","","","","","","","","",""]
["Category","Freshwater/non-metal/plant","Paper and data unique identifier(eg. 1-1,10-150)","959-28"]
["Scores",10,10,5,5,5,5,0,0,5,0,4,0,4,4,4,0,0,3,64,0.72727272727272729,""]
["Answers","","","","","","","","","","","","","","","","","",""]
["Category","Freshwater/non-metal/plant","Paper and data unique identifier(eg. 1-1,10-150)","959-29"]
["Scores",10,10,5,5,5,5,0,0,5,0,4,0,4,4,4,0,0,3,64,0.72727272727272729,""]
["Answers","","","","","","","","","","","","","","","","","",""]
["Category","Freshwater/non-metal/plant","Paper and data unique identifier(eg. 1-1,10-150)","959-30"]
["Scores",10,10,5,5,5,5,0,0,5,0,4,0,4,4,4,0,0,3,64,0.72727272727272729,""]
["Answers","","","","","","","","","","","","","","","","","",""]
["Category","Freshwater/non-metal/plant","Paper and data unique identifier(eg. 1-1,10-150)","959-31"]
["Scores",10,10,5,5,5,5,0,0,5,0,4,0,4,4,4,0,0,3,64,0.72727272727272729,""]
["Answers","","","","","","","","","","","","","","","","","",""]
["Category","Freshwater/non-metal/plant","Paper and data unique identifier(eg. 1-1,10-150)","959-32"]
["Scores",10,10,5,5,5,5,0,0,5,0,4,0,4,4,4,0,0,3,64,0.72727272727272729,""]
["Answers","","","","","","","","","","","","","","","","","",""]
["Category","Freshwater/non-metal/plant","Paper and data unique identifier(eg. 1-1,10-150)","959-33"]
["Scores",10,10,5,5,5,5,0,0,5,0,4,0,4,4,4,0,0,3,64,0.72727272727272729,""]
["Answers","","","","","","","","","","","","","","","","","",""]
["Category","Freshwater/non-metal/plant","Paper and data unique identifier(eg. 1-1,10-150)","959-34"]
["Scores",10,10,5,5,5,5,0,0,5,0,4,0,4,4,4,0,0,3,64,0.72727272727272729,""]
["Answers","","","","","","","","","","","","","","","","","",""]
["Category","Freshwater/non-metal/plant","Paper and data unique identifier(eg. 1-1,10-150)","959-35"]
["Scores",10,10,5,5,5,5,0,0,5,0,4,0,4,4,4,0,0,3,64,0.72727272727272729,""]
["Answers","","","","","","","","","","","","","","","","","",""]
["Category","Freshwater/non-metal/plant","Paper and data unique identifier(eg. 1-1,10-150)","959-36"]
["Scores",10,10,5,5,5,5,0,0,5,0,4,0,4,4,4,0,0,3,64,0.72727272727272729,""]
["Answers","","","","","","","","","","","","","","","","","",""]
["Category","Freshwater/non-metal/plant","Paper and data unique identifier(eg. 1-1,10-150)","959-37"]
["Scores",10,10,5,5,5,5,0,0,5,0,4,0,4,4,4,0,0,3,64,0.72727272727272729,""]
["Answers","","","","","","","","","","","","","","","","","",""]
["Category","Freshwater/non-metal/plant","Paper and data unique identifier(eg. 1-1,10-150)","959-38"]
["Scores",10,10,5,5,5,5,0,0,5,0,4,0,4,4,4,0,0,3,64,0.72727272727272729,""]
["Answers","","","","","","","","","","","","","","","","","",""]
["Category","Freshwater/non-metal/plant","Paper and data unique identifier(eg. 1-1,10-150)","959-39"]
["Scores",10,10,5,5,5,5,0,0,5,0,4,0,4,4,4,0,0,3,64,0.72727272727272729,""]
["Answers","","","","","","","","","","","","","","","","","",""]
["Category","Freshwater/non-metal/plant","Paper and data unique identifier(eg. 1-1,10-150)","959-40"]
["Scores",10,10,5,5,5,5,0,0,5,0,4,0,4,4,4,0,0,3,64,0.72727272727272729,""]
["Answers","","","","","","","","","","","","","","","","","",""]
["Category","Freshwater/non-metal/plant","Paper and data unique identifier(eg. 1-1,10-150)","959-41"]
["Scores",10,10,5,5,5,5,0,0,5,0,4,0,4,4,4,0,0,3,64,0.72727272727272729,""]
["Answers","","","","","","","","","","","","","","","","","",""]
["Category","Freshwater/non-metal/plant","Paper and data unique identifier(eg. 1-1,10-150)","959-42"]
["Scores",10,10,5,5,5,5,0,0,5,0,4,0,4,4,4,0,0,3,64,0.72727272727272729,""]
["Answers","","","","","","","","","","","","","","","","","",""]
["Category","Freshwater/non-metal/plant","Paper and data unique identifier(eg. 1-1,10-150)","959-43"]
["Scores",10,10,5,5,5,5,0,0,5,0,4,0,4,4,4,0,0,3,64,0.72727272727272729,""]
["Answers","","","","","","","","","","","","","","","","","",""]
["Category","Freshwater/non-metal/plant","Paper and data unique identifier(eg. 1-1,10-150)","959-44"]
["Scores",10,10,5,5,5,5,0,0,5,0,4,0,4,4,4,0,0,3,64,0.72727272727272729,""]
["Answers","","","","","","","","","","","","","","","","","",""]
["Category","Freshwater/non-metal/plant","Paper and data unique identifier(eg. 1-1,10-150)","959-45"]
["Scores",10,10,5,5,5,5,0,0,5,0,4,0,4,4,4,0,0,3,64,0.72727272727272729,""]
["Answers","","","","","","","","","","","","","","","","","",""]
["Category","Freshwater/non-metal/plant","Paper and data unique identifier(eg. 1-1,10-150)","959-46"]
["Scores",10,10,5,5,5,5,0,0,5,0,4,0,4,4,4,0,0,3,64,0.72727272727272729,""]
["Answers","","","","","","","","","","","","","","","","","",""]
["Category","Freshwater/non-metal/plant","Paper and data unique identifier(eg. 1-1,10-150)","959-47"]
["Scores",10,10,5,5,5,5,0,0,5,0,4,0,4,4,4,0,0,3,64,0.72727272727272729,""]
["Answers","","","","","","","","","","","","","","","","","",""]
["Category","Freshwater/non-metal/plant","Paper and data unique identifier(eg. 1-1,10-150)","959-48"]
["Scores",10,10,5,5,5,5,0,0,5,0,4,0,4,4,4,0,0,3,64,0.72727272727272729,""]
["Answers","","","","","","","","","","","","","","","","","",""]
["Category","Freshwater/non-metal/plant","Paper and data unique identifier(eg. 1-1,10-150)","959-49"]
["Scores",10,10,5,5,5,5,0,0,5,0,4,0,4,4,4,0,0,3,64,0.72727272727272729,""]
["Answers","","","","","","","","","","","","","","","","","",""]
["Category","Freshwater/non-metal/plant","Paper and data unique identifier(eg. 1-1,10-150)","959-50"]
["Scores",10,10,5,5,5,5,0,0,5,0,4,0,4,4,4,0,0,3,64,0.72727272727272729,""]
["Answers","","","","","","","","","","","","","","","","","",""]
["Category","Freshwater/non-metal/plant","Paper and data unique identifier(eg. 1-1,10-150)","959-51"]
["Scores",10,10,5,5,5,5,0,0,5,0,4,0,4,4,4,0,0,3,64,0.72727272727272729,""]
["Answers","","","","","","","","","","","","","","","","","",""]
["Category","Freshwater/non-metal/plant","Paper and data unique identifier(eg. 1-1,10-150)","959-52"]
["Scores",10,10,5,5,5,5,0,0,5,0,4,0,4,4,4,0,0,3,64,0.72727272727272729,""]
["Answers","","","","","","","","","","","","","","","","","",""]
["Category","Freshwater/non-metal/plant","Paper and data unique identifier(eg. 1-1,10-150)","959-53"]
["Scores",10,10,5,5,5,5,0,0,5,0,4,0,4,4,4,0,0,3,64,0.72727272727272729,""]
["Answers","","","","","","","","","","","","","","","","","",""]
["Category","Freshwater/non-metal/plant","Paper and data unique identifier(eg. 1-1,10-150)","959-54"]
["Scores",10,10,5,5,5,5,0,0,5,0,4,0,4,4,4,0,0,3,64,0.72727272727272729,""]
["Answers","","","","","","","","","","","","","","","","","",""]
["Category","Freshwater/non-metal/plant","Paper and data unique identifier(eg. 1-1,10-150)","959-55"]
["Scores",10,10,5,5,5,5,0,0,5,0,4,0,4,4,4,0,0,3,64,0.72727272727272729,""]
["Answers","","","","","","","","","","","","","","","","","",""]
["Category","Freshwater/non-metal/plant","Paper and data unique identifier(eg. 1-1,10-150)","959-56"]
["Scores",10,10,5,5,5,5,0,0,5,0,4,0,4,4,4,0,0,3,64,0.72727272727272729,""]
["Answers","","","","","","","","","","","","","","","","","",""]
["Category","Freshwater/non-metal/plant","Paper and data unique identifier(eg. 1-1,10-150)","959-57"]
["Scores",10,10,5,5,5,5,0,0,5,0,4,0,4,4,4,0,0,3,64,0.72727272727272729,""]
["Answers","","","","","","","","","","","","","","","","","",""]
["Category","Freshwater/non-metal/plant","Paper and data unique identifier(eg. 1-1,10-150)","960-1"]
["Scores",10,5,5,5,5,5,0,5,5,0,4,0,4,4,4,0,0,3,64,0.72727272727272729,""]
["Answers","","","","","","","","","","","","","","","","","",""]
["Category","Freshwater/non-metal/plant","Paper and data unique identifier(eg. 1-1,10-150)","960-2"]
["Scores",10,5,5,5,5,5,0,5,5,0,4,0,4,4,4,0,0,3,64,0.72727272727272729,""]
["Answers","","","","","","","","","","","","","","","","","",""]
["Category","Freshwater/non-metal/plant","Paper and data unique identifier(eg. 1-1,10-150)","960-3"]
["Scores",10,5,5,5,5,5,0,5,5,0,4,0,4,4,4,0,0,3,64,0.72727272727272729,""]
["Answers","","","","","","","","","","","","","","","","","",""]
["Category","Freshwater/non-metal/plant","Paper and data unique identifier(eg. 1-1,10-150)","960-4"]
["Scores",10,5,5,5,5,5,0,5,5,0,4,0,4,4,4,0,0,3,64,0.72727272727272729,""]
["Answers","","","","","","","","","","","","","","","","","",""]
["Category","Freshwater/non-metal/plant","Paper and data unique identifier(eg. 1-1,10-150)","960-5"]
["Scores",10,5,5,5,5,5,0,5,5,0,4,0,4,4,4,0,0,3,64,0.72727272727272729,""]
["Answers","","","","","","","","","","","","","","","","","",""]
["Category","Freshwater/non-metal/plant","Paper and data unique identifier(eg. 1-1,10-150)","960-6"]
["Scores",10,5,5,5,5,5,0,5,5,0,4,0,4,4,4,0,0,3,64,0.72727272727272729,""]
["Answers","","","","","","","","","","","","","","","","","",""]
["Category","Freshwater/non-metal/plant","Paper and data unique identifier(eg. 1-1,10-150)","944-4"]
["Scores",10,10,5,5,0,5,0,0,0,4,0,0,0,4,4,0,0,3,50,0.56818181818181823,"The highest possible grade for this datum is acceptable."]
["Answers","","","","","","","","","","","","","","","","","",""]
["Category","Freshwater/non-metal/plant","Paper and data unique identifier(eg. 1-1,10-150)","944-5"]
["Scores",10,10,5,5,0,5,0,0,0,4,0,0,0,4,4,0,0,3,50,0.56818181818181823,"The highest possible grade for this datum is acceptable."]
["Answers","","","","","","","","","","","","","","","","","",""]
["Category","Freshwater/non-metal/plant","Paper and data unique identifier(eg. 1-1,10-150)","721-2"]
["Scores",10,10,5,5,5,5,2,5,5,0,0,0,4,4,4,1,1,3,69,0.78409090909090906,"The highest possible grade for this datum is acceptable."]
["Answers","","","","","","","","","","","OECD Guideline stated this should be done however no mention of it in text","","","","","","",""]
["Category","Freshwater/non-metal/plant","Paper and data unique identifier(eg. 1-1,10-150)","965-1"]
["Scores",10,10,0,0,5,5,0,5,5,0,0,0,4,4,4,3,0,3,58,0.65909090909090906,"The highest possible grade for this datum is acceptable."]
["Answers","","","","","","","","","","","","","","","","","",""]
["Category","Freshwater/non-metal/plant","Paper and data unique identifier(eg. 1-1,10-150)","965-2"]
["Scores",10,10,0,0,5,5,0,5,5,0,0,0,4,4,4,3,0,3,58,0.65909090909090906,"The highest possible grade for this datum is acceptable."]
["Answers","","","","","","","","","","","","","","","","","",""]
["Category","Freshwater/non-metal/plant","Paper and data unique identifier(eg. 1-1,10-150)","965-3"]
["Scores",10,10,5,5,5,5,0,5,5,0,0,0,4,4,4,3,0,3,68,0.77272727272727271,"The highest possible grade for this datum is acceptable."]
["Answers","","","","","","","","","","","","","","","","","",""]
["Category","Freshwater/non-metal/plant","Paper and data unique identifier(eg. 1-1,10-150)","965-4"]
["Scores",10,10,5,5,5,5,0,5,5,0,0,0,4,4,4,3,0,3,68,0.77272727272727271,"The highest possible grade for this datum is acceptable."]
["Answers","","","","","","","","","","","","","","","","","",""]
["Category","Freshwater/non-metal/plant","Paper and data unique identifier(eg. 1-1,10-150)","965-5"]
["Scores",10,10,5,5,5,5,0,5,5,0,0,0,4,4,4,3,0,3,68,0.77272727272727271,"The highest possible grade for this datum is acceptable."]
["Answers","","","","","","","","","","","","","","","","","",""]
["Category","Freshwater/non-metal/plant","Paper and data unique identifier(eg. 1-1,10-150)","965-6"]
["Scores",10,10,5,5,5,5,0,5,5,0,0,0,4,4,4,3,0,3,68,0.77272727272727271,"The highest possible grade for this datum is acceptable."]
["Answers","","","","","","","","","","","","","","","","","",""]
["Category","Freshwater/non-metal/plant","Paper and data unique identifier(eg. 1-1,10-150)","965-7"]
["Scores",10,10,5,5,5,5,0,5,5,0,0,0,4,4,4,3,0,3,68,0.77272727272727271,"The highest possible grade for this datum is acceptable."]
["Answers","","","","","","","","","","","","","","","","","",""]
["Category","Freshwater/non-metal/plant","Paper and data unique identifier(eg. 1-1,10-150)","944-5-OK"]
["Scores",10,10,5,5,5,5,0,0,0,4,0,0,0,0,4,0,3,3,54,0.61363636363636365,"The highest possible grade for this datum is acceptable."]
["Answers","30 minutes","Bioluminescence inhibition: Concentrations required to induce a 50% decrease in bioluminescence compared with the untreated bacteria.","EC",0.5,"","","","","","Static","","","","Confidence Intervals","Confidence Intervals","","28 degrees C","45463, Pestanal (analytical standard)"]
["Category","Freshwater/non-metal/plant","Paper and data unique identifier(eg. 1-1,10-150)","944-4-OK"]
["Scores",10,10,5,5,5,5,0,0,0,4,0,0,0,0,4,0,3,3,54,0.61363636363636365,"The highest possible grade for this datum is acceptable."]
["Answers","15 minutes","Bioluminescence inhibition: Concentrations required to induce a 50% decrease in bioluminescence compared with the untreated bacteria.","EC",0.5,"","","","","","Static","","","","Confidence Intervals","Confidence Intervals","","28 degrees C","45463, Pestanal (analytical standard)"]
["Category","Freshwater/non-metal/plant","Paper and data unique identifier(eg. 1-1,10-150)","914-1"]
["Scores",10,10,5,5,5,0,0,5,5,0,0,0,4,4,4,0,3,3,63,0.71590909090909094,"The highest possible grade for this datum is acceptable."]
["Answers","4 days","Measuring growth from ChlA inhibition","IC",50,"No toxicant control","Not stated","Data failed the acceptability criteria (Q7) are automatically deemed to be of unacceptable quality and must not be used.","5 day old cultures","Mineral culture medium, freshwater","Not stated","Nominal","","Figure 8","","","Not stated","21C","From Aldrich-Sigma (purity = >98%)"]
["Category","Freshwater/non-metal/plant","Paper and data unique identifier(eg. 1-1,10-150)","625-1"]
["Scores",10,10,5,0,5,0,0,0,5,4,0,0,0,0,0,3,3,3,48,0.54545454545454541,"The highest possible grade for this datum is acceptable."]
["Answers","96 hour","Optical cell density from absorbance readings.","LOEC","","No-toxicant control","Not-stated","Data failed the acceptability criteria (Q7) are automatically deemed to be of unacceptable quality and must not be used.","Not stated","Filter-sterilised double deionized water","Static, aerated.","Not stated","","Not stated","Not stated","Not stated","7.6-9.0","25 - 27°C growth chamber","Technical grade - 80% purity"]
["Category","Freshwater/non-metal/plant","Paper and data unique identifier(eg. 1-1,10-150)","625-2"]
["Scores",10,10,5,0,5,0,0,0,5,4,0,0,0,0,0,3,3,3,48,0.54545454545454541,"The highest possible grade for this datum is acceptable."]
["Answers","96 hour","Optical cell density from absorbance readings.","LOEC","","No-toxicant control","Not-stated","Data failed the acceptability criteria (Q7) are automatically deemed to be of unacceptable quality and must not be used.","Not stated","Filter-sterilised double deionized water","Static, aerated.","Not stated","","Not stated","Not stated","Not stated","7.6-9.0","25 - 27°C growth chamber","Technical grade - 80% purity"]
["Category","Freshwater/non-metal/plant","Paper and data unique identifier(eg. 1-1,10-150)","625-3"]
["Scores",10,10,5,0,5,0,0,0,5,4,0,0,0,0,0,3,3,3,48,0.54545454545454541,"The highest possible grade for this datum is acceptable."]
["Answers","96 hour","Optical cell density from absorbance readings.","LOEC","","No-toxicant control","Not-stated","Data failed the acceptability criteria (Q7) are automatically deemed to be of unacceptable quality and must not be used.","Not stated","Filter-sterilised double deionized water","Static, aerated.","Not stated","","Not stated","Not stated","Not stated","7.6-9.0","25 - 27°C growth chamber","Technical grade - 80% purity"]
["Category","Freshwater/non-metal/plant","Paper and data unique identifier(eg. 1-1,10-150)","625-4"]
["Scores",10,10,5,0,5,0,0,0,5,4,0,0,0,0,0,3,3,3,48,0.54545454545454541,"The highest possible grade for this datum is acceptable."]
["Answers","96 hour","Optical cell density from absorbance readings.","LOEC","","No-toxicant control","Not-stated","Data failed the acceptability criteria (Q7) are automatically deemed to be of unacceptable quality and must not be used.","Not stated","Filter-sterilised double deionized water","Static, aerated.","Not stated","","Not stated","Not stated","Not stated","7.6-9.0","25 - 27°C growth chamber","Technical grade - 80% purity"]
["Category","Freshwater/non-metal/plant","Paper and data unique identifier(eg. 1-1,10-150)","626-1"]
["Scores",10,10,5,5,5,0,0,5,5,0,0,0,4,4,0,0,3,0,56,0.63636363636363635,"The highest possible grade for this datum is acceptable."]
["Answers","12 days","The specific growth rate was calculated\nas described by Kratz and Myers = as a measure of cell concentration the optical density was determined by absorption - which is a function of the concentration, size and pigmentation of the cells.","IC",50,"No-toxicant control","not stated","","Axenic cultures - exponential growth phase.","Allen and Arnon's medium.","not stated","Assuming nominal from Figure 4a. Not-stated.","","Figure 4a.","not stated","not stated","","24 ± 1°C","not-stated"]
["Category","Freshwater/non-metal/plant","Paper and data unique identifier(eg. 1-1,10-150)","996-2"]
["Scores",10,10,5,5,5,5,2,5,0,0,0,0,4,0,0,0,1,3,55,0.625,"The highest possible grade for this datum is acceptable."]
["Answers","96 hours","Algal growth relative to the controls: uses cell number to get % inhibition. Large explanation in paper.","EC",50,"no-toxicant control","Test concentrations in duplicate and controls in triplicate.","OECD Guideline 201.","Exponential growth phase. Starting cell number is stated.","not stated","not stated","not stated","","Mentioned in section 2.2.3. The acute toxicity response obtained in these bioassays was plotted against the toxicant concentrations to obtain the dose–response curve.","not stated","not stated","not stated","20 ± 1°C in temperature controlled chamber.","Analytical standard (>99% purity)"]
["Category","Freshwater/non-metal/plant","Paper and data unique identifier(eg. 1-1,10-150)","999-1"]
["Scores",10,10,5,5,5,5,2,5,0,0,0,0,4,4,4,0,3,3,65,0.73863636363636365,"The highest possible grade for this datum is acceptable."]
["Answers","48 hour","Population abundance: Growth Rate: Optical cell density.","EC",50,"no toxicant control","Triplicate","OECD prodecure","Unicellular microalgae S. vacuolatus (Chlorophyceae; strain 211-15, Shihira and Krauss, Melbourne, Australia) and P. subcapitata (Chlorophyceae; strain 61.81, Nygaard, Komárek, J. Kristiansen and Skulberg, Akershus, Norway)","Growth media","not stated","nominal concentrations","","Log-logistic dose response model.","95% confidence intervals.","95% confidence intervals.","not stated","25 degrees C","99% diuron"]
["Category","Freshwater/non-metal/plant","Paper and data unique identifier(eg. 1-1,10-150)","1000-1"]
["Scores",10,10,5,5,5,5,2,5,0,0,0,0,4,4,4,0,3,3,65,0.73863636363636365,"The highest possible grade for this datum is acceptable."]
["Answers","48 hour","Population abundance: Growth Rate: Optical cell density.","EC",50,"no toxicant control","Triplicate","OECD prodecure","Unicellular microalgae S. vacuolatus (Chlorophyceae; strain 211-15, Shihira and Krauss, Melbourne, Australia) and P. subcapitata (Chlorophyceae; strain 61.81, Nygaard, Komárek, J. Kristiansen and Skulberg, Akershus, Norway)","Growth media","not stated","nominal concentrations","","Log-logistic dose response model.","95% confidence intervals.","95% confidence intervals.","not stated","25 degrees C","99% diuron"]

{"sheet":"MEW nonplant","index":13,"n_rows":84,"n_cols":53,"rows_kept":84,"cut":false,"hidden":false,"merged":[[68,2,71,2],[68,7,71,7],[56,7,58,7],[65,7,67,7],[52,2,54,2],[52,7,54,7],[59,7,61,7],[65,2,67,2],[62,2,64,2],[62,7,64,7],[43,2,45,2],[43,7,45,7],[46,2,48,2],[46,7,48,7],[49,2,51,2],[49,7,51,7],[34,2,36,2],[34,7,36,7],[37,2,39,2],[37,7,39,7],[40,2,42,2],[40,7,42,7],[25,2,27,2],[25,7,27,7],[28,2,30,2],[28,7,30,7],[31,2,33,2],[31,7,33,7],[17,2,19,2],[17,7,19,7],[20,2,21,2],[20,7,21,7],[22,2,24,2],[22,7,24,7],[3,4,7,4],[9,2,9,4],[11,2,13,2],[11,7,13,7],[14,2,16,2],[14,7,16,7]]}
[null,1,"Fill in the blank cells below, based on information provided in the paper being assessed. You can either pick an option from the dropdown list or add the appropriate detail using the 'Add to list' button. ",null,null,{"$f":"IF(BA3=\"\",0,1)","v":1},null,null,null,null,null,null,null,null,"* All the text in RED are used for drop down list ,make changes with caution."]
[null,null,"Category",{"$f":"IF(AF3=\"\",0,1)","v":1},"MEW_nonplant",{"$f":"IF(E3=\"\",0,1)","v":0},"Citation No.",{"$f":"IF(ISERROR(FIND(\"-\",E3)),E3,LEFT(E3,FIND(\"-\",E3)-1))","v":0},null,"Taxonomic group",null,null,null,null,"Species",null,null,"Lifestage",null,null,"Exposure duration",null,null,"Measure of toxicity",null,null,"Toxicity endpoint",null,null,"Taxonomic group",null,null,"Phylum",null,null,"Class",null,null,"Media",null,null,"Temperature ",null,null,"Acute Or Chronic",null,null,"PH",null,null,"Salinity/Comdictivity"]
[null,null,"Paper and data unique identifier(eg. 1-1,10-150)",{"$f":"IF(AI3=\"\",0,1)","v":1},null,{"$f":"IF(E4=\"\",0,1)","v":0},"Species (Scientific name)",null,null,"Phylum",null,null,null,null,"Acropora tumida",15,{"$f":"IF(P3=0,\"\",INDEX(O3:O105,P3))","v":"Psetta maxima"},"<2.5 hour old eggs",5,{"$f":"IF(S3=0,\"\",INDEX(R3:R105,S3))","v":"Embryo"},"10 days",14,{"$f":"IF(V3=0,\"\",INDEX(U3:U105,V3))","v":"6 days"},"EC50",4,{"$f":"IF(Y3=0,\"\",INDEX(X3:X105,Y3))","v":"LC50"},"Based on reduced weight",3,{"$f":"IF(AB3=0,\"\",INDEX(AA3:AA105,AB3))","v":"Mortality"},"Bacteria",5,{"$f":"IF(AE3=0,\"\",INDEX(AD3:AD105,AE3))","v":"Fish"},"Annelida",7,{"$f":"IF(AH3=0,\"\",INDEX(AG3:AG105,AH3))","v":"Chordata"},"Actinopterygii",1,{"$f":"IF(AK3=0,\"\",INDEX(AJ3:AJ105,AK3))","v":"Actinopterygii"},"Atrificial seawater",8,{"$f":"IF(AN3=0,\"\",INDEX(AM3:AM105,AN3))","v":"Natural filtered seawater (FSW)"},"15°C",2,{"$f":"IF(AQ3=0,\"\",INDEX(AP3:AP105,AQ3))","v":"18 (+ - 1) C"},"Acute",1,{"$f":"IF(AT3=0,\"\",INDEX(AS3:AS105,AT3))","v":"Acute"},"6.8 + - 0.1",9,{"$f":"IF(AW3=0,\"\",INDEX(AV3:AV105,AW3))","v":"8.29 ± 0.11"},0.35,11,{"$f":"IF(AZ3=0,\"\",INDEX(AY3:AY105,AZ3))","v":"34.20 ± 0.15 ppt"}]
[null,null,"Citation",{"$f":"IF(AL3=\"\",0,1)","v":1},null,{"$f":"IF(H8=\"\",0,1)","v":0},"Lifestage",null,null,"Class",null,null,null,null,"Aedes albopictus",null,null,"1 month",null,null,"11 hour",null,null,"Hatching success",null,null,"Hatching success",null,null,"Coral",null,null,"Annelida",null,null,"Actinopterygii",null,null,"Daigo's Artificial Seawater",null,null,"18 (+ - 1) C",null,null,"Chronic",null,null,"8.0 ± 0.2",null,null,0.38]
[null,null,null,{"$f":"IF(AO3=\"\",0,1)","v":1},null,{"$f":"IF(AX3=\"\",0,1)","v":1},"Exposure duration",null,null,"Media",null,null,null,null,"Artemia salina",null,null,"1 year old",null,null,"13 days",null,null,"LC10",null,null,"Mortality",null,null,"Coral",null,null,"Arthropoda",null,null,"Actinopterygii",null,null,"Filtered sea water",null,null,"23 C",null,null,"N.A.",null,null,"8.1 - 8.4",null,null,"150 uS/cm"]
[null,null,null,{"$f":"IF(AR3=\"\",0,1)","v":1},null,{"$f":"IF(Q3=\"\",0,1)","v":1},"Measure of toxicity",null,null,"Temperature ",null,null,null,null,"Australian Bass",null,null,"Adult",null,null,"15 min",null,null,"LC50",null,null,"Mortality: Bioluminescence inhibition",null,null,"Crustacean",null,null,"Bivalvia",null,null,"Anthozoa",null,null,"Filtered seawater",null,null,"24.5 C",null,null,null,null,null,"8.29 (+ - 0.1)",null,null,"18 ± 1°C"]
[null,null,null,{"$f":"IF(AU3=\"\",0,1)","v":1},null,{"$f":"IF(T3=\"\",0,1)","v":1},"Toxicity endpoint",null,null,"Acute Or Chronic ",null,null,null,null,"Balanus amphitrite",null,null,"Embryo",null,null,"2 days",null,null,"LOAEL",null,null,"N.A.",null,null,"Fish",null,null,"Chlorophyta",null,null,"Ascidiacea",null,null,"Freshwater",null,null,"25 (+ - 1) C",null,null,null,null,null,"N.A.",null,null,"30 ppt"]
[null,null,null,null,null,{"$f":"IF(W3=\"\",0,1)","v":1},"Toxicity value",null,null,"PH",null,null,null,null,"Ciona intestinalis",null,null,"Fertilised eggs (0-2 hour post-fert)",null,null,"24 hour",null,null,"LOEC",null,null,"Reproduction",null,null,"Fish ",null,null,"Chordata",null,null,"Bivalvia",null,null,"Marinewater",null,null,"25°C",null,null,null,null,null,"Not stated",null,null,"33 (+ - 0.5) %"]
[null,2,"Select the appropriate answer option to each question. Comments can be added to the cells in column H.",null,null,{"$f":"IF(Z3=\"\",0,1)","v":1},null,null,null,"Salinity/Conductivity",null,null,null,null,"Crassostrea gigas",null,null,"II - III Instar",null,null,"30 min",null,null,"N.A.",null,null,"Reproduction: Fertilisation rate",null,null,"Macroinvertebrate",null,null,"Chordata",null,null,"Branchiopoda",null,null,"N.A.",null,null,"N.A.",null,null,null,null,null,"PH11",null,null,"34.20 ppt"]
[null,"*","If the selected answer option does not work try clicking on any other cell first and then click back on the answer option again.",null,null,{"$f":"IF(AC3=\"\",0,1)","v":1},null,null,null,null,null,null,null,null,"Elasmopus rapax",null,null,"Juvenile",null,null,"30 minutes",null,null,"NOEC",null,null,"Reproduction: Hatching succuss",null,null,"Macroinvertebrate",null,null,"Chordata",null,null,"Branchiopoda",null,null,"Natural filtered seawater (FSW)",null,null,"Not stated",null,null,null,null,null,"PH7.0",null,null,"40 ppt"]
[null,"No.","Question","Marks Awarded","Answer Options","Option References","Scores","Answers",null,null,null,null,null,null,"Hydroides elegans ",null,null,"Larvae",null,null,"36 hour",null,null,null,null,null,"Survival Rate",null,null,"Microalga",null,null,"Cnidaria",null,null,"Chlorophyceae",null,null,"Not stated",null,null,null,null,null,null,null,null,"8.29 ± 0.11",null,null,"N.A."]
[null,null,"Was the duration of the exposure stated (e.g. 48 or 96 h)?",10,null,1,{"$f":"IF(F15=0,0,INDEX($D12:$D13,F12,1))","v":10},"6 days",null,null,null,null,null,null,"Lumbriculus variegatus",null,null,"Larvae (2 hrs old)",null,null,"4 days",null,null,null,null,null,"Reproduction: % Hatching success",null,null,"N.A.",null,null,"Echinodermata",null,null,"Clitellata",null,null,null,null,null,null,null,null,null,null,null,null,null,null,"Not stated"]
[null,1,null,0,null,null,null,null,null,null,null,null,null,null,"N.A.",null,null,"Mature fertilised eggs",null,null,"48 hour",null,null,null,null,null,null,null,null,"Polychaete",null,null,"Mollusca ",null,null,"Echinoidea",null,null,null,null,null,null,null,null,null,null,null,null,null,null,"34.20 ± 0.15 ppt"]
[null,null,null,null,null,null,null,null,null,null,null,null,null,null,"Oryzias melastigma",null,null,"N.A.",null,null,"96 hour",null,null,null,null,null,null,null,null,null,null,null,"N.A.",null,null,"Gammapproteoobacteria"]
[null,null,"Was the biological endpoint (e.g., immobilization or population growth) stated and defined (10 marks)? Award 5 marks if the biological endpoint is only stated.",10,null,1,{"$f":"IF(F15=0,0,INDEX($D15:$D17,F15,1))","v":10},"Hatching was defined as the rupture of the egg membrane, and partially as well as fully hatched larvae were counted as hatched. Mortality was identified by coagulation of the embryos, missing heartbeat, failure to develop somites and a non-detached tail. ",null,null,null,null,null,null,"Pagrus auratus",null,null,"Not stated",null,null,"N.A.",null,null,null,null,null,null,null,null,null,null,null,"Proteobacteria",null,null,"Malacostraca"]
[null,2,null,5,null,null,null,null,null,null,null,null,null,null,"Paracentrotus lividus",null,null,"not stated",null,null,"6 days",null,null,null,null,null,null,null,null,null,null,null,"Tracheophyta",null,null,"Maxillopoda"]
[null,null,null,0,null,null,null,null,null,null,null,null,null,null,"Psetta maxima",null,null,"Small adults",null,null,null,null,null,null,null,null,null,null,null,null,null,null,null,null,null,"N.A."]
[null,null,"Was the biological effect stated (e.g. LC or NOEC)?",5,null,1,{"$f":"IF(F18=0,0,INDEX($D18:$D19,F18,1))","v":5},null,null,null,null,null,null,null,"Tigriopus japonicus",null,null,"Larvae 96hr post-hatch",null,null,null,null,null,null,null,null,null,null,null,null,null,null,null,null,null,"Polychaeta"]
[null,3,null,0,null,null,null,null,null,null,null,null,null,null,"Vibrio fischeri"]
[]
[null,4,"Was the biological effect quantified (e.g. 50% effect, 25% effect)? \nNote: The effect for NOEC and LOEC data must be quantified.",5,null,1,{"$f":"IF(F21=0,0,INDEX($D21:$D22,F21,1))","v":5}]
[null,null,null,0]
[null,5,"Were appropriate controls (e.g. a no-toxicant control and/or solvent control) used?",5,null,1,{"$f":"IF(F23=0,0,INDEX($D23:$D24,F23,1))","v":5},"Solvent control and no-toxicant control."]
[null,null,null,0]
[]
[null,6,"Was each control and contaminant concentration at least duplicated?",5,null,1,{"$f":"IF(F26=0,0,INDEX($D26:$D27,F26,1))","v":5},"Quadruplicate (4 reps)"]
[null,null,null,0]
[]
[null,7,"Were test acceptability criteria stated (e.g. mortality in controls must not exceed a certain percentage) (5 marks)?\nOR Were test acceptability criteria inferred (e.g. test method used [USEPA, OECD, ASTM etc.]) (award 2 marks). \nNote: Data that fail the acceptability criteria are automatically deemed to be of unacceptable quality and must not be used. ",5,null,1,{"$f":"IF(F29=0,0,INDEX($D29:$D31,F29,1))","v":5},"OECD Guidelines (1998) & EU Commission Directive 92/69/EEC. The controls showed normal embryo–larval development, with control mortality always below 10 %, as required for test validity."]
[null,null,null,2]
[null,null,null,0]
[null,8,"Were the characteristics of the test organism (e.g. length, mass, age) stated?",5,null,1,{"$f":"IF(F32=0,0,INDEX($D32:$D34,F32,1))","v":5},"Embryos: 72 hour post fertilisation of eggs - the embryos used were those that exhibited normal development that had reached the blastula stage."]
[null,null,null,0]
[]
[null,9,"Was the type of test media used stated?",5,null,1,{"$f":"IF(F35=0,0,INDEX($D35:$D37,F35,1))","v":5},"Natural filtered seawater (FSW)"]
[null,null,null,0]
[]
[null,null,"Was the type of exposure (e.g. static, flow through) stated? ",4,null,1,{"$f":"IF(F38=0,0,INDEX($D38:$D40,F38,1))","v":4},"Semi-static (renewal every 48 hours)."]
[null,10,null,0]
[]
[null,null,"Were the contaminant concentrations measured at the beginning and end of the exposure (4 marks)? Award 2 marks if they were measured only once during the test.\nNote: If the concentrations were not measured then automatically the data cannot be high quality. ",4,null,3,{"$f":"IF(F41=0,0,INDEX($D41:$D43,F41,1))","v":0},"not stated"]
[null,11,null,2]
[null,null,null,0]
[null,null,"Were parallel reference toxicant toxicity tests conducted?",4,null,2,{"$f":"IF(F44=0,0,INDEX($D44:$D46,F44,1))","v":0}]
[null,12,null,0]
[]
[null,null,"Was there a concentration–response relationship either observable or stated?",4,null,1,{"$f":"IF(F47=0,0,INDEX($D47:$D49,F47,1))","v":4},"Dose-response relationships were described using the modified Weibull model. See Figure 1 (% survivorship)."]
[null,13,null,0]
[]
[null,null,"Was an appropriate statistical method or model used to determine the toxicity?\nNote: They should be accepted by a recognised national or international regulatory body (e.g. USEPA, OECD, ASTM). ",4,null,1,{"$f":"IF(F50=0,0,INDEX($D50:$D52,F50,1))","v":4},"The maximum NOEC and LOEC were established through ANOVA and Dunnett’s post hoc test using the SPSS application, version 19.0. Non-parametric tests, Kruskal–Wallis and the Mann–Whitney U, were used when the data did not meet the requirements of normality and homoscedasticity. Differences were considered as significant when p < 0.05"]
[null,14,null,0]
[]
[null,15,"For LC/EC/BEC data was an estimate of variability provided? \nOR \nFor NO EC/LOEC data was the significance level 0.05 or less?  \n\n",4,null,1,{"$f":"IF(F53=0,0,INDEX($D53:$D55,F53,1))","v":4},"95% Confidence Interval. P=0.05. "]
[null,null,null,0]
[]
[null,16,"Were the following parameters measured and stated? (3 marks if measured and stated, 1 mark if just measured)."]
[null,null,null,3,null,1,{"$f":"IF(F57=0,0,INDEX($D57:$D59,F57,1))","v":3},"34.20 ± 0.15 ppt"]
[null,16.100000000000001,"Conductivity/Salinity",1]
[null,null,null,0]
[null,null,null,3,null,1,{"$f":"IF(F60=0,0,INDEX($D60:$D62,F60,1))","v":3},"7.32 ±0.70 mg/L"]
[null,16.2,"Dissolved Oxygen",1]
[null,null,null,0]
[null,null,"pH",3,null,1,{"$f":"IF(F63=0,0,INDEX(D63:D65,F63,1))","v":3},"8.29 ± 0.11"]
[null,16.3,null,1]
[null,null,null,0]
[null,null,"Was the temperature measured and stated (3 marks)? Award 1 mark if the temperature was measured but not stated or if only the temperature settings of the room or chamber are stated.\n\n",3,null,1,{"$f":"IF(F66=0,0,INDEX(D66:D68,F66,1))","v":3},"Isothermal room (18 ± 1 °C)"]
[null,17,null,1]
[null,null,null,0]
[null,null,"Were test solutions, blanks and/or controls tested for contamination OR were analytical reagent grade chemicals used or the highest possible purity chemicals used for the experiment? (3 marks).",3,null,1,{"$f":"IF(F69=0,0,INDEX($D69:$D70,F69,1))","v":3},"98% purity diuron"]
[null,18,null,0]
[]
[null,null,null,null,null,null,null,null,{"$f":"(COUNTIF(F12:F70,\"=0\"))+COUNTIF(F1:F10,\"=0\")+COUNTIF(D2:D7,\"=0\")","v":3}]
[]
[]
[null,null,"Total score",null,null,null,{"$f":"IF(SUM(G12:G69)=0,\"\",SUM(G12:G69))","v":86}]
[null,null,"Total Max. possible score for the various types of data and contaminants ",null,{"$f":"D12+D15+D18+D21+D23+D26+D29+D32+D35+D38+D41+D44+D47+D50+D53+D57+D60+D66+D69+D63","v":94}]
[null,null,"Quality Score",null,{"$f":"\"= [Total score / Total possible score] * 100 = \"","v":"= [Total score / Total possible score] * 100 = "},null,{"$f":"IF(ISERROR(G75/E76),#N/A,G75/E76)","v":0.91489361702127658},{"$f":"IF(F41=3,\"The highest possible grade for this datum is acceptable.\",\"\")","v":"The highest possible grade for this datum is acceptable."}]
[]
[null,null,"H = high quality                           Quality score ≥ 80%"]
[null,null,"A = acceptable quality         > 50% Quality score < 80%  "]
[null,null,"U = unacceptable quality              Quality score ≤ 50%"]
[]
[3,null,"Click the 'Save & Update' button to save and export the answers to the 'All results' worksheet. "]
[null,null,"Select the 'Reset Answers' button if you wish to clear all answers."]

{"sheet":"MEW nonplant_WS","index":14,"n_rows":137,"n_cols":24,"rows_kept":137,"cut":false,"hidden":false,"merged":[]}
[]
["Question No.",1,2,3,4,5,6,7,8,9,10,11,12,13,14,15,16.100000000000001,16.2,16.3,17,18,"Total Score","Quality Score"]
["Short Questions","Duration of the exposure ","Biological endpoint","Biological effect stated or not","Biological effect quantified or not","Appropriate controls","Control & contaminant concentration","Test acceptability criteria","Characteristics of the test organism"," Type of test media","Type of exposure","Contaminant concentrations","Parallel reference toxicant toxicity tests","Concentration–response relationship","Determine the toxicity","NOEC/LOEC or LC/EC/BEC","Conductivity/Salinity","Dissolved Oxygen","PH","Temperature","Grade or purity"]
["Marks Awarded ","10 or 0","10,5 or 0","5 or 0 ","5 or 0 ","5 or 0 ","5 or 0 ","5 or 0 ","5 or 0 ","5 or 0 ","4 or 0","4 or 2 or 0","4 or 2","4 or 2","4 or 2","4 or 2","3 or 1 or 0","3 or 1 or 0","3 or 1 or 0","3 or 0","3 or 0 "]
["Max. Possible Score",10,10,5,5,5,5,5,5,5,4,4,4,4,4,4,3,3,3,3,3,{"$f":"SUM(B5:U5)","v":94}]
["Category","MEW_nonplant","Paper and data unique identifier(eg. 1-1,10-150)","942-1"]
["Scores",10,10,5,5,5,5,0,5,5,0,0,0,4,4,4,0,0,1,1,3,67,0.71276595744680848,"The highest possible grade for this datum is acceptable."]
["Answers","","","","","","","","","","","","","","","","","","","",""]
["Category","MEW_nonplant","Paper and data unique identifier(eg. 1-1,10-150)","942-2"]
["Scores",10,10,5,5,5,5,0,5,5,0,0,0,4,4,4,0,0,1,1,3,67,0.71276595744680848,"The highest possible grade for this datum is acceptable."]
["Answers","","","","","","","","","","","","","","","","","","","",""]
["Category","MEW_nonplant","Paper and data unique identifier(eg. 1-1,10-150)","942-3"]
["Scores",10,10,5,5,5,5,0,5,5,0,0,0,4,4,4,0,0,1,1,3,67,0.71276595744680848,"The highest possible grade for this datum is acceptable."]
["Answers","","","","","","","","","","","","","","","","","","","",""]
["Category","MEW_nonplant","Paper and data unique identifier(eg. 1-1,10-150)","942-4"]
["Scores",10,10,5,5,5,5,0,5,5,0,0,0,4,4,4,0,0,1,1,3,67,0.71276595744680848,"The highest possible grade for this datum is acceptable."]
["Answers","","","","","","","","","","","","","","","","","","","",""]
["Category","MEW_nonplant","Paper and data unique identifier(eg. 1-1,10-150)","942-5"]
["Scores",10,10,5,5,5,5,0,5,5,0,0,0,4,4,4,0,0,1,1,3,67,0.71276595744680848,"The highest possible grade for this datum is acceptable."]
["Answers","","","","","","","","","","","","","","","","","","","",""]
["Category","MEW_nonplant","Paper and data unique identifier(eg. 1-1,10-150)","942-6"]
["Scores",10,10,5,5,5,5,0,5,5,0,0,0,4,4,0,0,0,1,1,3,63,0.67021276595744683,"The highest possible grade for this datum is acceptable."]
["Answers","","","","","","","","","","","","","","","","","","","",""]
["Category","MEW_nonplant","Paper and data unique identifier(eg. 1-1,10-150)","942-7"]
["Scores",10,10,5,5,5,5,0,5,5,0,0,0,4,4,4,0,0,1,1,3,67,0.71276595744680848,"The highest possible grade for this datum is acceptable."]
["Answers","","","","","","","","","","","","","","","","","","","",""]
["Category","MEW_nonplant","Paper and data unique identifier(eg. 1-1,10-150)","944-4"]
["Scores",10,10,5,5,0,5,0,0,0,0,0,0,0,4,4,0,0,0,0,3,46,0.48936170212765956,"The highest possible grade for this datum is acceptable."]
["Answers","","","","","","","","","","","","","","","","","","","",""]
["Category","MEW_nonplant","Paper and data unique identifier(eg. 1-1,10-150)","944-5"]
["Scores",10,10,5,5,0,5,0,0,0,0,0,0,0,4,4,0,0,0,0,3,46,0.48936170212765956,"The highest possible grade for this datum is acceptable."]
["Answers","","","","","","","","","","","","","","","","","","","",""]
["Category","MEW_nonplant","Paper and data unique identifier(eg. 1-1,10-150)","949-1"]
["Scores",10,0,5,5,5,5,5,5,5,4,0,0,0,4,4,1,0,0,1,0,59,0.62765957446808507,"The highest possible grade for this datum is acceptable."]
["Answers","","","","","","","","","","","","","","","","","","","",""]
["Category","MEW_nonplant","Paper and data unique identifier(eg. 1-1,10-150)","951-1"]
["Scores",10,10,5,5,5,5,5,5,5,4,0,0,4,4,4,3,0,3,3,3,83,0.88297872340425532,"The highest possible grade for this datum is acceptable."]
["Answers","","","","","","","","","","","","","","","","","","","",""]
["Category","MEW_nonplant","Paper and data unique identifier(eg. 1-1,10-150)","951-2"]
["Scores",10,10,5,5,5,5,5,5,5,4,0,0,4,4,4,3,0,3,3,3,83,0.88297872340425532,"The highest possible grade for this datum is acceptable."]
["Answers","","","","","","","","","","","","","","","","","","","",""]
["Category","MEW_nonplant","Paper and data unique identifier(eg. 1-1,10-150)","951-3"]
["Scores",10,10,5,0,5,5,5,5,5,4,0,0,4,4,4,3,0,3,3,3,78,0.82978723404255317,"The highest possible grade for this datum is acceptable."]
["Answers","","","","","","","","","","","","","","","","","","","",""]
["Category","MEW_nonplant","Paper and data unique identifier(eg. 1-1,10-150)","951-4"]
["Scores",10,10,5,0,5,5,5,5,5,4,0,0,4,4,4,3,0,3,3,3,78,0.82978723404255317,"The highest possible grade for this datum is acceptable."]
["Answers","","","","","","","","","","","","","","","","","","","",""]
["Category","MEW_nonplant","Paper and data unique identifier(eg. 1-1,10-150)","951-5"]
["Scores",10,10,5,5,5,5,5,5,5,4,0,0,4,4,4,3,0,3,3,3,83,0.88297872340425532,"The highest possible grade for this datum is acceptable."]
["Answers","","","","","","","","","","","","","","","","","","","",""]
["Category","MEW_nonplant","Paper and data unique identifier(eg. 1-1,10-150)","951-6"]
["Scores",10,10,5,5,5,5,5,5,5,4,0,0,4,4,4,3,0,3,3,3,83,0.88297872340425532,"The highest possible grade for this datum is acceptable."]
["Answers","","","","","","","","","","","","","","","","","","","",""]
["Category","MEW_nonplant","Paper and data unique identifier(eg. 1-1,10-150)","951-7"]
["Scores",10,10,5,0,5,5,5,5,5,4,0,0,4,4,4,3,0,3,3,3,78,0.82978723404255317,"The highest possible grade for this datum is acceptable."]
["Answers","","","","","","","","","","","","","","","","","","","",""]
["Category","MEW_nonplant","Paper and data unique identifier(eg. 1-1,10-150)","951-8"]
["Scores",10,10,5,0,5,5,5,5,5,4,0,0,4,4,4,3,0,3,3,3,78,0.82978723404255317,"The highest possible grade for this datum is acceptable."]
["Answers","","","","","","","","","","","","","","","","","","","",""]
["Category","MEW_nonplant","Paper and data unique identifier(eg. 1-1,10-150)","951-9"]
["Scores",10,10,5,0,5,5,5,5,5,4,0,0,4,4,4,3,0,3,3,3,78,0.82978723404255317,"The highest possible grade for this datum is acceptable."]
["Answers","","","","","","","","","","","","","","","","","","","",""]
["Category","MEW_nonplant","Paper and data unique identifier(eg. 1-1,10-150)","951-10"]
["Scores",10,10,5,0,5,5,5,5,5,4,0,0,4,4,4,3,0,3,3,3,78,0.82978723404255317,"The highest possible grade for this datum is acceptable."]
["Answers","","","","","","","","","","","","","","","","","","","",""]
["Category","MEW_nonplant","Paper and data unique identifier(eg. 1-1,10-150)","954-1"]
["Scores",10,10,5,0,5,5,0,5,5,0,0,0,0,0,4,0,0,0,3,0,56,0.5957446808510638,"The highest possible grade for this datum is acceptable."]
["Answers","","","","","","","","","","","","","","","","","","","",""]
["Category","MEW_nonplant","Paper and data unique identifier(eg. 1-1,10-150)","956-19"]
["Scores",10,5,5,5,5,5,0,5,0,4,2,0,0,4,4,3,1,3,3,3,67,0.71276595744680848,""]
["Answers","","","","","","","","","","Half the test solution was replaced on day 5","","","","","","","Only measured but not stated","","",""]
["Category","MEW_nonplant","Paper and data unique identifier(eg. 1-1,10-150)","956-20"]
["Scores",10,5,5,5,5,5,0,5,0,4,2,0,0,4,4,3,1,3,3,3,67,0.71276595744680848,""]
["Answers","","","","","","","","","","Half the test solution was replaced on day 5","","","","","","","Only measured but not stated","","",""]
["Category","MEW_nonplant","Paper and data unique identifier(eg. 1-1,10-150)","958-1"]
["Scores",10,5,5,5,0,5,0,5,5,4,0,0,0,4,0,0,0,0,3,3,54,0.57446808510638303,"The highest possible grade for this datum is acceptable."]
["Answers","","","","","","","","","","","","","","","","","","","",""]
["Category","MEW_nonplant","Paper and data unique identifier(eg. 1-1,10-150)","958-1"]
["Scores",10,5,5,5,0,0,0,5,5,4,0,0,0,4,0,0,0,0,1,0,44,0.46808510638297873,"The highest possible grade for this datum is acceptable."]
["Answers","24 hours","Mortality (lethality)","","","Not-stated","Not-stated","","Embryo","Daigo's Artificial Seawater SP","Aerated","","","","","","","","","",""]
["Category","MEW_nonplant","Paper and data unique identifier(eg. 1-1,10-150)","954-1-OK"]
["Scores",10,10,0,0,5,5,0,5,5,4,0,0,4,4,4,3,0,0,3,0,62,0.65957446808510634,"The highest possible grade for this datum is acceptable."]
["Answers","36 hours","Unhatched eggs were classified as being more or less developed than stage 15 (Table 1). This was determined by the presence of a distinct tail margin. Hatched larvae were inspected for gross spinal deformities (spinal column or tail). Hatched larvae with straight tails were classified as normal and those with no yolk sac were defined as unviable (dead) larvae.","","","Solvent control","Triplicated","","Fertilised, 2 h postspawn.","(0.22 um) filtered seawater","Airflow bubbled","Nominal","","Table 2 and Figure 1A","","","40 ppt","","","24.5 degrees C",""]
["Category","MEW_nonplant","Paper and data unique identifier(eg. 1-1,10-150)","958-1-OK"]
["Scores",10,5,5,5,5,5,0,0,5,0,0,0,4,4,0,0,1,0,3,3,55,0.58510638297872342,"The highest possible grade for this datum is acceptable."]
["Answers","24 hours","Survival rate of eggs","","","No toxicant control","Triplicate","","","Diago's artificial seawater SP","","","","Figure 3","Ecotox-Statics Software","","","","","25 degrees C","95% purity"]
["Category","MEW_nonplant","Paper and data unique identifier(eg. 1-1,10-150)","958-1-RE"]
["Scores",10,5,5,5,5,5,0,5,5,0,0,0,0,4,0,0,1,0,3,3,56,0.5957446808510638,"The highest possible grade for this datum is acceptable."]
["Answers","24 hours","Survival rate of eggs","","","No toxicant control","Triplicate","","","Diago's artificial seawater SP","","","","Figure 3","Ecotox-Statics Software","","","","","25 degrees C","95% purity"]
["Category","MEW_nonplant","Paper and data unique identifier(eg. 1-1,10-150)","958-2-RE"]
["Scores",10,5,5,5,5,5,0,5,5,0,0,0,0,4,0,0,1,0,3,3,56,0.5957446808510638,"The highest possible grade for this datum is acceptable."]
["Answers","24 hours","Survival rate of eggs","","","No toxicant control","Triplicate","","","Diago's artificial seawater SP","","","","Figure 3","Ecotox-Statics Software","","","","","25 degrees C","95% purity"]
["Category","MEW_nonplant","Paper and data unique identifier(eg. 1-1,10-150)","958-3-RE"]
["Scores",10,5,5,5,5,5,0,5,5,0,0,0,0,4,0,0,1,0,3,3,56,0.5957446808510638,"The highest possible grade for this datum is acceptable."]
["Answers","24 hours","Survival rate of eggs","","","No toxicant control","Triplicate","","","Diago's artificial seawater SP","","","","Figure 3","Ecotox-Statics Software","","","","","25 degrees C","95% purity"]
["Category","MEW_nonplant","Paper and data unique identifier(eg. 1-1,10-150)","958-4-RE"]
["Scores",10,5,5,5,5,5,0,5,5,0,0,0,0,4,0,0,1,0,3,3,56,0.5957446808510638,"The highest possible grade for this datum is acceptable."]
["Answers","24 hours","Survival rate of eggs","","","No toxicant control","Triplicate","","","Diago's artificial seawater SP","","","","Figure 3","Ecotox-Statics Software","","","","","25 degrees C","95% purity"]
["Category","MEW_nonplant","Paper and data unique identifier(eg. 1-1,10-150)","954-1-RE"]
["Scores",10,10,5,0,5,5,0,5,5,0,0,0,0,4,4,3,0,0,3,0,59,0.62765957446808507,"The highest possible grade for this datum is acceptable."]
["Answers","","","","","","","","<2.5 hours…<2 hours old when collected and tested within 0.5 hours of collection. ","","","","","","","","","","","",""]
["Category","MEW_nonplant","Paper and data unique identifier(eg. 1-1,10-150)","995-1"]
["Scores",10,10,5,5,5,5,2,0,5,4,0,0,4,4,4,3,0,3,3,3,75,0.7978723404255319,"The highest possible grade for this datum is acceptable."]
["Answers","48-50 hours","Reduction of the fertilization ability of exposed sperms. Offspring quality, expressed\nas frequency of developmental defects, was assessed.","EC",50,"No-toxicant control (filtered seawater) and solvent control. ","Three replicates.","ASTM 2004","not stated (?)","Natural filtered seawater (FSW)","ASTM methods are for static acute toxicity tests.","not stated, assumed nominal.","","Figure 2","Dunnett's Test, Linear Interpolation Method.","95% confidence intervals for EC50 values. Alpha set at 0.05 for NOEC/LOECs",0.38,"","8.0 ± 2","18 ± 1°C","Diuron of highest available purity from Sigma Aldrich (97–99,8%)"]
["Category","MEW_nonplant","Paper and data unique identifier(eg. 1-1,10-150)","995-2"]
["Scores",10,10,5,0,5,5,2,0,5,4,0,0,4,4,4,3,0,3,3,3,70,0.74468085106382975,"The highest possible grade for this datum is acceptable."]
["Answers","48-50 hours","Reduction of the fertilization ability of exposed sperms. Offspring quality, expressed\nas frequency of developmental defects, was assessed.","NOEC",50,"No-toxicant control (filtered seawater) and solvent control. ","Three replicates.","ASTM 2004","not stated (?)","Natural filtered seawater (FSW)","ASTM methods are for static acute toxicity tests.","not stated, assumed nominal.","","Figure 2","Dunnett's Test, Linear Interpolation Method.","95% confidence intervals for EC50 values. Alpha set at 0.05 for NOEC/LOECs",0.38,"","8.0 ± 2","18 ± 1°C","Diuron of highest available purity from Sigma Aldrich (97–99,8%)"]
["Category","MEW_nonplant","Paper and data unique identifier(eg. 1-1,10-150)","995-3"]
["Scores",10,10,0,0,5,5,2,0,5,4,0,0,4,4,4,3,0,3,3,3,65,0.69148936170212771,"The highest possible grade for this datum is acceptable."]
["Answers","48-50 hours","Reduction of the fertilization ability of exposed sperms. Offspring quality, expressed\nas frequency of developmental defects, was assessed.","","","No-toxicant control (filtered seawater) and solvent control. ","Three replicates.","ASTM 2004","not stated (?)","Natural filtered seawater (FSW)","ASTM methods are for static acute toxicity tests.","not stated, assumed nominal.","","Figure 2","Dunnett's Test, Linear Interpolation Method.","95% confidence intervals for EC50 values. Alpha set at 0.05 for NOEC/LOECs",0.38,"","8.0 ± 2","18 ± 1°C","Diuron of highest available purity from Sigma Aldrich (97–99,8%)"]
["Category","MEW_nonplant","Paper and data unique identifier(eg. 1-1,10-150)","997-1"]
["Scores",10,10,5,5,5,5,5,0,5,4,0,0,4,0,4,3,0,3,3,3,74,0.78723404255319152,"The highest possible grade for this datum is acceptable."]
["Answers","30 minutes","Reduction of the fertilization ability of exposed sperms. Offspring quality, expressed\nas frequency of developmental defects, was assessed.","EC",50,"no-toxicant control","triplicate","If abnormalities in the controls were 20% or more, the test was judged invalid and repeated. And ASTM.","not stated","natural filtered sea water (FSW)","ASTM methods are for static acute toxicity tests.","not stated","","","Best fit model.","Mean percentage abnormalities and 95%\nconfidence limits were calculated for all the samples and compared to the results obtained from the controls.",0.38,"","8.0 ± 2","18 ± 1°C","Diuron of highest available purity from Sigma Aldrich (97–99.8%)"]
["Category","MEW_nonplant","Paper and data unique identifier(eg. 1-1,10-150)","998-1"]
["Scores",10,10,5,0,5,5,5,5,5,4,0,0,4,4,4,3,3,3,3,3,81,0.86170212765957444,"The highest possible grade for this datum is acceptable."]
["Answers","2 days","Hatching was defined as the rupture of the egg membrane, and partially as well as fully hatched larvae were counted as hatched. Mortality was identified by coagulation of the embryos, missing heartbeat, failure to develop somites and a non-detached tail. ","NOEC/LOEC","","Solvent control and no-toxicant control.","Quadruplicate","OECD Guidelines (1998) & EU Commission Directive 92/69/EEC. The controls showed normal embryo–larval development, with control mortality always below 10 %, as required for test validity.","Embryos exhibiting normal development that had reached the blastula stage.                    Larvae are 96 hour post-hatch.","Natural filtered seawater (FSW)","Semi-static (renewal every 48 hours).","not stated","","Dose-response relationships were described using the modified Weibull model. See Figure 1 (a) and (b).","The maximum no observed effect concentration (NOEC) and the lowest observed effect concentration (LOEC) were established through ANOVA and Dunnett’s post hoc test using the SPSS application, version 19.0. Non-parametric tests, Kruskal–Wallis and the Mann–Whitney U, were used when the data did not meet the requirements of normality and homoscedasticity. Differences were considered as significant when p < 0.05","95% Confidence Interval. P=0.05. ","34.20 ± 0.15 ppt","7.32 ±0.70 mg/L","8.29 ± 0.11","Isothermal room (18 ± 1 °C)","98% purity diuron"]
["Category","MEW_nonplant","Paper and data unique identifier(eg. 1-1,10-150)","998-2"]
["Scores",10,10,5,0,5,5,5,5,5,4,0,0,4,4,4,3,3,3,3,3,81,0.86170212765957444,"The highest possible grade for this datum is acceptable."]
["Answers","2 days","Hatching was defined as the rupture of the egg membrane, and partially as well as fully hatched larvae were counted as hatched. Mortality was identified by coagulation of the embryos, missing heartbeat, failure to develop somites and a non-detached tail. ","NOEC/LOEC","","Solvent control and no-toxicant control.","Quadruplicate","OECD Guidelines (1998) & EU Commission Directive 92/69/EEC. The controls showed normal embryo–larval development, with control mortality always below 10 %, as required for test validity.","Embryos exhibiting normal development that had reached the blastula stage.                    Larvae are 96 hour post-hatch.","Natural filtered seawater (FSW)","Semi-static (renewal every 48 hours).","not stated","","Dose-response relationships were described using the modified Weibull model. See Figure 1 (a) and (b).","The maximum no observed effect concentration (NOEC) and the lowest observed effect concentration (LOEC) were established through ANOVA and Dunnett’s post hoc test using the SPSS application, version 19.0. Non-parametric tests, Kruskal–Wallis and the Mann–Whitney U, were used when the data did not meet the requirements of normality and homoscedasticity. Differences were considered as significant when p < 0.05","95% Confidence Interval. P=0.05. ","34.20 ± 0.15 ppt","7.32 ±0.70 mg/L","8.29 ± 0.11","Isothermal room (18 ± 1 °C)","98% purity diuron"]
["Category","MEW_nonplant","Paper and data unique identifier(eg. 1-1,10-150)","998-3"]
["Scores",10,10,5,0,5,5,5,5,5,4,0,0,4,4,4,3,3,3,3,3,81,0.86170212765957444,"The highest possible grade for this datum is acceptable."]
["Answers","6 days","Hatching was defined as the rupture of the egg membrane, and partially as well as fully hatched larvae were counted as hatched. Mortality was identified by coagulation of the embryos, missing heartbeat, failure to develop somites and a non-detached tail. ","NOEC/LOEC","","Solvent control and no-toxicant control.","Quadruplicate","OECD Guidelines (1998) & EU Commission Directive 92/69/EEC. The controls showed normal embryo–larval development, with control mortality always below 10 %, as required for test validity.","Embryos exhibiting normal development that had reached the blastula stage.                    Larvae are 96 hour post-hatch.","Natural filtered seawater (FSW)","Semi-static (renewal every 48 hours).","not stated","","Dose-response relationships were described using the modified Weibull model. See Figure 1 (a) and (b).","The maximum no observed effect concentration (NOEC) and the lowest observed effect concentration (LOEC) were established through ANOVA and Dunnett’s post hoc test using the SPSS application, version 19.0. Non-parametric tests, Kruskal–Wallis and the Mann–Whitney U, were used when the data did not meet the requirements of normality and homoscedasticity. Differences were considered as significant when p < 0.05","95% Confidence Interval. P=0.05. ","34.20 ± 0.15 ppt","7.32 ±0.70 mg/L","8.29 ± 0.11","Isothermal room (18 ± 1 °C)","98% purity diuron"]
["Category","MEW_nonplant","Paper and data unique identifier(eg. 1-1,10-150)","998-4"]
["Scores",10,10,5,0,5,5,5,5,5,4,0,0,4,4,4,3,3,3,3,3,81,0.86170212765957444,"The highest possible grade for this datum is acceptable."]
["Answers","6 days","Hatching was defined as the rupture of the egg membrane, and partially as well as fully hatched larvae were counted as hatched. Mortality was identified by coagulation of the embryos, missing heartbeat, failure to develop somites and a non-detached tail. ","NOEC/LOEC","","Solvent control and no-toxicant control.","Quadruplicate","OECD Guidelines (1998) & EU Commission Directive 92/69/EEC. The controls showed normal embryo–larval development, with control mortality always below 10 %, as required for test validity.","Embryos exhibiting normal development that had reached the blastula stage.                    Larvae are 96 hour post-hatch.","Natural filtered seawater (FSW)","Semi-static (renewal every 48 hours).","not stated","","Dose-response relationships were described using the modified Weibull model. See Figure 1 (a) and (b).","The maximum no observed effect concentration (NOEC) and the lowest observed effect concentration (LOEC) were established through ANOVA and Dunnett’s post hoc test using the SPSS application, version 19.0. Non-parametric tests, Kruskal–Wallis and the Mann–Whitney U, were used when the data did not meet the requirements of normality and homoscedasticity. Differences were considered as significant when p < 0.05","95% Confidence Interval. P=0.05. ","34.20 ± 0.15 ppt","7.32 ±0.70 mg/L","8.29 ± 0.11","Isothermal room (18 ± 1 °C)","98% purity diuron"]
["Category","MEW_nonplant","Paper and data unique identifier(eg. 1-1,10-150)","998-5"]
["Scores",10,10,5,5,5,5,5,5,5,4,0,0,4,4,4,3,3,3,3,3,86,0.91489361702127658,"The highest possible grade for this datum is acceptable."]
["Answers","2 days","Hatching was defined as the rupture of the egg membrane, and partially as well as fully hatched larvae were counted as hatched. Mortality was identified by coagulation of the embryos, missing heartbeat, failure to develop somites and a non-detached tail. ","LC",0.2,"Solvent control and no-toxicant control.","Quadruplicate","OECD Guidelines (1998) & EU Commission Directive 92/69/EEC. The controls showed normal embryo–larval development, with control mortality always below 10 %, as required for test validity.","Embryos exhibiting normal development that had reached the blastula stage.                    Larvae are 96 hour post-hatch.","Natural filtered seawater (FSW)","Semi-static (renewal every 48 hours).","not stated","","Dose-response relationships were described using the modified Weibull model. See Figure 1 (a) and (b).","The maximum no observed effect concentration (NOEC) and the lowest observed effect concentration (LOEC) were established through ANOVA and Dunnett’s post hoc test using the SPSS application, version 19.0. Non-parametric tests, Kruskal–Wallis and the Mann–Whitney U, were used when the data did not meet the requirements of normality and homoscedasticity. Differences were considered as significant when p < 0.05","95% Confidence Interval. P=0.05. ","34.20 ± 0.15 ppt","7.32 ±0.70 mg/L","8.29 ± 0.11","Isothermal room (18 ± 1 °C)","98% purity diuron"]
["Category","MEW_nonplant","Paper and data unique identifier(eg. 1-1,10-150)","998-6"]
["Scores",10,10,5,5,5,5,5,5,5,4,0,0,4,4,4,3,3,3,3,3,86,0.91489361702127658,"The highest possible grade for this datum is acceptable."]
["Answers","2 days","Hatching was defined as the rupture of the egg membrane, and partially as well as fully hatched larvae were counted as hatched. Mortality was identified by coagulation of the embryos, missing heartbeat, failure to develop somites and a non-detached tail. ","LC","10 and 50","Solvent control and no-toxicant control.","Quadruplicate","OECD Guidelines (1998) & EU Commission Directive 92/69/EEC. The controls showed normal embryo–larval development, with control mortality always below 10 %, as required for test validity.","Embryos exhibiting normal development that had reached the blastula stage.                    Larvae are 96 hour post-hatch.","Natural filtered seawater (FSW)","Semi-static (renewal every 48 hours).","not stated","","Dose-response relationships were described using the modified Weibull model. See Figure 1 (a) and (b).","The maximum no observed effect concentration (NOEC) and the lowest observed effect concentration (LOEC) were established through ANOVA and Dunnett’s post hoc test using the SPSS application, version 19.0. Non-parametric tests, Kruskal–Wallis and the Mann–Whitney U, were used when the data did not meet the requirements of normality and homoscedasticity. Differences were considered as significant when p < 0.05","95% Confidence Interval. P=0.05. ","34.20 ± 0.15 ppt","7.32 ±0.70 mg/L","8.29 ± 0.11","Isothermal room (18 ± 1 °C)","98% purity diuron"]
["Category","MEW_nonplant","Paper and data unique identifier(eg. 1-1,10-150)","998-7"]
["Scores",10,10,5,5,5,5,5,5,5,4,0,0,4,4,4,3,3,3,3,3,86,0.91489361702127658,"The highest possible grade for this datum is acceptable."]
["Answers","6 days","Hatching was defined as the rupture of the egg membrane, and partially as well as fully hatched larvae were counted as hatched. Mortality was identified by coagulation of the embryos, missing heartbeat, failure to develop somites and a non-detached tail. ","LC","10 and 50","Solvent control and no-toxicant control.","Quadruplicate","OECD Guidelines (1998) & EU Commission Directive 92/69/EEC. The controls showed normal embryo–larval development, with control mortality always below 10 %, as required for test validity.","Embryos exhibiting normal development that had reached the blastula stage.                    Larvae are 96 hour post-hatch.","Natural filtered seawater (FSW)","Semi-static (renewal every 48 hours).","not stated","","Dose-response relationships were described using the modified Weibull model. See Figure 1 (a) and (b).","The maximum no observed effect concentration (NOEC) and the lowest observed effect concentration (LOEC) were established through ANOVA and Dunnett’s post hoc test using the SPSS application, version 19.0. Non-parametric tests, Kruskal–Wallis and the Mann–Whitney U, were used when the data did not meet the requirements of normality and homoscedasticity. Differences were considered as significant when p < 0.05","95% Confidence Interval. P=0.05. ","34.20 ± 0.15 ppt","7.32 ±0.70 mg/L","8.29 ± 0.11","Isothermal room (18 ± 1 °C)","98% purity diuron"]
["Category","MEW_nonplant","Paper and data unique identifier(eg. 1-1,10-150)","998-8"]
["Scores",10,10,5,5,5,5,5,5,5,4,0,0,4,4,4,3,3,3,3,3,86,0.91489361702127658,"The highest possible grade for this datum is acceptable."]
["Answers","6 days","Hatching was defined as the rupture of the egg membrane, and partially as well as fully hatched larvae were counted as hatched. Mortality was identified by coagulation of the embryos, missing heartbeat, failure to develop somites and a non-detached tail. ","LC","10 and 50","Solvent control and no-toxicant control.","Quadruplicate","OECD Guidelines (1998) & EU Commission Directive 92/69/EEC. The controls showed normal embryo–larval development, with control mortality always below 10 %, as required for test validity.","Embryos exhibiting normal development that had reached the blastula stage.                    Larvae are 96 hour post-hatch.","Natural filtered seawater (FSW)","Semi-static (renewal every 48 hours).","not stated","","Dose-response relationships were described using the modified Weibull model. See Figure 1 (a) and (b).","The maximum no observed effect concentration (NOEC) and the lowest observed effect concentration (LOEC) were established through ANOVA and Dunnett’s post hoc test using the SPSS application, version 19.0. Non-parametric tests, Kruskal–Wallis and the Mann–Whitney U, were used when the data did not meet the requirements of normality and homoscedasticity. Differences were considered as significant when p < 0.05","95% Confidence Interval. P=0.05. ","34.20 ± 0.15 ppt","7.32 ±0.70 mg/L","8.29 ± 0.11","Isothermal room (18 ± 1 °C)","98% purity diuron"]

{"sheet":"MEW plant","index":15,"n_rows":81,"n_cols":53,"rows_kept":81,"cut":false,"hidden":false,"merged":[[56,1,58,1],[56,2,58,2],[56,7,58,7],[65,2,68,2],[65,7,68,7],[43,2,45,2],[43,7,45,7],[46,2,48,2],[46,7,48,7],[49,2,51,2],[49,7,51,7],[52,2,54,2],[52,7,54,7],[59,7,61,7],[62,2,64,2],[62,7,64,7],[34,2,36,2],[34,7,36,7],[37,2,39,2],[37,7,39,7],[40,2,42,2],[40,7,42,7],[25,2,27,2],[25,7,27,7],[28,2,30,2],[28,7,30,7],[31,2,33,2],[31,7,33,7],[17,2,19,2],[17,7,19,7],[20,2,21,2],[20,7,21,7],[22,2,24,2],[22,7,24,7],[3,4,7,4],[9,2,9,4],[11,2,13,2],[11,7,13,7],[14,2,16,2],[14,7,16,7]]}
[null,1,"Fill in the blank cells below, based on information provided in the paper being assessed. You can either pick an option from the dropdown list or add the appropriate detail using the 'Add to list' button. ",null,null,{"$f":"IF(BA3=\"\",0,1)","v":1},null,null,null,null,null,null,null,null,"* All the text in RED are used for drop down list ,make changes with caution."]
[null,null,"Category",{"$f":"IF(AF3=\"\",0,1)","v":1},"MEW_plant",{"$f":"IF(E3=\"\",0,1)","v":1},"Citation No.",{"$f":"IF(ISERROR(FIND(\"-\",E3)),E3,LEFT(E3,FIND(\"-\",E3)-1))","v":"NESP"},null,"Taxonomic group",null,null,null,null,"Species",null,null,"Lifestage",null,null,"Exposure duration",null,null,"Measure of toxicity",null,null,"Toxicity endpoint",null,null,"Taxonomic group",null,null,"Phylum",null,null,"Class",null,null,"Media",null,null,"Temperature ",null,null,"Acute Or Chronic",null,null,"PH",null,null,"Salinity/Comdictivity"]
[null,null,"Paper and data unique identifier(eg. 1-1,10-150)",{"$f":"IF(AI3=\"\",0,1)","v":1},"NESP-1",{"$f":"IF(E4=\"\",0,1)","v":1},"Species (Scientific name)",null,null,"Phylum",null,null,null,null,"Acropora tenuis",18,{"$f":"IF(P3=0,\"\",INDEX(O3:O102,P3))","v":"Rhodomonas salina"},"1 month",3,{"$f":"IF(S3=0,\"\",INDEX(R3:R102,S3))","v":"Exponential growth phase"},"1 hour",10,{"$f":"IF(V3=0,\"\",INDEX(U3:U102,V3))","v":"72 hour"},"EC50",9,{"$f":"IF(Y3=0,\"\",INDEX(X3:X102,Y3))","v":"NEC"},"Fish ",15,{"$f":"IF(AB3=0,\"\",INDEX(AA3:AA102,AB3))","v":"Growth: Specific growth rate"},"Coral",5,{"$f":"IF(AE3=0,\"\",INDEX(AD3:AD102,AE3))","v":"Microalga"},"Bacillariophyta",12,{"$f":"IF(AH3=0,\"\",INDEX(AG3:AG102,AH3))","v":"Cryptophyta"},"Anthozoa",12,{"$f":"IF(AK3=0,\"\",INDEX(AJ3:AJ102,AK3))","v":"Cryptophyceae"},"F2 marine media ",8,{"$f":"IF(AN3=0,\"\",INDEX(AM3:AM102,AN3))","v":"Guillard’s f/2 medium"},"15°C",8,{"$f":"IF(AQ3=0,\"\",INDEX(AP3:AP102,AQ3))","v":"26 ± 1 °C"},"Acute",2,{"$f":"IF(AT3=0,\"\",INDEX(AS3:AS102,AT3))","v":"Chronic"},"8.1 - 8.4",6,{"$f":"IF(AW3=0,\"\",INDEX(AV3:AV102,AW3))","v":"8.5 ± 0.4 "},"150 uS/cm",8,{"$f":"IF(AZ3=0,\"\",INDEX(AY3:AY102,AZ3))","v":"34.2 ± 0.6 psu"}]
[null,null,"Citation",{"$f":"IF(AL3=\"\",0,1)","v":1},"Negri, A.P., Templeman, S., Flores, F., van Dam, J., Thomas, M., McKenzie, M., Stapp, L., Kaserzon, S., Mann, R.M., Smith, R., Warne, M.St.J. and Mueller, J. (2020) Ecotoxicology of pesticides on the Great Barrier Reef for guideline development and risk assessments. Final report to the National Environmental Science Program. Reef and Rainforest Research Centre Limited, Cairns (120 pp.).",{"$f":"IF(H8=\"\",0,1)","v":1},"Lifestage",null,null,"Class",null,null,null,null,"Acropora valida",null,null,"1 year old",null,null,"10 days",null,null,"IC50",null,null,"Growth: Biomass ",null,null,"Cyanobacteria",null,null,"Chlorophyta",null,null,"Branchiopoda",null,null,"Filtered seawater",null,null,"20 ± 1°C",null,null,"Chronic",null,null,"N.A.",null,null,"20 ppt"]
[null,null,null,{"$f":"IF(AO3=\"\",0,1)","v":1},null,{"$f":"IF(AX3=\"\",0,1)","v":1},"Exposure duration",null,null,"Media",null,null,null,null,"Aedes albopictus",null,null,"Exponential growth phase",null,null,"11 hour",null,null,"LC50",null,null,"Growth: Leaf extension ",null,null,"Fish ",null,null,"Chlorophyta",null,null,"Chlorophyceae",null,null,"Freshwater",null,null,"25.8 + - 0.3 C",null,null,"N.A.",null,null,"Not stated",null,null,"30 (+ - 0.5) %"]
[null,null,null,{"$f":"IF(AR3=\"\",0,1)","v":1},null,{"$f":"IF(Q3=\"\",0,1)","v":1},"Measure of toxicity",null,null,"Temperature ",null,null,null,null,"Australian Bass",null,null,"Expontential growth",null,null,"13 days",null,null,"LOEC",null,null,"Microalga",null,null,"Macrophyte",null,null,"Ciliophora",null,null,"Chlorophyceae",null,null,"Marinewater",null,null,"25°C",null,null,null,null,null,"PH11",null,null,"30 ppt"]
[null,null,null,{"$f":"IF(AU3=\"\",0,1)","v":1},null,{"$f":"IF(T3=\"\",0,1)","v":1},"Toxicity endpoint",null,null,"Acute Or Chronic ",null,null,null,null,"Chroococcus minor",null,null,"Log growth phase",null,null,"24 hour",null,null,"N.A.",null,null,"Mortality",null,null,"Microalga",null,null,"Cnidaria",null,null,"Cyanophyceae",null,null,"N.A.",null,null,"26-29°C",null,null,null,null,null,"PH7.0",null,null,"N.A."]
[null,null,null,null,null,{"$f":"IF(W3=\"\",0,1)","v":1},"Toxicity value","1.68 ug/L",null,"PH",null,null,null,null,"Dunaliaella tertiolecta",null,null,"Mature colonies",null,null,"3 day",null,null,"NOEC",null,null,"N.A.",null,null,"N.A.",null,null,"Cyanobacteria",null,null,"Dinophyceae",null,null,"Seawater",null,null,"N.A.",null,null,null,null,null,"8.5 ± 0.4 ",null,null,"Not stated"]
[null,2,"Select the appropriate answer option to each question. Comments can be added to the cells in column H.",null,null,{"$f":"IF(Z3=\"\",0,1)","v":1},null,null,null,"Salinity/Conductivity",null,null,null,null,"Emiliania huxleyi",null,null,"N.A.",null,null,"53 days",null,null,"Population: Growth inhibition (cell number)",null,null,"Population: Growth inhibition (cell number)",null,null,"Plantae",null,null,"Mioza",null,null,"Liliopsida",null,null,"Unfiltered oceanic seawater",null,null,"Not stated",null,null,null,null,null,null,null,null,"35 psu"]
[null,"*","If the selected answer option does not work try clicking on any other cell first and then click back on the answer option again.",null,null,{"$f":"IF(AC3=\"\",0,1)","v":1},null,null,null,null,null,null,null,null,"Halodule uninervis",null,null,"Not stated",null,null,"67 days",null,null,"Specific growth rate",null,null,"Population: Growth rate",null,null,"Protozoa",null,null,"N.A.",null,null,"Liliopsida",null,null,"Guillard’s f/2 medium",null,null,"26 ± 1 °C",null,null,null,null,null,null,null,null,"34.2 ± 0.6 psu"]
[null,"No.","Question","Marks Awarded","Answer Options","Option References","Scores","Answers",null,null,null,null,null,null,"N.A.",null,null,"Not stated",null,null,"7 day",null,null,"NEC",null,null,"Population: Growth Rate (Cell counts)",null,null,null,null,null,"Tracheophyta",null,null,"Mediophyceae"]
[null,null,"Was the duration of the exposure stated (e.g. 48 or 96 h)?",10,null,1,{"$f":"IF(F15=0,0,INDEX($D12:$D13,F12,1))","v":10},"72 hours",null,null,null,null,null,null,"Navicula forcipata",null,null,"Reproductively mature colonies",null,null,"72 hour",null,null,null,null,null,"Population: Growth rate (optical density)",null,null,null,null,null,"Tracheophyta",null,null,"N.A."]
[null,1,null,0,null,null,null,null,null,null,null,null,null,null,"Pocillopora damicornis",null,null,null,null,null,"90 days",null,null,null,null,null,"Population: Growth rate: Growth inhibition",null,null,null,null,null,"Tracheophyta",null,null,"Oligohymenophorea"]
[null,null,null,null,null,null,null,null,null,null,null,null,null,null,"Pyrocystis lunula",null,null,null,null,null,"96 hour",null,null,null,null,null,"Protozoan",null,null,null,null,null,"Cryptophyta",null,null,"Cryptophyceae"]
[null,null,"Was the biological endpoint (e.g., immobilization or population growth) stated and defined (10 marks)? Award 5 marks if the biological endpoint is only stated.",10,null,2,{"$f":"IF(F15=0,0,INDEX($D15:$D17,F15,1))","v":5},"Inhibition of specific growth rate, compared to controls",null,null,null,null,null,null,"Skeletonema costatum",null,null,null,null,null,"96 hour",null,null,null,null,null,"Reproduction: Egg size"]
[null,2,null,5,null,null,null,null,null,null,null,null,null,null,"Tetrahymena pyriformis",null,null,null,null,null,"N.A.",null,null,null,null,null,"Reproduction: Polyp fercundity"]
[null,null,null,0,null,null,null,null,null,null,null,null,null,null,"Thalassiosira pseudonana",null,null,null,null,null,null,null,null,null,null,null,"Growth: Specific growth rate"]
[null,null,"Was the biological effect stated (e.g. LC or NOEC)?",5,null,8,{"$f":"IF(F18=0,0,INDEX($D18:$D19,F18,1))","v":{"$error":"#REF!"}},"NEC, EC10, EC50",null,null,null,null,null,null,"Zostera marina"]
[null,3,null,0,null,null,null,null,null,null,null,null,null,null,"Zostera muelleri"]
[null,null,null,null,null,null,null,null,null,null,null,null,null,null,"Rhodomonas salina"]
[null,4,"Was the biological effect quantified (e.g. 50% effect, 25% effect)? \nNote: The effect for NOEC and LOEC data must be quantified.",5,null,1,{"$f":"IF(F21=0,0,INDEX($D21:$D22,F21,1))","v":5},"Yes - confidence intervals included for NEC"]
[null,null,null,0]
[null,5,"Were appropriate controls (e.g. a no-toxicant control and/or solvent control) used?",5,null,14,5,"Solvent control (ethanol) and normal controls"]
[null,null,null,0]
[]
[null,6,"Was each control and contaminant concentration at least duplicated?",5,null,0,5,"5x replicates"]
[null,null,null,0]
[]
[null,7,"Were test acceptability criteria stated (e.g. mortality in controls must not exceed a certain percentage) (5 marks)?\nOR Were test acceptability criteria inferred (e.g. test method used [USEPA, OECD, ASTM etc.]) (award 2 marks). \nNote: Data that fail the acceptability criteria are automatically deemed to be of unacceptable quality and must not be used. ",5,null,0,5,"• Control SGR ≥ 0.92 day-1 as per (OECD, 2011). Observed mean control SGR of all tests: 1.20 ± 0.07 day-1 (mean ± SD, n = 50)\n• The coefficient of variation (CV) of mean SGR in controls ≤ 10% as per (OECD, 2011). Observed control CV: < 5% in all tests"]
[null,null,null,2]
[null,null,null,0]
[null,8,"Were the characteristics of the test organism (e.g. length, mass, age) stated?",5,null,0,5,"4-day old culture in exponential growth phase, starting density 3x103 cells mL-1"]
[null,null,null,0]
[]
[null,9,"Was the type of test media used stated?",5,null,1,{"$f":"IF(F35=0,0,INDEX($D35:$D37,F35,1))","v":5},"Guillard’s f/2 medium. Natural, 0.5 µm polypropylene-filtered coastal seawater (19°16'19.60\"S; 147° 3'40.93\"E) spiked with test solution."]
[null,null,null,0]
[]
[null,null,"Was the type of exposure (e.g. static, flow through) stated? ",4,null,1,{"$f":"IF(F38=0,0,INDEX($D38:$D40,F38,1))","v":4},"Static"]
[null,10,null,0]
[]
[null,null,"Were the contaminant concentrations measured at the beginning and end of the exposure (4 marks)? Award 2 marks if they were measured only once during the test.\nNote: If the concentrations were not measured then automatically the data cannot be high quality. ",4,null,1,{"$f":"IF(F41=0,0,INDEX($D41:$D43,F41,1))","v":4},"Herbicide concentrations (2-3 per pesticide) were measured at initiation and termination of test.  The measured concentrations for all treatments were calculated based on the linear relationship between nominal and the time weighted average of measured concentrations. All herbicide analyses were performed at the Queensland Alliance for Environmental Health Sciences (QAEHS), The University of Queensland using HPLC-MS/MS (SCIEX Triple QuadTM 6500 QTRAP® mass spectrometer Shimadzu Nexera X2 uHPLC system) (Mercurio et al., 2015; Mercurio, 2016)."]
[null,11,null,2]
[null,null,null,0]
[null,null,"Were parallel reference toxicant toxicity tests conducted?",4,null,0,4,"Diuron at 4 µg L-1 "]
[null,12,null,0]
[]
[null,null,"Was there a concentration–response relationship either observable or stated?",4,null,0,4,"• ECx: 4-parameter sigmoidal models, fitted to the percent inhibition and measured herbicide concentrations using the program GraphPad Prism (v 8.0.0, San Diego, CA, USA). see Figure A1.\n• NEC: Binomial exponential decay regression using the R package jagsNEC (Fisher et al., 2019), See Figure A2."]
[null,13,null,0]
[]
[null,null,"Was an appropriate statistical method or model used to determine the toxicity?\nNote: They should be accepted by a recognised national or international regulatory body (e.g. USEPA, OECD, ASTM). ",4,null,0,4,"• Regression analysis following prescribed procedures (OECD, 2006a). The concentrations of herbicide that inhibited 10% and 50% of the SGR (or ΔF/Fm′) relative to controls (EC10 and EC50, respectively) were calculated from concentration-response curves (4-parameter sigmoidal models) fitted to the percent inhibition and measured herbicide concentrations for each treatment using the program GraphPad Prism (V 8.0.0, San Diego, CA, USA). \n• No effect concentration (NEC) values were calculated in R statistical package (v 3.5.1) and the proportional decline in SGR (1-inhibition) was modelled as a function of square root measured concentration of each herbicide using a Bayesian non-linear gaussian model using the R package jagsNEC (Fisher et al., 2019).\n"]
[null,14,null,0]
[]
[null,15,"For LC/EC/BEC data was an estimate of variability provided? \nOR \nFor NO EC/LOEC data was the significance level 0.05 or less?  \n\n",4,null,0,4,"95% Confidence Limits (CL) "]
[null,null,null,0]
[]
[null,16,"Were the following parameters measured and stated? (3 marks if measured and stated, 1 mark if just measured)."]
[null,16.100000000000001,"Conductivity/Salinity",3,null,1,{"$f":"IF(F57=0,0,INDEX(D57:D59,F57,1))","v":3},"34.2 ± 0.6 psu"]
[null,null,null,1]
[null,null,null,0]
[null,null,null,3,null,1,{"$f":"IF(F60=0,0,INDEX($D60:$D62,F60,1))","v":3},"8.5 ± 0.4 "]
[null,16.2,"pH ",1]
[null,null,null,0]
[null,null,"Was the temperature measured and stated (3 marks)? Award 1 mark if the temperature was measured but not stated or if only the temperature settings of the room or chamber are stated.\n",3,null,1,{"$f":"IF(F63=0,0,INDEX($D63:$D65,F63,1))","v":3},"26.0 ± 0.6 °C"]
[null,17,null,1]
[null,null,null,0]
[null,null,"Were test solutions, blanks and/or controls tested for contamination OR were analytical reagent grade chemicals used or the highest possible purity chemicals used for the experiment? (3 marks).",3,null,1,{"$f":"IF(F66=0,0,INDEX($D66:$D67,F66,1))","v":3},"Controls were tested for contamination. Analytical grade herbicides (98-99.5% purity) were used for preparation of all stock solutions."]
[null,18,null,0]
[]
[null,null,null,null,null,null,null,null,{"$f":"(COUNTIF(F12:F67,\"=0\"))+COUNTIF(F1:F10,\"=0\")+COUNTIF(D2:D7,\"=0\")","v":7}]
[]
[]
[null,null,"Total score",null,null,null,{"$f":"IF(SUM(G12:G66)=0,\"\",SUM(G12:G66))","v":{"$error":"#REF!"}}]
[null,null,"Total Max. possible score for the various types of data and contaminants ",null,{"$f":"D12+D15+D18+D21+D23+D26+D29+D32+D35+D38+D41+D44+D47+D50+D53+D60+D63+D66+D57","v":91}]
[null,null,"Quality Score",null,{"$f":"\"= [Total score / Total possible score] * 100 = \"","v":"= [Total score / Total possible score] * 100 = "},null,{"$f":"IF(ISERROR(G72/E73),#N/A,G72/E73)","v":{"$error":"#N/A"}},{"$f":"IF(F41=3,\"The highest possible grade for this datum is acceptable.\",\"\")","v":""}]
[]
[null,null,"H = high quality                           Quality score ≥ 80%    "]
[null,null,"A = acceptable quality         > 50% Quality score < 80%  "]
[null,null,"U = unacceptable quality              Quality score ≤ 50%"]
[]
[3,null,"Click the 'Save & Update' button to save and export the answers to the 'All results' worksheet. "]
[null,null,"Select the 'Reset Answers' button if you wish to clear all answers."]

{"sheet":"MEW plant_WS","index":16,"n_rows":68,"n_cols":23,"rows_kept":68,"cut":false,"hidden":false,"merged":[]}
[]
["Question No.",1,2,3,4,5,6,7,8,9,10,11,12,13,14,15,16.100000000000001,16.3,17,18,"Total Score","Quality Score","Comment "]
["Short Questions","Duration of the exposure ","Biological endpoint","Biological effect stated or not","Biological effect quantified or not","Appropriate controls","Control & contaminant concentration","Test acceptability criteria","Characteristics of the test organism"," Type of test media","Type of exposure","Contaminant concentrations","Parallel reference toxicant toxicity tests","Concentration–response relationship","Determine the toxicity","NOEC/LOEC or LC/EC/BEC","Conductivity/Salinity","PH","Temperature","Grade or purity"]
["Marks Awarded ","10 or 0","10,5 or 0","5 or 0 ","5 or 0 ","5 or 0 ","5 or 0 ","5 or 0 ","5 or 0 ","5 or 0 ","4 or 0","4 or 2 or 0","4 or 2","4 or 2","4 or 2","4 or 2","3 or 1 or 0","3 or 1 or 0","3 or 0","3 or 0 "]
["Max. Possible Score",10,10,5,5,5,5,5,5,5,4,4,4,4,4,4,3,3,3,3,{"$f":"SUM(B5:T5)","v":91}]
["Category","MEW_plant","Paper and data unique identifier(eg. 1-1,10-150)","942-8"]
["Scores",10,10,5,5,5,5,5,5,5,0,0,0,4,4,4,0,0,0,0,72,0.79120879120879117,"The highest possible grade for this datum is acceptable."]
["Answers","","","","","","","","","","","","","","","","","","",""]
["Category","MEW_plant","Paper and data unique identifier(eg. 1-1,10-150)","942-9"]
["Scores",10,10,5,5,5,5,5,5,5,0,0,0,4,4,4,0,0,0,0,72,0.79120879120879117,"The highest possible grade for this datum is acceptable."]
["Answers","","","","","","","","","","","","","","","","","","",""]
["Category","MEW_plant","Paper and data unique identifier(eg. 1-1,10-150)","942-10"]
["Scores",10,10,5,5,5,5,5,5,5,0,0,0,4,4,4,0,0,0,0,72,0.79120879120879117,"The highest possible grade for this datum is acceptable."]
["Answers","","","","","","","","","","","","","","","","","","",""]
["Category","MEW_plant","Paper and data unique identifier(eg. 1-1,10-150)","942-11"]
["Scores",10,10,5,5,5,5,5,5,5,0,0,0,4,4,4,0,0,0,0,72,0.79120879120879117,"The highest possible grade for this datum is acceptable."]
["Answers","","","","","","","","","","","","","","","","","","",""]
["Category","MEW_plant","Paper and data unique identifier(eg. 1-1,10-150)","946-1"]
["Scores",10,10,5,5,5,5,2,5,5,0,0,0,0,4,4,1,0,0,0,64,0.70329670329670335,"The highest possible grade for this datum is acceptable."]
["Answers","","","","","","","","","","","","","","","","","","",""]
["Category","MEW_plant","Paper and data unique identifier(eg. 1-1,10-150)","946-2"]
["Scores",10,10,0,0,5,5,2,5,5,0,0,0,0,4,4,1,0,0,0,54,0.59340659340659341,"The highest possible grade for this datum is acceptable."]
["Answers","","","","","","","","","","","","","","","","","","",""]
["Category","MEW_plant","Paper and data unique identifier(eg. 1-1,10-150)","953-1"]
["Scores",10,10,5,0,5,5,0,5,5,4,4,4,0,0,0,0,0,0,0,60,0.65934065934065933,""]
["Answers","","","","","","","","","","","","","","","","","","",""]
["Category","MEW_plant","Paper and data unique identifier(eg. 1-1,10-150)","953-2"]
["Scores",10,10,5,0,5,5,0,5,5,4,4,4,0,0,0,0,0,0,0,60,0.65934065934065933,""]
["Answers","","","","","","","","","","","","","","","","","","",""]
["Category","MEW_plant","Paper and data unique identifier(eg. 1-1,10-150)","946-1"]
["Scores",10,10,5,5,5,5,2,5,5,4,2,0,0,0,4,3,0,0,0,68,0.74725274725274726,""]
["Answers","96 hour","Population; Growth Rate (cell counts)","","","","Triplicate","ASTM","Parent cultures","Sterile transferred into F/2 marine media at 20 ppt using the methods of (Guillard, 1983)","Static","","","","","95% Confidence Interval","20 ppt","","25 degrees C",""]
["Category","MEW_plant","Paper and data unique identifier(eg. 1-1,10-150)","946-2"]
["Scores",10,10,5,5,5,5,2,5,5,4,2,0,0,0,4,3,0,0,0,68,0.74725274725274726,""]
["Answers","96 hour","Population; Growth Rate (cell counts)","","","","Triplicate","ASTM","Parent cultures","Sterile transferred into F/2 marine media at 20 ppt using the methods of (Guillard, 1983)","Static","","","","","95% Confidence Interval","20 ppt","","25 degrees C",""]
["Category","MEW_plant","Paper and data unique identifier(eg. 1-1,10-150)","946-3"]
["Scores",10,10,5,0,5,5,2,5,5,4,2,0,0,0,4,3,0,0,0,63,0.69230769230769229,""]
["Answers","96 hour","Population; Growth Rate (cell counts)","","","","Triplicate","ASTM","Parent cultures","Sterile transferred into F/2 marine media at 20 ppt using the methods of (Guillard, 1983)","Static","","","","","p<  0.05","20 ppt","","25 degrees C",""]
["Category","MEW_plant","Paper and data unique identifier(eg. 1-1,10-150)","946-3"]
["Scores",10,10,5,0,5,5,2,5,5,4,2,0,0,0,4,3,0,0,0,63,0.69230769230769229,""]
["Answers","96 hour","Population; Growth Rate (cell counts)","","","","Triplicate","ASTM","Parent cultures","Sterile transferred into F/2 marine media at 20 ppt using the methods of (Guillard, 1983)","Static","","","","","p<  0.05","20 ppt","","25 degrees C",""]
["Category","MEW_plant","Paper and data unique identifier(eg. 1-1,10-150)","946-4"]
["Scores",10,10,5,0,5,5,2,5,5,4,2,0,0,0,4,3,0,0,0,63,0.69230769230769229,""]
["Answers","96 hour","Population; Growth Rate (cell counts)","","","","Triplicate","ASTM","Parent cultures","Sterile transferred into F/2 marine media at 20 ppt using the methods of (Guillard, 1983)","Static","","","","","p<  0.05","20 ppt","","25 degrees C",""]
["Category","MEW_plant","Paper and data unique identifier(eg. 1-1,10-150)","679-1"]
["Scores",10,10,0,5,5,5,0,5,5,0,2,0,4,4,4,0,0,0,0,65,0.7142857142857143,""]
["Answers","53 days","Defined under: Fecundity of broadcast spawning corals.","","","No toxicant control was used.","\"For each of the three treatments, two tanks were used.\"","Data that fail the acceptability criteria (Q7) are automatically deemed to be of unacceptable quality and must not be used.","20-30cm in diameter","Unfiltered oceanic seawater","Not stated","Measured once for Acropora tenuis only.","No.","Table 1","1-way ANOVAs","± 0.02 ug/L","","","26-29°C","Laboratory grade diuron = 98%"]
["Category","MEW_plant","Paper and data unique identifier(eg. 1-1,10-150)","679-2"]
["Scores",10,10,0,5,5,5,0,5,5,0,2,0,4,4,4,0,0,0,0,65,0.7142857142857143,""]
["Answers","53 days","Mature eggs of Acropora spp. are irregular\nin shape so the circumference of each egg was traced using Optimas (Media Cybernetics) and the planar surface area calculated as a proxy for egg size.","","","No toxicant control was used.","\"For each of the three treatments, two tanks were used.\"","Data that fail the acceptability criteria (Q7) are automatically deemed to be of unacceptable quality and must not be used.","20-30cm in diameter","Unfiltered oceanic seawater","Not stated","Measured once for Acropora tenuis only.","No.","Table 1","1-way ANOVAs","± 0.02 ug/L","","","26-29°C","Laboratory grade diuron = 98%"]
["Category","MEW_plant","Paper and data unique identifier(eg. 1-1,10-150)","679-3"]
["Scores",10,10,0,5,5,5,0,5,5,0,2,0,4,4,4,0,0,0,0,65,0.7142857142857143,""]
["Answers","53 days","Corals were monitored for partial colony mortality, as indicated by tissue loss exposing bare skeleton on some branches or parts thereof, or full colony mortality (full loss of tissue on every branch of the colony).","","","No toxicant control was used.","\"For each of the three treatments, two tanks were used.\"","Data that fail the acceptability criteria (Q7) are automatically deemed to be of unacceptable quality and must not be used.","20-30cm in diameter","Unfiltered oceanic seawater","Not stated","Measured once for Acropora tenuis only.","No.","Table 1","1-way ANOVAs","± 0.02 ug/L","","","26-29°C","Laboratory grade diuron = 98%"]
["Category","MEW_plant","Paper and data unique identifier(eg. 1-1,10-150)","679-4"]
["Scores",10,10,0,5,5,5,0,5,5,0,0,0,4,4,4,0,0,0,0,63,0.69230769230769229,"The highest possible grade for this datum is acceptable."]
["Answers","90 days","Defined under: Fecundity of broadcast spawning corals.","","","No toxicant control was used.","\"For each of the three treatments, two tanks were used.\"","Data that fail the acceptability criteria (Q7) are automatically deemed to be of unacceptable quality and must not be used.","20-30cm in diameter","Unfiltered oceanic seawater","Not stated","Not measured - nominal.","No.","Table 1","1-way ANOVAs","± 0.02 ug/L","","","26-29°C","Laboratory grade diuron = 98%"]
["Category","MEW_plant","Paper and data unique identifier(eg. 1-1,10-150)","679-5"]
["Scores",10,10,0,5,5,5,0,5,5,0,0,0,4,4,4,0,0,0,0,63,0.69230769230769229,"The highest possible grade for this datum is acceptable."]
["Answers","90 days","Defined under: Fecundity of broadcast spawning corals.","","","No toxicant control was used.","\"For each of the three treatments, two tanks were used.\"","Data that fail the acceptability criteria (Q7) are automatically deemed to be of unacceptable quality and must not be used.","20-30cm in diameter","Unfiltered oceanic seawater","Not stated","Not measured - nominal.","No.","Table 1","1-way ANOVAs","± 0.02 ug/L","","","26-29°C","Laboratory grade diuron = 98%"]
["Category","MEW_plant","Paper and data unique identifier(eg. 1-1,10-150)","679-6"]
["Scores",10,10,0,5,5,5,0,5,5,0,0,0,4,4,4,0,0,0,0,63,0.69230769230769229,"The highest possible grade for this datum is acceptable."]
["Answers","90 days","Mature eggs of Acropora spp. are irregular\nin shape so the circumference of each egg was traced using Optimas (Media Cybernetics) and the planar surface area calculated as a proxy for egg size.","","","No toxicant control was used.","\"For each of the three treatments, two tanks were used.\"","Data that fail the acceptability criteria (Q7) are automatically deemed to be of unacceptable quality and must not be used.","20-30cm in diameter","Unfiltered oceanic seawater","Not stated","Not measured - nominal.","No.","Table 1","1-way ANOVAs","± 0.02 ug/L","","","26-29°C","Laboratory grade diuron = 98%"]
["Category","MEW_plant","Paper and data unique identifier(eg. 1-1,10-150)","679-7"]
["Scores",10,10,0,5,5,5,0,5,5,0,0,0,4,4,4,0,0,0,0,63,0.69230769230769229,"The highest possible grade for this datum is acceptable."]
["Answers","90 days","Mature eggs of Acropora spp. are irregular\nin shape so the circumference of each egg was traced using Optimas (Media Cybernetics) and the planar surface area calculated as a proxy for egg size.","","","No toxicant control was used.","\"For each of the three treatments, two tanks were used.\"","Data that fail the acceptability criteria (Q7) are automatically deemed to be of unacceptable quality and must not be used.","20-30cm in diameter","Unfiltered oceanic seawater","Not stated","Not measured - nominal.","No.","Table 1","1-way ANOVAs","± 0.02 ug/L","","","26-29°C","Laboratory grade diuron = 98%"]
["Category","MEW_plant","Paper and data unique identifier(eg. 1-1,10-150)","996-1"]
["Scores",10,10,5,5,5,5,2,5,5,0,0,0,4,0,0,0,0,0,0,60,0.65934065934065933,"The highest possible grade for this datum is acceptable."]
["Answers","96 hours","Algal growth relative to the controls: uses cell number to get % inhibition. Large explanation in paper.","EC",50,"no-toxicant control","Test concentrations in duplicate and controls in triplicate.","OECD Guideline 201.","Exponential growth phase. Starting cell number is stated.","F/2 marine media.","not stated","not stated","","Mentioned in section 2.2.3. The acute toxicity response obtained in these bioassays was plotted against the toxicant concentrations to obtain the dose–response curve.","not stated","not stated","not stated","not stated","20 ± 1°C in temperature controlled chamber.","Analytical standard (>99% purity)"]

{"sheet":"Terrestrial Data QA","index":17,"n_rows":98,"n_cols":25,"rows_kept":98,"cut":false,"hidden":false,"merged":[[80,2,82,2],[80,7,82,7],[83,2,86,2],[83,7,86,7],[76,2,79,2],[76,7,79,7],[61,7,64,7],[65,7,68,7],[3,4,7,4],[53,7,56,7],[57,7,60,7],[37,7,39,7],[40,7,42,7],[43,7,45,7],[46,7,48,7],[34,7,36,7],[28,7,30,7],[31,7,33,7],[11,7,13,7],[49,7,51,7],[14,7,16,7],[22,7,24,7],[20,7,21,7],[11,2,13,2],[20,2,21,2],[22,2,24,2],[25,2,27,2],[14,2,16,2],[17,2,19,2],[25,7,27,7],[17,7,19,7],[72,7,75,7],[34,2,36,2],[28,2,30,2],[57,2,60,2],[37,2,39,2],[40,2,42,2],[72,2,75,2],[43,2,45,2],[31,2,33,2],[69,2,71,2],[46,2,48,2],[49,2,51,2],[53,2,56,2],[61,2,64,2],[65,2,68,2],[69,7,71,7]]}
[null,1,"FILL IN BLANKS BELOW,PICK OPTIONS FROM DROPDOWN LIST",null,null,null,null,null,null,null,"* All the text in Blue are used for drop down list ,make changes with caution."]
[null,null,"Category",null,"Terrestrial Quality",{"$f":"IF(M3=\"\",0,1)","v":0},"Citation No.",{"$f":"IF(ISERROR(FIND(\"-\",E3)),E3,LEFT(E3,FIND(\"-\",E3)-1))","v":0},null,null,"Species",null,null,"Lifestage",null,null,"Exposure duration",null,null,"Measure of toxicity",null,null,"Toxicity endpoint"]
[null,null,"Paper and data unique identifier(eg. 1-1,10-150)",null,null,{"$f":"IF(E3=\"\",0,1)","v":0},"Species (Scientific name)",null,null,null,"Australian Bass",0,{"$f":"IF(L3=0,\"\",INDEX(K3:K47,L3))","v":""},"Phase 1",0,{"$f":"IF(O3=0,\"\",INDEX(N3:N47,O3))","v":""},"1 hour ",0,{"$f":"IF(R3=0,\"\",INDEX(Q3:Q47,R3))","v":""},"Method 1",0,{"$f":"IF(U3=0,\"\",INDEX(T3:T47,U3))","v":""},0.01,0,{"$f":"IF(X3=0,\"\",INDEX(W3:W47,X3))","v":""}]
[null,null,"Citation",null,null,{"$f":"IF(E4=\"\",0,1)","v":0},"Lifestage",null,null,null,"Bala Shark",null,null,"Phase 2",null,null,"2 hours",null,null,"Method 2",null,null,0.02]
[null,null,null,null,null,{"$f":"IF(S3=\"\",0,1)","v":0},"Exposure duration",null,null,null,"Basa",null,null,"Phase 3",null,null,"3 hours",null,null,"Method 3",null,null,0.03]
[null,null,null,null,null,{"$f":"IF(V3=\"\",0,1)","v":0},"Measure of toxicity",null,null,null,"Black Parinha",null,null,"Phase 4",null,null,"4 hours",null,null,"Method 4",null,null,0.04]
[null,null,null,null,null,{"$f":"IF(Y3=\"\",0,1)","v":0},"Toxicity endpoint",null,null,null,"Catfish",null,null,"Phase 5",null,null,"5 Hours",null,null,"Method 5",null,null,0.05]
[null,null,null,null,null,{"$f":"IF(H8=\"\",0,1)","v":0},"Toxicity value",null,null,null,null,null,null,"phase 6"]
[null,2,"CHOOSE ANSWER OPTIONS AND FILL IN ANSWERS IN ANSWER COLUMN",null,null,{"$f":"IF(M3=\"\",0,1)","v":0}]
[null,"*","If had problem click on answer options,click on any  other cells first and then click back again",null,null,{"$f":"IF(P3=\"\",0,1)","v":0}]
[null,"No.","Question","Marks Awarded","Answer Options","Option References","Scores","Answers"]
[null,null,"Was the duration of the exposure stated (e.g., 48 or 96 h)?",10,null,0,{"$f":"IF(F15=0,0,INDEX($D12:$D13,F12,1))","v":0}]
[null,1,null,0]
[]
[null,null,"Was the biological endpoint (e.g., immobilization or population growth) stated and defined (10 marks)? Award 5 marks if the biological endpoint is only stated.",10,null,0,{"$f":"IF(F15=0,0,INDEX($D15:$D17,F15,1))","v":0}]
[null,2,null,5]
[null,null,null,0]
[null,null,"Was the biological effect stated (e.g., LC or NOEC)?",5,null,0,{"$f":"IF(F18=0,0,INDEX($D18:$D19,F18,1))","v":0}]
[null,3,null,0]
[]
[null,4,"Was the biological effect quantified (e.g., 50% effect, 25% effect)? The effect for NOEC and LOEC data must be quantified.",5,null,0,{"$f":"IF(F21=0,0,INDEX($D21:$D22,F21,1))","v":0}]
[null,null,null,0]
[null,5,"Were appropriate controls (e.g., a no-toxicant control and/or solvent control) used?",5,null,0,{"$f":"IF(F23=0,0,INDEX($D23:$D24,F23,1))","v":0}]
[null,null,null,0]
[]
[null,6,"Was each control and contaminant concentration at least duplicated?",5,null,0,{"$f":"IF(F26=0,0,INDEX($D26:$D27,F26,1))","v":0}]
[null,null,null,0]
[]
[null,7,"Were test acceptability criteria stated (e.g., mortality in controls must not exceed a certain percentage) (5 marks)?\nOR\nWere test acceptability criteria inferred (e.g., test method used [USEPA, OECD, ASTM etc]) (award 2 marks). Note: Invalid data must no",5,null,0,{"$f":"IF(F29=0,0,INDEX($D29:$D31,F29,1))","v":0}]
[null,null,null,2]
[null,null,null,0]
[null,8,"Were the characteristics of the test organism (e.g., length, mass, age) stated?",5,null,0,{"$f":"IF(F32=0,0,INDEX($D32:$D34,F32,1))","v":0}]
[null,null,null,0]
[]
[null,9,"Was the type of test media used stated?",5,null,0,{"$f":"IF(F35=0,0,INDEX($D35:$D37,F35,1))","v":0}]
[null,null,null,0]
[]
[null,null,"Were the contaminant concentrations measured?",4,null,0,{"$f":"IF(F38=0,0,INDEX($D38:$D40,F38,1))","v":0}]
[null,10,null,0]
[]
[null,null,"Were parallel reference toxicant toxicity tests conducted?",4,null,0,{"$f":"IF(F41=0,0,INDEX($D41:$D43,F41,1))","v":0}]
[null,11,null,0]
[]
[null,null,"Was there a concentration–response relationship either observable or stated",4,null,0,{"$f":"IF(F44=0,0,INDEX($D44:$D46,F44,1))","v":0}]
[null,12,null,0]
[]
[null,null,"Was an appropriate statistical method or model used to determine the toxicity?",4,null,0,{"$f":"IF(F47=0,0,INDEX($D47:$D49,F47,1))","v":0}]
[null,13,null,0]
[]
[null,14,"For NOEC/LOEC data was the significance level 0.05 or less?   Or                                         For LC/EC/BEC data was an estimate of variability provided?\n\n",4,null,0,{"$f":"IF(F50=0,0,INDEX($D50:$D52,F50,1))","v":0}]
[null,null,null,0]
[]
[null,15,"Were the following parameters measured and stated? (3 marks if measured and stated, 1 if just measured)"]
[null,null,"pH",3,null,0,{"$f":"IF(F54=0,0,INDEX($D54:$D56,F54,1))","v":0}]
[null,15.1,null,1]
[null,null,null,0]
[]
[null,null,"OM or OC content",3,null,0,{"$f":"IF(F58=0,0,INDEX($D58:$D60,F58,1))","v":0}]
[null,15.2,null,1]
[null,null,null,0]
[]
[null,null,"Clay Contect",3,null,0,{"$f":"IF(F62=0,0,INDEX($D62:$D64,F62,1))","v":0}]
[null,15.3,null,1]
[null,null,null,0]
[]
[null,null,"CEC",3,null,0,{"$f":"IF(F66=0,0,INDEX($D66:$D68,F66,1))","v":0}]
[null,15.4,null,1]
[null,null,null,0]
[]
[null,null,"Was the temperature measured and stated?",3,null,0,{"$f":"IF(F70=0,0,INDEX($D70:$D72,F70,1))","v":0}]
[null,16,null,0]
[]
[null,null,"Was the grade or purity of the test contaminant stated?",3,null,0,{"$f":"IF(F73=0,0,INDEX($D73:$D74,F73,1))","v":0}]
[null,17,null,0]
[]
[]
[null,null,"Were other cations and or major soil elements measured?                                                  Or                                                                                                                             Were known interacting elements on bioavailability measured (e.g. Mo for Cu and Cl for Cd)?",3,null,0,{"$f":"IF(F77=0,0,INDEX($D77:$D78,F77,1))","v":0}]
[null,18,null,0]
[]
[]
[null,null,"For spiked soils with metal salts: Were the soils leached after spiking?",3,null,0,{"$f":"IF(F81=0,0,INDEX($D81:$D83,F81,1))","v":0}]
[null,19,null,0]
[]
[null,null,"Were the incubation conditions and duration stated?",3,null,0,{"$f":"IF(F84=0,0,INDEX($D84:$D87,F84,1))","v":0}]
[null,20,null,1]
[null,null,null,0]
[null,null,null,null,null,null,null,null,{"$f":"(COUNTIF(F12:F87,\"=0\"))+COUNTIF(F2:F10,\"=0\")","v":32}]
[]
[]
[null,null,"Total Score",null,null,null,{"$f":"IF(SUM(G12:G84)=0,\"\",SUM(G12:G84))","v":""}]
[null,null,"Total Max. possible score for the various types of data and contaminants ",null,{"$f":"D12+D15+D18+D21+D23+D26+D29+D32+D35+D38+D41+D44+D47+D50+D54+D58+D62+D66+D70+D73+D77+D81+D84","v":102}]
[null,null,"Quality Score",null,{"$f":"\"= [Total score / Total possible score] * 100 = \"","v":"= [Total score / Total possible score] * 100 = "},null,{"$f":"IF(ISERROR(G90/E91),#N/A,G90/E91)","v":{"$error":"#N/A"}}]
[]
[null,null,"H = high quality                           Quality score >=80%      "]
[null,null,"A = acceptable quality         80%>Quality score>50%      "]
[null,null,"U = unacceptable quality              Quality score <=50%  "]
[]
[3,null,"CLICK \"Save&Update\" BUTTON TO SAVE ANSWER TO SAMPLE FINALISED ASSESSMENT SHEET"]

{"sheet":"Terrestrial Quality","index":18,"n_rows":5,"n_cols":26,"rows_kept":5,"cut":false,"hidden":false,"merged":[]}
[]
["Question No.",1,2,3,4,5,6,7,8,9,10,11,12,13,14,15.1,15.2,15.3,15.4,16,17,18,19,20,"Total Score","Quality Score"]
["Short Questions","duration of the exposure  ","biological endpoint","biological effect stated or not","biological effect qualified or not","appropriate controls","control & contaminant concentration","test acceptability criteria ","characteristics of the test organism"," type of test media"," contaminant concentrations "," parallel reference toxicant toxicity","concentration–response relationship"," statistical method or model to determine the toxicity","LC/EC/BEC data","pH","OM or OC content","Clay content","CEC","Temperature","Grade or purity","cations and or major soil elements measured or  interacting elements on bioavailability measured ","soils leached after spiking","incubation conditions and duration"]
["Marks Awarded","10 or 0","10,5 or 0","5 or 0 ","5 or 0 ","5 or 0 ","5 or 0 ","5 ,2 or 0 ","5 or 0 ","5 or 0 ","4 or 0","4 or 0","4 or 0","4 or 0","4 or 0","3,1,or 0","3,1,or 0","3,1,or 0","3,1,or 0","3 or 0","3 or 0","3 or 0","3 or 0","3 or 0"]
["Max. Possible Score",10,10,5,5,5,5,5,5,5,4,4,4,4,4,3,3,3,3,3,3,3,3,3,{"$f":"SUM(B5:X5)","v":102}]

{"sheet":"Sediment Data QA","index":19,"n_rows":103,"n_cols":25,"rows_kept":103,"cut":false,"hidden":false,"merged":[[72,7,75,7],[76,7,79,7],[52,7,54,7],[89,2,90,2],[68,2,71,2],[80,2,82,2],[72,2,75,2],[76,2,79,2],[80,7,82,7],[64,2,67,2],[68,7,71,7],[91,2,92,2],[89,7,90,7],[91,7,92,7],[87,7,88,7],[83,7,86,7],[83,2,86,2],[49,2,51,2],[52,2,54,2],[43,2,45,2],[28,2,30,2],[64,7,67,7],[60,2,63,2],[56,2,59,2],[31,2,33,2],[37,7,39,7],[34,2,36,2],[37,2,39,2],[40,2,42,2],[46,2,48,2],[60,7,63,7],[40,7,42,7],[43,7,45,7],[11,2,13,2],[20,2,21,2],[22,2,24,2],[25,2,27,2],[14,2,16,2],[17,2,19,2],[3,4,7,4],[56,7,59,7],[46,7,48,7],[11,7,13,7],[17,7,19,7],[49,7,51,7],[34,7,36,7],[22,7,24,7],[25,7,27,7],[14,7,16,7],[20,7,21,7],[28,7,30,7],[31,7,33,7]]}
[null,1,"FILL IN BLANKS BELOW,PICK OPTIONS FROM DROPDOWN LIST",null,null,null,null,null,null,null,"* All the text in Blue are used for drop down list ,make changes with caution."]
[null,null,"Category",null,"Sediment ",{"$f":"IF(M3=\"\",0,1)","v":0},"Citation No.",{"$f":"IF(ISERROR(FIND(\"-\",E3)),E3,LEFT(E3,FIND(\"-\",E3)-1))","v":0},null,null,"Species",null,null,"Lifestage",null,null,"Exposure duration",null,null,"Measure of toxicity",null,null,"Toxicity endpoint"]
[null,null,"Paper and data unique identifier(eg. 1-1,10-150)",null,null,{"$f":"IF(E3=\"\",0,1)","v":0},"Species (Scientific name)",null,null,null,"Australian Bass",0,{"$f":"IF(L3=0,\"\",INDEX(K3:K50,L3))","v":""},"Phase 1",0,{"$f":"IF(O3=0,\"\",INDEX(N3:N50,O3))","v":""},"1 hour ",0,{"$f":"IF(R3=0,\"\",INDEX(Q3:Q50,R3))","v":""},"Method 1",0,{"$f":"IF(U3=0,\"\",INDEX(T3:T50,U3))","v":""},0.01,0,{"$f":"IF(X3=0,\"\",INDEX(W3:W50,X3))","v":""}]
[null,null,"Citation",null,null,{"$f":"IF(E4=\"\",0,1)","v":0},"Lifestage",null,null,null,"Bala Shark",null,null,"Phase 10",null,null,"2 hours",null,null,"Method 10",null,null,0.02]
[null,null,null,null,null,{"$f":"IF(S3=\"\",0,1)","v":0},"Exposure duration",null,null,null,"Basa",null,null,"phase 14",null,null,"3 hours",null,null,"Method 2",null,null,0.03]
[null,null,null,null,null,{"$f":"IF(V3=\"\",0,1)","v":0},"Measure of toxicity",null,null,null,"Black Parinha",null,null,"Phase 2",null,null,"4 hours",null,null,"Method 3",null,null,0.04]
[null,null,null,null,null,{"$f":"IF(Y3=\"\",0,1)","v":0},"Toxicity endpoint",null,null,null,"Catfish",null,null,"Phase 3",null,null,"5 hours",null,null,"Method 4",null,null,0.05]
[null,null,null,null,null,{"$f":"IF(H8=\"\",0,1)","v":0},"Toxicity value",null,null,null,"Eel",null,null,"Phase 4",null,null,"6 hours",null,null,"Method 5",null,null,0.06]
[null,2,"CHOOSE ANSWER OPTIONS AND FILL IN ANSWERS IN ANSWER COLUMN",null,null,{"$f":"IF(M3=\"\",0,1)","v":0},null,null,null,null,"Lungfish",null,null,"Phase 5",null,null,"7 hours",null,null,"Method 6",null,null,7.0000000000000007E-2]
[null,"*","If had problem click on answer options,click on any  other cells first and then click back again",null,null,{"$f":"IF(P3=\"\",0,1)","v":0},null,null,null,null,"Murray Cod",null,null,"Phase 6",null,null,"8 hours",null,null,"Method 7",null,null,0.08]
[null,"No.","Question","Marks Awarded","Answer Options","Option References","Scores","Answers",null,null,"Nemo",null,null,"Phase 7 ",null,null,"9 hours",null,null,"Method 8",null,null,0.09]
[null,null,"Was the duration of the exposure stated (e.g., 48 or 96 h)?",10,null,0,{"$f":"IF(F15=0,0,INDEX($D12:$D13,F12,1))","v":0},null,null,null,"Redclaw",null,null,"Phase 8",null,null,null,null,null,null,null,null,0.1]
[null,1,null,0,null,null,null,null,null,null,"Sea Mullet",null,null,"Phase 9"]
[null,null,null,null,null,null,null,null,null,null,"SilverPerch"]
[null,null,"Was the biological endpoint (e.g., immobilization or population growth) stated and defined (10 marks)? Award 5 marks if the biological endpoint is only stated.",10,null,0,{"$f":"IF(F15=0,0,INDEX($D15:$D17,F15,1))","v":0},null,null,null,"Whale"]
[null,2,null,5]
[null,null,null,0]
[null,null,"Was the biological effect stated (e.g., LC or NOEC)?",5,null,0,{"$f":"IF(F18=0,0,INDEX($D18:$D19,F18,1))","v":0}]
[null,3,null,0]
[]
[null,4,"Was the biological effect quantified (e.g., 50% effect, 25% effect)? The effect for NOEC and LOEC data must be quantified.",5,null,0,{"$f":"IF(F21=0,0,INDEX($D21:$D22,F21,1))","v":0}]
[null,null,null,0]
[null,5,"Were appropriate controls (e.g., a no-toxicant control and/or solvent control) used?",5,null,0,{"$f":"IF(F23=0,0,INDEX($D23:$D24,F23,1))","v":0}]
[null,null,null,0]
[]
[null,6,"Was each control and contaminant concentration at least duplicated?",5,null,0,{"$f":"IF(F26=0,0,INDEX($D26:$D27,F26,1))","v":0}]
[null,null,null,0]
[]
[null,7,"Were test acceptability criteria stated (e.g., mortality in controls must not exceed a certain percentage) (5 marks)?\nOR\nWere test acceptability criteria inferred (e.g., test method used [USEPA, OECD, ASTM etc]) (award 2 marks). Note: Invalid data must no",5,null,0,{"$f":"IF(F29=0,0,INDEX($D29:$D31,F29,1))","v":0}]
[null,null,null,2]
[null,null,null,0]
[null,8,"Were the characteristics of the test organism (e.g., length, mass, age) stated?",5,null,0,{"$f":"IF(F32=0,0,INDEX($D32:$D34,F32,1))","v":0}]
[null,null,null,0]
[]
[null,9,"Was the type of test media used stated?",5,null,0,{"$f":"IF(F35=0,0,INDEX($D35:$D37,F35,1))","v":0}]
[null,null,null,0]
[]
[null,null,"Was the type of exposure (e.g. static, flow through) stated? ",4,null,0,{"$f":"IF(F38=0,0,INDEX($D38:$D40,F38,1))","v":0}]
[null,10,null,0]
[]
[null,null,"Were the contaminant concentrations measured?",4,null,0,{"$f":"IF(F41=0,0,INDEX($D41:$D43,F41,1))","v":0}]
[null,11,null,0]
[]
[null,null,"Were parallel reference toxicant toxicity tests conducted?",4,null,0,{"$f":"IF(F44=0,0,INDEX($D44:$D46,F44,1))","v":0}]
[null,12,null,0]
[]
[null,null,"Was there a concentration–response relationship either observable or stated",4,null,0,{"$f":"IF(F47=0,0,INDEX($D47:$D49,F47,1))","v":0}]
[null,13,null,0]
[]
[null,null,"Was an appropriate statistical method or model used to determine the toxicity?",4,null,0,{"$f":"IF(F50=0,0,INDEX($D50:$D52,F50,1))","v":0}]
[null,14,null,0]
[]
[null,15,"For LC/EC/BEC data values derived was an estimate of variability provided? (10/20 effects data desirable)\nOR If NO EC/LOEC data, was the significance level 0.05 or less?                                                 \n\n",4,null,0,{"$f":"IF(F53=0,0,INDEX($D53:$D55,F53,1))","v":0}]
[null,null,null,0]
[]
[null,16,"Were the following parameters measured and stated? (3 marks if measured and stated, 1 if just measured)"]
[null,null,"pH",3,null,0,{"$f":"IF(F57=0,0,INDEX($D57:$D59,F57,1))","v":0}]
[null,16.100000000000001,null,1]
[null,null,null,0]
[]
[null,null,"Particulate organic carbon (POC)",3,null,0,{"$f":"IF(F61=0,0,INDEX($D61:$D63,F61,1))","v":0}]
[null,16.2,null,1]
[null,null,null,0]
[]
[null,null,"Particle size (e.g. <63 µm or silt/clay)",3,null,0,{"$f":"IF(F65=0,0,INDEX($D65:$D67,F65,1))","v":0}]
[null,16.3,null,1]
[null,null,null,0]
[]
[null,null,"Acid-volatile sulfide (AVS) and 1-M HCl extractable metals",3,null,0,{"$f":"IF(F69=0,0,INDEX($D69:$D71,F69,1))","v":0}]
[null,16.399999999999999,null,1]
[null,null,null,0]
[]
[null,null,"Dissolved contaminants (e.g. metals) in porewater or overlying water",3,null,0,{"$f":"IF(F73=0,0,INDEX($D73:$D75,F73,1))","v":0}]
[null,16.5,null,1]
[null,null,null,0]
[]
[null,null,"Dissolved ammonia and sulfide in porewater or overlying water",3,null,0,{"$f":"IF(F77=0,0,INDEX($D77:$D79,F77,1))","v":0}]
[null,16.600000000000001,null,1]
[null,null,null,0]
[]
[null,null,"Was the temperature measured and stated?",3,null,0,{"$f":"IF(F81=0,0,INDEX($D81:$D83,F81,1))","v":0}]
[null,17,null,0]
[]
[null,null,"Was the grade or purity of the test contaminant stated?",3,null,0,{"$f":"IF(F84=0,0,INDEX($D84:$D85,F84,1))","v":0}]
[null,18,null,0]
[]
[]
[null,19,"Was the salinity/conductivity measured and stated?",3,null,0,{"$f":"IF(F88=0,0,INDEX($D88:$D89,F88,1))","v":0}]
[null,null,null,0]
[null,20,"Was the alkalinity, hardness, or concentrations of Ca and Mg measured in the overlying water?Were known interacting elements on bioavailability measured (e.g. Cl for Cd)?",3,null,0,{"$f":"IF(F90=0,0,INDEX($D90:$D91,F90,1))","v":0}]
[null,null,null,0]
[null,21,"For sediments spiked with metal salts were the equilibration conditions adequate?",3,null,0,{"$f":"IF(F92=0,0,INDEX($D92:$D93,F92,1))","v":0}]
[null,null,null,0,null,null,null,null,{"$f":"(COUNTIF(F12:F93,\"=0\"))+COUNTIF(F2:F10,\"=0\")","v":35}]
[]
[null,null,"Total score",null,null,null,{"$f":"IF(SUM(G12:G92)=0,\"\",SUM(G12:G92))","v":""}]
[null,null,"Total Max. possible score for the various types of data and contaminants ",null,{"$f":"D12+D15+D18+D21+D23+D26+D29+D32+D35+D38+D41+D44+D47+D50+D53+D57+D61+D65+D69+D73+D77+D81+D84+D88+D90+D92","v":112}]
[null,null,"Quality Score",null,{"$f":"\"= [Total score / Total possible score] * 100 = \"","v":"= [Total score / Total possible score] * 100 = "},null,{"$f":"IF(ISERROR(G95/E96),#N/A,G95/E96)","v":{"$error":"#N/A"}}]
[]
[null,null,"H = high quality                           Quality score >=80%      "]
[null,null,"A = acceptable quality         80%>Quality score>50%      "]
[null,null,"U = unacceptable quality              Quality score <=50%  "]
[]
[3,null,"CLICK \"Save&Update\" BUTTON TO SAVE ANSWER TO SAMPLE FINALISED ASSESSMENT SHEET"]

{"sheet":"Sediment Quality","index":20,"n_rows":5,"n_cols":29,"rows_kept":5,"cut":false,"hidden":false,"merged":[]}
[]
["Question No.",1,2,3,4,5,6,7,8,9,10,11,12,13,14,15,16.100000000000001,16.2,16.3,16.399999999999999,16.5,16.600000000000001,17,18,19,20,21,"Total Score","Quality Score"]
["Short Questions","duration of the exposure ","biological endpoint","biological effect stated ornot","biological effect quantified or not","appropriate controls","control & contaminant concentration","test acceptability criteria","characteristics of the test organism"," type of test media","type of exposure","contaminant concentrations","parallel reference toxicant toxicity tests","concentration–response relationship","determine the toxicity","LC/EC/BEC ","pH","POC","Particle size","AVS & 1-M HCl extractable metals","Dissolved contaminants","Dissolved ammonia and sulfide","Temperature","Grade or purity"," salinity/conductivity","alkalinity, hardness, or concentrations of Ca and Mg","equilibration conditions "]
["Marks Awarded","10 or 0","10,5 or 0","5 or 0 ","5 or 0 ","5 or 0 ","5 or 0 ","5 or 0 ","5 or 0 ","5 or 0 ","4 or 0","4 or 0","4 or 0","4 or 0","4 or 0","4 or 0","3,1,or 0","3,1,or 0","3,1,or 0","3,1,or 0","3,1,or 0","3,1,or 0","3 or 0","3 or 0","3 or 0","3 or 0"]
["Max. Possible Score",10,10,5,5,5,5,5,5,5,4,4,4,4,4,4,3,3,3,3,3,3,3,3,3,3,3,{"$f":"SUM(B5:AA5)","v":112}]

{"sheet":"All Results","index":21,"n_rows":486,"n_cols":22,"rows_kept":486,"cut":false,"hidden":false,"merged":[]}
["Data from literature search"]
[{"$f":"'[1]FW nonmetal plant'!C2","v":"Category"},{"$f":"'[1]FW nonmetal plant'!C3","v":"Paper and data unique identifier(eg. 1-1,10-150)"},{"$f":"'[1]FW nonmetal plant'!C70","v":"Total score"},{"$f":"'[1]FW nonmetal plant'!C72","v":"Quality Score"},"Comment ",{"$f":"'[1]FW nonmetal plant'!G3","v":"Species (Scientific name)"},{"$f":"'[1]FW nonmetal plant'!G4","v":"Lifestage"},{"$f":"'[1]FW nonmetal plant'!G5","v":"Exposure duration"},{"$f":"'[1]FW nonmetal plant'!G6","v":"Measure of toxicity"},{"$f":"'[1]FW nonmetal plant'!G7","v":"Toxicity endpoint"},{"$f":"'[1]FW nonmetal plant'!G8","v":"Toxicity value"},{"$f":"'[1]FW nonmetal plant'!J2","v":"Taxonomic group"},{"$f":"'[1]FW nonmetal plant'!J3","v":"Phylum"},{"$f":"'[1]FW nonmetal plant'!J4","v":"Class"},{"$f":"'[1]FW nonmetal plant'!J5","v":"Media"},{"$f":"'[1]FW nonmetal plant'!J6","v":"Temperature "},{"$f":"'[1]FW nonmetal plant'!J7","v":"Acute Or Chronic "},{"$f":"'[1]FW nonmetal plant'!J8","v":"PH"},{"$f":"'[1]FW metal plant'!J9","v":"Salinity/Conductivity"},{"$f":"'[1]FW metal plant'!C4","v":"Citation"},{"$f":"'[1]FW metal plant'!G2","v":"Citation No."},"QAQC Check #1"]
["MEW_nonplant","942-1",67,0.71276595744680848,null,"Oryzias melastigma","Larvae","96 hour","LC50","Mortality","7800 ug/L","Fish ","Chordata","Actinopterygii","Marinewater","25 (+ - 1) C","Acute","8.1 - 8.4","33 (+ - 0.5) %","Bao, V. W. W., Leung, K. M. Y., Qiu, J. W. & Lam, M. H. W. 2011. Acute toxicities of five commonly used antifouling booster biocides to selected subtropical and cosmopolitan marine species, Marine Pollution Bulletin, 62: 1147 - 1151.","942","Yes"]
["MEW_nonplant","942-2",67,0.71276595744680848,null,"Tigriopus japonicus","Adult","96 hour","LC50","Mortality","11000 ug/L","Crustacean","Arthropoda","Maxillopoda","Marinewater","25 (+ - 1) C","Acute","8.1 - 8.4","33 (+ - 0.5) %","Bao, V. W. W., Leung, K. M. Y., Qiu, J. W. & Lam, M. H. W. 2011. Acute toxicities of five commonly used antifouling booster biocides to selected subtropical and cosmopolitan marine species, Marine Pollution Bulletin, 62: 1147 - 1151.","942","Yes"]
["MEW_nonplant","942-3",67,0.71276595744680848,null,"Elasmopus rapax","Juvenile","96 hour","LC50","Mortality",">3000 ug/L","Crustacean","Arthropoda","Malacostraca","Marinewater","25 (+ - 1) C","Acute","8.1 - 8.4","33 (+ - 0.5) %","Bao, V. W. W., Leung, K. M. Y., Qiu, J. W. & Lam, M. H. W. 2011. Acute toxicities of five commonly used antifouling booster biocides to selected subtropical and cosmopolitan marine species, Marine Pollution Bulletin, 62: 1147 - 1151.","942","Yes"]
["MEW_nonplant","942-4",67,0.71276595744680848,null,"Balanus amphitrite","Larvae","24 hour","LC50","Mortality","21000 ug/L","Crustacean","Arthropoda","Maxillopoda","Marinewater","25 (+ - 1) C","Acute","8.1 - 8.4","33 (+ - 0.5) %","Bao, V. W. W., Leung, K. M. Y., Qiu, J. W. & Lam, M. H. W. 2011. Acute toxicities of five commonly used antifouling booster biocides to selected subtropical and cosmopolitan marine species, Marine Pollution Bulletin, 62: 1147 - 1151.","942","Yes"]
["MEW_nonplant","942-5",67,0.71276595744680848,null,"Hydroides elegans ","Larvae","48 hour","LC50","Mortality","16000 ug/L","Polychaete","Annelida","Polychaeta","Marinewater","27 (+ - 1) C","Acute","8.1 - 8.4","33 (+ - 0.5) %","Bao, V. W. W., Leung, K. M. Y., Qiu, J. W. & Lam, M. H. W. 2011. Acute toxicities of five commonly used antifouling booster biocides to selected subtropical and cosmopolitan marine species, Marine Pollution Bulletin, 62: 1147 - 1151.","942","Yes"]
["MEW_nonplant","942-6",63,0.67021276595744683,null,"Acropora tumida","Larvae","24 hour","LC10","Mortality","91 ug/L","Coral","Cnidaria","Anthozoa","Marinewater","25 (+ - 1) C","Acute","8.1 - 8.4","33 (+ - 0.5) %","Bao, V. W. W., Leung, K. M. Y., Qiu, J. W. & Lam, M. H. W. 2011. Acute toxicities of five commonly used antifouling booster biocides to selected subtropical and cosmopolitan marine species, Marine Pollution Bulletin, 62: 1147 - 1151.","942","Yes"]
["MEW_nonplant","942-7",67,0.71276595744680848,null,"Acropora tumida","Larvae","24 hour","LC50","Mortality","4800 ug/L","Coral","Cnidaria","Anthozoa","Marinewater","25 (+ - 1) C","Acute","8.1 - 8.4","33 (+ - 0.5) %","Bao, V. W. W., Leung, K. M. Y., Qiu, J. W. & Lam, M. H. W. 2011. Acute toxicities of five commonly used antifouling booster biocides to selected subtropical and cosmopolitan marine species, Marine Pollution Bulletin, 62: 1147 - 1151.","942","Yes"]
["MEW_plant","942-8",72,0.79120879120879117,null,"Pyrocystis lunula","Not stated","24 hour","EC50","Microalga","43000 ug/L","Microalga","Mioza","Dinophyceae","Marinewater","25 (+ - 1) C","Acute","8.1 - 8.4","30 (+ - 0.5) %","Bao, V. W. W., Leung, K. M. Y., Qiu, J. W. & Lam, M. H. W. 2011. Acute toxicities of five commonly used antifouling booster biocides to selected subtropical and cosmopolitan marine species, Marine Pollution Bulletin, 62: 1147 - 1151.","942","Yes"]
["MEW_plant","942-9",72,0.79120879120879117,null,"Thalassiosira pseudonana","Not stated","96 hour","EC50","Microalga","4.3 ug/L","Microalga","Bacillariophyta","Mediophyceae","Marinewater","25°C","Acute","8.1 - 8.4","30 (+ - 0.5) %","Bao, V. W. W., Leung, K. M. Y., Qiu, J. W. & Lam, M. H. W. 2011. Acute toxicities of five commonly used antifouling booster biocides to selected subtropical and cosmopolitan marine species, Marine Pollution Bulletin, 62: 1147 - 1151.","942","Yes"]
["MEW_plant","942-10",72,0.79120879120879117,null,"Skeletonema costatum","Not stated","96 hour","EC50","Microalga","5.9 ug/L","Microalga","Bacillariophyta","Mediophyceae","Marinewater","25°C","Acute","8.1 - 8.4","30 (+ - 0.5) %","Bao, V. W. W., Leung, K. M. Y., Qiu, J. W. & Lam, M. H. W. 2011. Acute toxicities of five commonly used antifouling booster biocides to selected subtropical and cosmopolitan marine species, Marine Pollution Bulletin, 62: 1147 - 1151.","942","Yes"]
["MEW_plant","942-11",72,0.79120879120879117,null,"Chroococcus minor","Not stated","7 day","EC50","Microalga","4.7 ug/L","Cyanobacteria","Cyanobacteria","Cyanophyceae","Marinewater","25°C","Acute","8.1 - 8.4","30 (+ - 0.5) %","Bao, V. W. W., Leung, K. M. Y., Qiu, J. W. & Lam, M. H. W. 2011. Acute toxicities of five commonly used antifouling booster biocides to selected subtropical and cosmopolitan marine species, Marine Pollution Bulletin, 62: 1147 - 1151.","942","Yes"]
["MEW_plant","946-1",64,0.70329670329670335,null,"Dunaliaella tertiolecta","Log growth phase","96 hour","EC50","Population: Growth rate (optical density)","9.8 ug/L","Plantae","Chlorophyta","Chlorophyceae","F2 marine media ","25°C","Chronic","Not stated","20 ppt","DeLorenzo, M. E., Danese, L. E. & Baird, T. D. 2011. Influence of Increasing Temperature and Salinity on Herbicide Toxicity in Estuarine Phytoplankton, Wiley Periodicals, pp. 359 - 371.","946","Yes"]
["MEW_plant","946-2",54,0.59340659340659341,null,"Dunaliaella tertiolecta","Log growth phase","96 hour","LOEC","Population: Growth rate (optical density)","3.8 ug/L","Plantae","Chlorophyta","Chlorophyceae","F2 marine media ","25°C","Chronic","Not stated","20 ppt","DeLorenzo, M. E., Danese, L. E. & Baird, T. D. 2011. Influence of Increasing Temperature and Salinity on Herbicide Toxicity in Estuarine Phytoplankton, Wiley Periodicals, pp. 359 - 371.","946","Yes"]
["Freshwater/non-metal/non- plant","948-1",65,0.7142857142857143,null,"Daphnia magna","< 24 hours","48 hour","EC50","Immobility","8.6 mg/L","Microinvertebrate","Arthropoda","Branchiopoda","Not stated","20 (+ - 1) C","Acute ","Not stated","N.A.","Fernandez-Alba, A. R., Hernando, M. D., Piedra, L. & Chisti, Y. 2002. Toxicity evaluation of single and mixed antifouling biocides measured with acute toxicity bioassays, Analytica Chimica Acta, vol. 456, pp. 303 - 312.","948","Yes"]
["Freshwater/non-metal/non- plant","948-2",56,0.61538461538461542,null,"Daphnia magna","< 24 hours","48 hour","LOEC","Immobility","3.5 mg/L","Microinvertebrate","Arthropoda","Branchiopoda","Not stated","20 (+ - 1) C","Acute ","Not stated","N.A.","Fernandez-Alba, A. R., Hernando, M. D., Piedra, L. & Chisti, Y. 2002. Toxicity evaluation of single and mixed antifouling biocides measured with acute toxicity bioassays, Analytica Chimica Acta, vol. 456, pp. 303 - 312.","948","Yes"]
["Freshwater/non-metal/non- plant","721-1",66,0.72527472527472525,null,"Daphnia magna","< 24 hours","48 hour","EC50","Immobility","8.6 mg/L","Microinvertebrate","Arthropoda","Branchiopoda","Not stated","Not stated","Acute ","Not stated","N.A.","Fernandez-Alba, A.R., Piedra, L., Mezcua, M., and Hernando, M.D. 2002. Toxicity of single and mixed contaminants in seawater measured with acute toxicity bioassays, The Scientific World Journal, vol. 2, pp. 1115 - 1120.","721","Yes"]
["Freshwater/non-metal/plant","721-2",69,0.78409090909090906,null,"Selenastrum capricornutum","Exponential growth phase","72 hour","EC50","Growth rate: Optical density (670 nm)","0.045 mg/L","Microalga","Chlorophyta","Freshwater","21-24 C","21-24 C","Chronic","Not stated","N.A.","Fernandez-Alba, A.R., Piedra, L., Mezcua, M., and Hernando, M.D. 2002. Toxicity of single and mixed contaminants in seawater measured with acute toxicity bioassays, vol. 2, pp. 1115 - 1120.","721","Yes"]
["MEW_nonplant","949-1",59,0.62765957446808507,null,"Artemia salina","II - III Instar","24 hour","LC50","Mortality","12.01 mg/L","Macroinvertebrate","Arthropoda","Branchiopoda","Atrificial seawater","25°C","Acute","Not stated",0.35,"Koutsaftis, A. & Aoyama, I. 2007. Toxicity of Four Antifouling Biocides and Their Mixtures on the Brine Shrimp Artemia salina, Sci. Total Environ.387(1-3): 166-174.  ","949","Yes"]
["Freshwater/non-metal/non- plant","950-1",78,0.8571428571428571,"","Paratya australiensis","Not stated","96 hour","LC50","Mortality: Survival","8800 ug/L","Unknown","Unknown","Unknown","Not stated","23.4 (+ - 0.8) C","Acute ","7.7 - 7.9","N.A.","Kumar, A., Correll, R., Grocke, S. & Bajet, C. 2010. Toxicity of selected pesticides to freshwater shrimp, Paratya australiensis (Decapoda: Atyidae): Use of time series acute toxicity data to predict chronic lethality, Ecotoxicology and Environmental Safety, vol. 73, pp. 360 - 369.","950","Yes"]
["MEW_nonplant","951-1",83,0.88297872340425532,"The highest possible grade for this datum is acceptable.","Psetta maxima","Embryo","2 days","LC10","Mortality","1396 ug/L","Fish","Chordata","Actinopterygii","Filtered sea water","18 (+ - 1) C","Acute","8.29 (+ - 0.1)","34.20 ppt","Mhadhbi, L. & Beiras, R. 2012. Acute Toxicity of Seven Selected Pesticides (Alachlor, Atrazine, Dieldrin, Diuron, Pirimiphos-Methyl, Chlorpyrifos, Diazinon) to the Marine Fish (Turbot, Psetta maxima), Water Air Soil Pollut, vol. 223, pp. 5917 - 5930","951","Yes"]
["MEW_nonplant","951-2",83,0.88297872340425532,"The highest possible grade for this datum is acceptable.","Psetta maxima","Embryo","2 days","LC50","Mortality","1076 ug/L","Fish","Chordata","Actinopterygii","Filtered sea water","18 (+ - 1) C","Acute","8.29 (+ - 0.1)","34.20 ppt","Mhadhbi, L. & Beiras, R. 2012. Acute Toxicity of Seven Selected Pesticides (Alachlor, Atrazine, Dieldrin, Diuron, Pirimiphos-Methyl, Chlorpyrifos, Diazinon) to the Marine Fish (Turbot, Psetta maxima), Water Air Soil Pollut, vol. 223, pp. 5917 - 5930","951","Yes"]
["MEW_nonplant","951-3",78,0.82978723404255317,"The highest possible grade for this datum is acceptable.","Psetta maxima","Embryo","2 days","NOEC","Mortality","625 ug/L","Fish","Chordata","Actinopterygii","Filtered sea water","18 (+ - 1) C","Acute","8.29 (+ - 0.1)","34.20 ppt","Mhadhbi, L. & Beiras, R. 2012. Acute Toxicity of Seven Selected Pesticides (Alachlor, Atrazine, Dieldrin, Diuron, Pirimiphos-Methyl, Chlorpyrifos, Diazinon) to the Marine Fish (Turbot, Psetta maxima), Water Air Soil Pollut, vol. 223, pp. 5917 - 5930","951","Yes"]
["MEW_nonplant","951-4",78,0.82978723404255317,"The highest possible grade for this datum is acceptable.","Psetta maxima","Embryo","2 days","LOEC","Mortality","1250 ug/L","Fish","Chordata","Actinopterygii","Filtered sea water","18 (+ - 1) C","Acute","8.29 (+ - 0.1)","34.20 ppt","Mhadhbi, L. & Beiras, R. 2012. Acute Toxicity of Seven Selected Pesticides (Alachlor, Atrazine, Dieldrin, Diuron, Pirimiphos-Methyl, Chlorpyrifos, Diazinon) to the Marine Fish (Turbot, Psetta maxima), Water Air Soil Pollut, vol. 223, pp. 5917 - 5930","951","Yes"]
["MEW_nonplant","951-5",83,0.88297872340425532,"The highest possible grade for this datum is acceptable.","Psetta maxima","Larvae","4 days","LC10","Mortality","1617 ug/L","Fish","Chordata","Actinopterygii","Filtered sea water","18 (+ - 1) C","Acute","8.29 (+ - 0.1)","34.20 ppt","Mhadhbi, L. & Beiras, R. 2012. Acute Toxicity of Seven Selected Pesticides (Alachlor, Atrazine, Dieldrin, Diuron, Pirimiphos-Methyl, Chlorpyrifos, Diazinon) to the Marine Fish (Turbot, Psetta maxima), Water Air Soil Pollut, vol. 223, pp. 5917 - 5930","951","Yes"]
["MEW_nonplant","951-6",83,0.88297872340425532,"The highest possible grade for this datum is acceptable.","Psetta maxima","Larvae","4 days","LC50","Mortality","7826 ug/L","Fish","Chordata","Actinopterygii","Filtered sea water","18 (+ - 1) C","Acute","8.29 (+ - 0.1)","34.20 ppt","Mhadhbi, L. & Beiras, R. 2012. Acute Toxicity of Seven Selected Pesticides (Alachlor, Atrazine, Dieldrin, Diuron, Pirimiphos-Methyl, Chlorpyrifos, Diazinon) to the Marine Fish (Turbot, Psetta maxima), Water Air Soil Pollut, vol. 223, pp. 5917 - 5930","951","Yes"]
["MEW_nonplant","951-7",78,0.82978723404255317,"The highest possible grade for this datum is acceptable.","Psetta maxima","Larvae","4 days","NOEC","Mortality","625 ug/L","Fish","Chordata","Actinopterygii","Filtered sea water","18 (+ - 1) C","Acute","8.29 (+ - 0.1)","34.20 ppt","Mhadhbi, L. & Beiras, R. 2012. Acute Toxicity of Seven Selected Pesticides (Alachlor, Atrazine, Dieldrin, Diuron, Pirimiphos-Methyl, Chlorpyrifos, Diazinon) to the Marine Fish (Turbot, Psetta maxima), Water Air Soil Pollut, vol. 223, pp. 5917 - 5930","951","Yes"]
["MEW_nonplant","951-8",78,0.82978723404255317,"The highest possible grade for this datum is acceptable.","Psetta maxima","Larvae","4 days","LOEC","Mortality","1250 ug/L","Fish","Chordata","Actinopterygii","Filtered sea water","18 (+ - 1) C","Acute","8.29 (+ - 0.1)","34.20 ppt","Mhadhbi, L. & Beiras, R. 2012. Acute Toxicity of Seven Selected Pesticides (Alachlor, Atrazine, Dieldrin, Diuron, Pirimiphos-Methyl, Chlorpyrifos, Diazinon) to the Marine Fish (Turbot, Psetta maxima), Water Air Soil Pollut, vol. 223, pp. 5917 - 5930","951","Yes"]
["MEW_nonplant","951-9",78,0.82978723404255317,"The highest possible grade for this datum is acceptable.","Psetta maxima","Embryo","2 days","NOEC","Reproduction: Hatching succuss","5000 ug/L","Fish","Chordata","Actinopterygii","Filtered sea water","18 (+ - 1) C","Acute","8.29 (+ - 0.1)","34.20 ppt","Mhadhbi, L. & Beiras, R. 2012. Acute Toxicity of Seven Selected Pesticides (Alachlor, Atrazine, Dieldrin, Diuron, Pirimiphos-Methyl, Chlorpyrifos, Diazinon) to the Marine Fish (Turbot, Psetta maxima), Water Air Soil Pollut, vol. 223, pp. 5917 - 5930","951","Yes"]
["MEW_nonplant","951-10",78,0.82978723404255317,"The highest possible grade for this datum is acceptable.","Psetta maxima","Larvae","4 days","NOEC","Reproduction: Hatching succuss","5000 ug/L","Fish","Chordata","Actinopterygii","Filtered sea water","18 (+ - 1) C","Acute","8.29 (+ - 0.1)","34.20 ppt","Mhadhbi, L. & Beiras, R. 2012. Acute Toxicity of Seven Selected Pesticides (Alachlor, Atrazine, Dieldrin, Diuron, Pirimiphos-Methyl, Chlorpyrifos, Diazinon) to the Marine Fish (Turbot, Psetta maxima), Water Air Soil Pollut, vol. 223, pp. 5917 - 5930","951","Yes"]
["Freshwater/non-metal/non- plant","952-1",61,0.67032967032967028,null,"Ctenopharyngodon idella","1+ years","24 hour","LC50","Mortality","47 mg/L","Fish","Chordata","Actinopterygii","Dechlorinated tap water","13.5 (+ - 0.5) C","Acute ",8.1,"N.A.","Toobey, T. E., Lucey, J. & Stott, B. 1980. The tolerance of grass carp, Ctenopharyngodon idella Val., to aquatic herbicides, J. Fish Biol., vol. 16, pp. 591 - 597. ","952","Yes"]
["Freshwater/non-metal/non- plant","952-2",61,0.67032967032967028,null,"Ctenopharyngodon idella","1+ years","48 hour","LC50","Mortality","44 mg/L","Fish","Chordata","Actinopterygii","Dechlorinated tap water","13.5 (+ - 0.5) C","Acute ",8.1,"N.A.","Toobey, T. E., Lucey, J. & Stott, B. 1980. The tolerance of grass carp, Ctenopharyngodon idella Val., to aquatic herbicides, J. Fish Biol., vol. 16, pp. 591 - 597. ","952","Yes"]
["Freshwater/non-metal/non- plant","952-3",61,0.67032967032967028,null,"Ctenopharyngodon idella","1+ years","96 hour","LC50","Mortality","31 mg/L","Fish","Chordata","Actinopterygii","Dechlorinated tap water","13.5 (+ - 0.5) C","Acute ",8.1,"N.A.","Toobey, T. E., Lucey, J. & Stott, B. 1980. The tolerance of grass carp, Ctenopharyngodon idella Val., to aquatic herbicides, J. Fish Biol., vol. 16, pp. 591 - 597. ","952","Yes"]
["MEW_plant","953-1",60,0.65934065934065933,null,"Halodule uninervis","Not stated","3 day","NOEC","Growth: Leaf extension ","87.8 ug/L","Macrophyte","Tracheophyta","Liliopsida","Filtered seawater","25.8 + - 0.3 C","Acute","Not stated","Not stated","Flores, F., Collier, C. J., Mercurio, P., Negri, A. P. 2013. Phytotoxicity of Four Photosystem II Herbicides to Tropical Seagrasses, PLoS One, ","953","Yes"]
["MEW_plant","953-2",60,0.65934065934065933,null,"Zostera muelleri","Not stated","3 day","NOEC","Growth: Leaf extension ","87.8 ug/L","Macrophyte","Tracheophyta","Liliopsida","Filtered seawater","25.8 + - 0.3 C","Acute","Not stated","Not stated","Flores, F., Collier, C. J., Mercurio, P., Negri, A. P. 2013. Phytotoxicity of Four Photosystem II Herbicides to Tropical Seagrasses, PLoS One, ","953","Yes"]
["MEW_nonplant","954-1",56,0.5957446808510638,null,"Pagrus auratus","Fertilised eggs (0-2 hour post-fert)","36 hour","NOEC","Hatching success","50 ug/L","Fish","Chordata","Actinopterygii","Filtered seawater","24.5 C","Acute","Not stated","Not stated","Gagnon, M. M. & Rawson, C. A. 2009. Diuron increases spinal deformity in early-life-stage pink snapper Pagrus auratus, Marine Pollution Bulletin, vol. 58, pp. 1078 - 1095. ","954","Do Not Use - Unknown purity"]
["Freshwater/non-metal/plant","955-1",73,0.82954545454545459,null,"Lemna minor","Not stated","7 day","EC50","Growth rate: Frond number","28.3 ug/L","Macrophyte","Tracheophyta","Not stated","24 (+ -2 C)","24 (+ -2 C)","Acute ","6.5 + - 0.2","N.A.","Gatidou, G., Stasinakis, A. S. & Iatrou, E. I. 2015. Assessing single and joint toxicity of three phenylurea herbicides using Lemna minor and Vibrio fischeri bioassays, Chemosphere, vol. 119, S69-S74.","955","Yes"]
["Freshwater/non-metal/plant","955-2",57,0.64772727272727271,null,"Vibrio fischeri","Not stated","30 minutes","EC50","Growth rate: Frond number","8.2 ug/L","Microbe","Proteobacteria","Not stated","Not stated","Not stated","Acute ","Not stated","N.A.","Gatidou, G., Stasinakis, A. S. & Iatrou, E. I. 2015. Assessing single and joint toxicity of three phenylurea herbicides using Lemna minor and Vibrio fischeri bioassays, Chemosphere, vol. 119, S69-S74.","955","Yes"]
["Freshwater/non-metal/non- plant","956-1",61,0.67032967032967028,null,"Daphnia pulex","5 day old ","96 hour","LC50","Survival: Mortality","17.9 ug/L","Microinvertebrate","Arthropoda","Branchiopoda","Freshwater","Not stated","Acute ","6.9 + - 0.1","N.A.","Nebeker, A. V & Schuytema, G. S. 1998. Chronic Effects of the Herbicide Diuron on Freshwater Cladocerans, Amphipods, Midges, Minnows, Worms, and Snails, Archives of Environmental Contamination and Toxicolgy, vol. 35, pp. 441 - 446. ","956","Yes"]
["Freshwater/non-metal/non- plant","956-2",61,0.67032967032967028,"","Daphnia pulex","5 day old ","7 days","LC50","Survival: Mortality","7.1 ug/L","Microinvertebrate","Arthropoda","Branchiopoda","Freshwater","Not stated","Chronic","6.9 + - 0.1","N.A.","Nebeker, A. V & Schuytema, G. S. 1998. Chronic Effects of the Herbicide Diuron on Freshwater Cladocerans, Amphipods, Midges, Minnows, Worms, and Snails, Archives of Environmental Contamination and Toxicolgy, vol. 35, pp. 441 - 446. ","956","Yes"]
["Freshwater/non-metal/non- plant","956-3",61,0.67032967032967028,"","Daphnia pulex","5 day old ","7 days","LOAEL","Mortality & Reduced number of young","7.7 ug/L","Microinvertebrate","Arthropoda","Branchiopoda","Freshwater","Not stated","Chronic","6.9 + - 0.1","N.A.","Nebeker, A. V & Schuytema, G. S. 1998. Chronic Effects of the Herbicide Diuron on Freshwater Cladocerans, Amphipods, Midges, Minnows, Worms, and Snails, Archives of Environmental Contamination and Toxicolgy, vol. 35, pp. 441 - 446. ","956","Yes"]
["Freshwater/non-metal/non- plant","956-4",61,0.67032967032967028,"","Daphnia pulex","5 day old ","7 days","NOAEL","Mortality & Reduced number of young","4.0 ug/L","Microinvertebrate","Arthropoda","Branchiopoda","Freshwater","Not stated","Chronic","6.9 + - 0.1","N.A.","Nebeker, A. V & Schuytema, G. S. 1998. Chronic Effects of the Herbicide Diuron on Freshwater Cladocerans, Amphipods, Midges, Minnows, Worms, and Snails, Archives of Environmental Contamination and Toxicolgy, vol. 35, pp. 441 - 446. ","956","Yes"]
["Freshwater/non-metal/non- plant","956-5",61,0.67032967032967028,"","Hyalella azteca","<11 days","96 hour","LC50","Survival: Mortality","19.4 ug/L","Macroinvertebrate","Arthropoda","Malacostraca","Freshwater","22 C","Acute ","6.9 + - 0.1","N.A.","Nebeker, A. V & Schuytema, G. S. 1998. Chronic Effects of the Herbicide Diuron on Freshwater Cladocerans, Amphipods, Midges, Minnows, Worms, and Snails, Archives of Environmental Contamination and Toxicolgy, vol. 35, pp. 441 - 446. ","956","Yes"]
["Freshwater/non-metal/non- plant","956-6",61,0.67032967032967028,"","Hyalella azteca","<11 days","10 days","LC50","Survival: Mortality","18.4 ug/L","Macroinvertebrate","Arthropoda","Malacostraca","Freshwater","22 C","Acute ","6.9 + - 0.1","N.A.","Nebeker, A. V & Schuytema, G. S. 1998. Chronic Effects of the Herbicide Diuron on Freshwater Cladocerans, Amphipods, Midges, Minnows, Worms, and Snails, Archives of Environmental Contamination and Toxicolgy, vol. 35, pp. 441 - 446. ","956","Yes"]
["Freshwater/non-metal/non- plant","956-7",61,0.67032967032967028,"","Hyalella azteca","<11 days","10 days","LOAEL","Mortality & Reducted weight","15.7 ug/L","Macroinvertebrate","Arthropoda","Malacostraca","Freshwater","22 C","Acute ","6.9 + - 0.1","N.A.","Nebeker, A. V & Schuytema, G. S. 1998. Chronic Effects of the Herbicide Diuron on Freshwater Cladocerans, Amphipods, Midges, Minnows, Worms, and Snails, Archives of Environmental Contamination and Toxicolgy, vol. 35, pp. 441 - 446. ","956","Yes"]
["Freshwater/non-metal/non- plant","956-8",61,0.67032967032967028,"","Hyalella azteca","<11 days","10 days","NOAEL","Mortality & Reducted weight","7.9 ug/L","Macroinvertebrate","Arthropoda","Malacostraca","Freshwater","22 C","Acute ","6.9 + - 0.1","N.A.","Nebeker, A. V & Schuytema, G. S. 1998. Chronic Effects of the Herbicide Diuron on Freshwater Cladocerans, Amphipods, Midges, Minnows, Worms, and Snails, Archives of Environmental Contamination and Toxicolgy, vol. 35, pp. 441 - 446. ","956","Yes"]
["Freshwater/non-metal/non- plant","956-9",61,0.67032967032967028,"","Chironomus tentans","First instar","10 days","LC50","Mortality & Reducted weight","3.3 ug/L","Macroinvertebrate","Arthropoda","Insecta","Freshwater","24 C","Acute ","6.9 + - 0.1","N.A.","Nebeker, A. V & Schuytema, G. S. 1998. Chronic Effects of the Herbicide Diuron on Freshwater Cladocerans, Amphipods, Midges, Minnows, Worms, and Snails, Archives of Environmental Contamination and Toxicolgy, vol. 35, pp. 441 - 446. ","956","Yes"]
["Freshwater/non-metal/non- plant","956-10",61,0.67032967032967028,"","Chironomus tentans","First instar","10 days","LOAEL","Growth: Reduced weight","7.1 ug/L","Macroinvertebrate","Arthropoda","Insecta","Freshwater","24 C","Acute ","6.9 + - 0.1","N.A.","Nebeker, A. V & Schuytema, G. S. 1998. Chronic Effects of the Herbicide Diuron on Freshwater Cladocerans, Amphipods, Midges, Minnows, Worms, and Snails, Archives of Environmental Contamination and Toxicolgy, vol. 35, pp. 441 - 446. ","956","Yes"]
["Freshwater/non-metal/non- plant","956-11",61,0.67032967032967028,"","Chironomus tentans","First instar","10 days","NOAEL","Growth: Reduced weight","3.4 ug/L","Macroinvertebrate","Arthropoda","Insecta","Freshwater","24 C","Acute ","6.9 + - 0.1","N.A.","Nebeker, A. V & Schuytema, G. S. 1998. Chronic Effects of the Herbicide Diuron on Freshwater Cladocerans, Amphipods, Midges, Minnows, Worms, and Snails, Archives of Environmental Contamination and Toxicolgy, vol. 35, pp. 441 - 446. ","956","Yes"]
["Freshwater/non-metal/non- plant","956-11",61,0.67032967032967028,"","Chironomus tentans","2 days old","10 days","LOAEL","Mortality","3.4 ug/L","Macroinvertebrate","Arthropoda","Insecta","Freshwater","24 C","Acute ","6.9 + - 0.1","N.A.","Nebeker, A. V & Schuytema, G. S. 1998. Chronic Effects of the Herbicide Diuron on Freshwater Cladocerans, Amphipods, Midges, Minnows, Worms, and Snails, Archives of Environmental Contamination and Toxicolgy, vol. 35, pp. 441 - 446. ","956","Yes"]
["Freshwater/non-metal/non- plant","956-12",61,0.67032967032967028,"","Chironomus tentans","2 days old","10 days","LOAEL","Mortality","1.9 ug/L","Macroinvertebrate","Arthropoda","Insecta","Freshwater","24 C","Acute ","6.9 + - 0.1","N.A.","Nebeker, A. V & Schuytema, G. S. 1998. Chronic Effects of the Herbicide Diuron on Freshwater Cladocerans, Amphipods, Midges, Minnows, Worms, and Snails, Archives of Environmental Contamination and Toxicolgy, vol. 35, pp. 441 - 446. ","956","Yes"]
["Freshwater/non-metal/non- plant","956-13",57,0.62637362637362637,"","Pimephales promelas","Juveniles (1.5 months)","10 days","LC50","Mortality","27.1 ug/L","Fish","Chordata","Actinopterygii","Freshwater","23 C","Chronic","6.8 + - 0.1","N.A.","Nebeker, A. V & Schuytema, G. S. 1998. Chronic Effects of the Herbicide Diuron on Freshwater Cladocerans, Amphipods, Midges, Minnows, Worms, and Snails, Archives of Environmental Contamination and Toxicolgy, vol. 35, pp. 441 - 446. ","956","Yes"]
["Freshwater/non-metal/non- plant","956-14",61,0.67032967032967028,"","Pimephales promelas","Juveniles (1.5 months)","10 days","LOAEL","Mortality","27.1 ug/L","Fish","Chordata","Actinopterygii","Freshwater","23 C","Chronic","6.8 + - 0.1","N.A.","Nebeker, A. V & Schuytema, G. S. 1998. Chronic Effects of the Herbicide Diuron on Freshwater Cladocerans, Amphipods, Midges, Minnows, Worms, and Snails, Archives of Environmental Contamination and Toxicolgy, vol. 35, pp. 441 - 446. ","956","Yes"]
["Freshwater/non-metal/non- plant","956-15",61,0.67032967032967028,"","Pimephales promelas","Juveniles (1.5 months)","10 days","NOAEL","Mortality","20.0 ug/L","Fish","Chordata","Actinopterygii","Freshwater","23 C","Chronic","6.8 + - 0.1","N.A.","Nebeker, A. V & Schuytema, G. S. 1998. Chronic Effects of the Herbicide Diuron on Freshwater Cladocerans, Amphipods, Midges, Minnows, Worms, and Snails, Archives of Environmental Contamination and Toxicolgy, vol. 35, pp. 441 - 446. ","956","Yes"]
["Freshwater/non-metal/non- plant","956-16",61,0.67032967032967028,"","Pimephales promelas","Embryo/larval","7 days","LC50","Mortality","11.7 ug/L","Fish","Chordata","Actinopterygii","Freshwater","23 C","Chronic","6.8 + - 0.1","N.A.","Nebeker, A. V & Schuytema, G. S. 1998. Chronic Effects of the Herbicide Diuron on Freshwater Cladocerans, Amphipods, Midges, Minnows, Worms, and Snails, Archives of Environmental Contamination and Toxicolgy, vol. 35, pp. 441 - 446. ","956","Yes"]
["Freshwater/non-metal/non- plant","956-17",61,0.67032967032967028,"","Pimephales promelas","Embryo/larval","7 days","LOAEL","Reduced weight","8.3 ug/L","Fish","Chordata","Actinopterygii","Freshwater","23 C","Chronic","6.8 + - 0.1","N.A.","Nebeker, A. V & Schuytema, G. S. 1998. Chronic Effects of the Herbicide Diuron on Freshwater Cladocerans, Amphipods, Midges, Minnows, Worms, and Snails, Archives of Environmental Contamination and Toxicolgy, vol. 35, pp. 441 - 446. ","956","Yes"]
["Freshwater/non-metal/non- plant","956-18",61,0.67032967032967028,"","Pimephales promelas","Embryo/larval","7 days","NOAEL","Reduced weight","4.2 ug/L","Fish","Chordata","Actinopterygii","Freshwater","23 C","Chronic","6.8 + - 0.1","N.A.","Nebeker, A. V & Schuytema, G. S. 1998. Chronic Effects of the Herbicide Diuron on Freshwater Cladocerans, Amphipods, Midges, Minnows, Worms, and Snails, Archives of Environmental Contamination and Toxicolgy, vol. 35, pp. 441 - 446. ","956","Yes"]
["MEW_nonplant","956-19",67,0.71276595744680848,"","Lumbriculus variegatus","Small adults","10 days","LOAEL","Based on reduced weight","3.5 ug/L","Macroinvertebrate","Annelida","Clitellata","Not stated","23 C","Acute","6.8 + - 0.1","Not stated","Nebeker, A. V & Schuytema, G. S. 1998. Chronic Effects of the Herbicide Diuron on Freshwater Cladocerans, Amphipods, Midges, Minnows, Worms, and Snails, Archives of Environmental Contamination and Toxicolgy, vol. 35, pp. 441 - 446.","956","Yes"]
["MEW_nonplant","956-20",67,0.71276595744680848,null,"Lumbriculus variegatus","Small adults","10 days","NOEC","Based on reduced weight","1.8 ug/L","Macroinvertebrate","Annelida","Clitellata","Not stated","23 C","Acute","6.8 + - 0.1","Not stated","Nebeker, A. V & Schuytema, G. S. 1998. Chronic Effects of the Herbicide Diuron on Freshwater Cladocerans, Amphipods, Midges, Minnows, Worms, and Snails, Archives of Environmental Contamination and Toxicolgy, vol. 35, pp. 441 - 446.","956","Yes"]
["Freshwater/non-metal/non- plant","956-21",61,0.67032967032967028,null,"Physa gyrina","15 day old young","10 days","LOAEL","Reduced weight","22.8 ug/L","Macroinvertebrate","Mollusca","Gastropoda","Freshwater","23 C","Acute ","6.8 + - 0.1","N.A.","Nebeker, A. V & Schuytema, G. S. 1998. Chronic Effects of the Herbicide Diuron on Freshwater Cladocerans, Amphipods, Midges, Minnows, Worms, and Snails, Archives of Environmental Contamination and Toxicolgy, vol. 35, pp. 441 - 446. ","956","Yes"]
["Freshwater/non-metal/non- plant","956-22",61,0.67032967032967028,null,"Physa gyrina","15 day old young","10 days","NOAEL","Reduced weight","13.4 ug/L","Macroinvertebrate","Mollusca","Gastropoda","Freshwater","23 C","Acute ","6.8 + - 0.1","N.A.","Nebeker, A. V & Schuytema, G. S. 1998. Chronic Effects of the Herbicide Diuron on Freshwater Cladocerans, Amphipods, Midges, Minnows, Worms, and Snails, Archives of Environmental Contamination and Toxicolgy, vol. 35, pp. 441 - 446. ","956","Yes"]
["Freshwater/non-metal/non- plant","957-1",65,0.7142857142857143,null,"Oncorhynchus mykiss","Juveniles","7 days","LC50","Mortality","74 mg/L","Fish","Chordata","Actinopterygii","Dechlorinated tap water","Not stated","Acute ","Not measured","N.A.","Okamura, H., Watanabe, T., Aoyama, I. & Hasobe, M. 2002. Toxicity evaluation of new antifouling compounds usinf suspension-cultured fish cells, Chemosphere, vol. 46, iss. 46, pp. 945 - 951. ","957","Yes"]
["Freshwater/non-metal/non- plant","957-2",65,0.7142857142857143,null,"Oncorhynchus mykiss","Juveniles","14 days","LC50","Mortality","15 mg/L","Fish","Chordata","Actinopterygii","Dechlorinated tap water","Not stated","Acute ","Not measured","N.A.","Okamura, H., Watanabe, T., Aoyama, I. & Hasobe, M. 2002. Toxicity evaluation of new antifouling compounds usinf suspension-cultured fish cells, Chemosphere, vol. 46, iss. 46, pp. 945 - 951. ","957","Yes"]
["Freshwater/non-metal/non- plant","957-3",65,0.7142857142857143,null,"Oncorhynchus mykiss","Juveniles","21 days","LC50","Mortality","5.9 mg/L","Fish","Chordata","Actinopterygii","Dechlorinated tap water","Not stated","Chronic","Not measured","N.A.","Okamura, H., Watanabe, T., Aoyama, I. & Hasobe, M. 2002. Toxicity evaluation of new antifouling compounds usinf suspension-cultured fish cells, Chemosphere, vol. 46, iss. 46, pp. 945 - 951. ","957","Yes"]
["Freshwater/non-metal/non- plant","957-4",65,0.7142857142857143,null,"Oncorhynchus mykiss","Juveniles","28 days","LC50","Mortality","0.23 mg/L","Fish","Chordata","Actinopterygii","Dechlorinated tap water","Not stated","Chronic","Not measured","N.A.","Okamura, H., Watanabe, T., Aoyama, I. & Hasobe, M. 2002. Toxicity evaluation of new antifouling compounds usinf suspension-cultured fish cells, Chemosphere, vol. 46, iss. 46, pp. 945 - 951. ","957","Yes"]
["MEW_nonplant","958-1",54,0.57446808510638303,null,"Crassostrea gigas","Embryo","24 hour","LC10","Mortality",">1000 ug/L","Macroinvertebrate","Mollusca ","Bivalvia","Atrificial seawater","25°C","Acute","Not stated","Not stated","Tsunemasa, N. & Okamura, H. 2011. Effects of Organotin Alternative Antifoulants on Oyster Embryo, Archives of Environmental Contamination and Toxicology, vol. 61, pp. 128 - 134.","958","Yes"]
[]
["Freshwater","834-8",72,0.69902912621359226,"QAQC Assessment is in the Metolachlor QAQC spreadsheet.","Chlorella pyrenoidosa","non-stated","96 hours","EC50","Population Abundance","2.3 ug/L",null,null,null,null,null,null,null,null,"Ma, J., Xu, L. and Wang, S., 2002. A Quick, Simple, and Accurate Method of Screening Herbicide Activity Using Green Algae Cell Suspension Cultures, Weed Sci.50(5): 555-559. ","834","Yes"]
["Freshwater","837-6",68,0.66019417475728159,"QAQC Assessment is in the Metolachlor QAQC spreadsheet.","Raphidocelis subcapitata","non-stated","96 hours","EC50","Population Abundance","0.7 ug/L",null,null,null,null,null,null,null,null,"Ma, J., Wang, S., Wang, P., Ma, L., Chen, X. and Xu, R., 2006. Toxicity Assessment of 40 Herbicides to the Green Alga Raphidocelis subcapitata, Ecotoxicol. Environ. Saf.63(3): 456-462. ","837","Yes"]
["Marine","852-3",58,0.56310679611650483,"QAQC Assessment is in the Metolachlor QAQC spreadsheet.","Proisotoma minuta","non-stated","7 days","LC50","Mortality","711000 ug/L",null,null,null,null,null,null,null,null,"Park, E.K. and Lees, E.M., 2005. Application of an Artificial Sea Salt Solution to Determine Acute Toxicity of Herbicides to Proisotoma minuta (Collembola), J. Environ. Sci. Health Part B Pestic. Food Contam. Agric. Wastes40(4): 595-604. ","852","Yes"]
["Freshwater","835-5",59,0.57281553398058249,"QAQC Assessment is in the Metolachlor QAQC spreadsheet.","Scenedesmus quadricauda","non-stated","96 hours","EC50","Population Abundance","2.7 ug/L",null,null,null,null,null,null,null,null,"Ma, J., Lin, F., Wang, S. and Xu, L., 2003. Toxicity of 21 Herbicides to the Green Alga Scenedesmus quadricauda, Bull. Environ. Contam. Toxicol.71(3): 594-601. ","835","Yes"]
["Freshwater","836-5",67,0.65048543689320393,"QAQC Assessment is in the Metolachlor QAQC spreadsheet.","Chlorella vulgaris","non-stated","96 hours","EC50","Population Abundance","4.3 ug/L",null,null,null,null,null,null,null,null,"Ma, J., Xu, L., Wang, S., Zheng, R., Jin, S., Huang, S. and Huang, Y., 2002. Toxicity of 40 Herbicides to the Green Alga Chlorella vulgaris, Ecotoxicol. Environ. Saf.51(2): 128-132. ","836","Yes"]
["Freshwater","845-1-RE ",69,0.66990291262135926,"QAQC Assessment is in the Metolachlor QAQC spreadsheet.","Craticula accomoda","Exponential Growth Phase","96 hours","EC50","Population: Growth rate (Chlorophyll-a flourescence)","1734 ug/L","Benthic ",null,null,null,null,null,null,null,"Larras,F., A. Bouchez, F. Rimet, and B. Montuelle, 2012. Using Bioassays and Species Sensitivity Distributions to Assess Herbicide Toxicity Towards Benthic Diatoms, PLoS One7(8): 1-9.","   ","Yes"]
["Freshwater","845-2-RE ",69,0.66990291262135926,"QAQC Assessment is in the Metolachlor QAQC spreadsheet.","Craticula accomoda","Exponential Growth Phase","96 hours","EC05","Population: Growth rate (Chlorophyll-a flourescence)","261 ug/L","Benthic ",null,null,null,null,null,null,null,"Larras,F., A. Bouchez, F. Rimet, and B. Montuelle, 2012. Using Bioassays and Species Sensitivity Distributions to Assess Herbicide Toxicity Towards Benthic Diatoms, PLoS One7(8): 1-9.","   ","Yes"]
["Freshwater","845-3-RE ",69,0.66990291262135926,"QAQC Assessment is in the Metolachlor QAQC spreadsheet.","Eolimna minima","Exponential Growth Phase","96 hours","EC50","Population: Growth rate (Chlorophyll-a flourescence)","4236 ug/L","Benthic ",null,null,null,null,null,null,null,"Larras,F., A. Bouchez, F. Rimet, and B. Montuelle, 2012. Using Bioassays and Species Sensitivity Distributions to Assess Herbicide Toxicity Towards Benthic Diatoms, PLoS One7(8): 1-9.","   ","Yes"]
["Freshwater","845-4-RE ",69,0.66990291262135926,"QAQC Assessment is in the Metolachlor QAQC spreadsheet.","Eolimna minima","Exponential Growth Phase","96 hours","EC05","Population: Growth rate (Chlorophyll-a flourescence)","3007 ug/L","Benthic ",null,null,null,null,null,null,null,"Larras,F., A. Bouchez, F. Rimet, and B. Montuelle, 2012. Using Bioassays and Species Sensitivity Distributions to Assess Herbicide Toxicity Towards Benthic Diatoms, PLoS One7(8): 1-9.","   ","Yes"]
["Freshwater","845-5-RE ",69,0.66990291262135926,"QAQC Assessment is in the Metolachlor QAQC spreadsheet.","Mayamaea fossalis","Exponential Growth Phase","96 hours","EC50","Population: Growth rate (Chlorophyll-a flourescence)","463 ug/L","Benthic ",null,null,null,null,null,null,null,"Larras,F., A. Bouchez, F. Rimet, and B. Montuelle, 2012. Using Bioassays and Species Sensitivity Distributions to Assess Herbicide Toxicity Towards Benthic Diatoms, PLoS One7(8): 1-9.","   ","Yes"]
["Freshwater","845-6-RE ",69,0.66990291262135926,"QAQC Assessment is in the Metolachlor QAQC spreadsheet.","Mayamaea fossalis","Exponential Growth Phase","96 hours","EC05","Population: Growth rate (Chlorophyll-a flourescence)","74 ug/L","Benthic ",null,null,null,null,null,null,null,"Larras,F., A. Bouchez, F. Rimet, and B. Montuelle, 2012. Using Bioassays and Species Sensitivity Distributions to Assess Herbicide Toxicity Towards Benthic Diatoms, PLoS One7(8): 1-9.","   ","Yes"]
["Freshwater","845-7-RE ",69,0.66990291262135926,"QAQC Assessment is in the Metolachlor QAQC spreadsheet.","Encyonema silesiacum","Exponential Growth Phase","96 hours","EC50","Population: Growth rate (Chlorophyll-a flourescence)","8.79 ug/L","Benthic ",null,null,null,null,null,null,null,"Larras,F., A. Bouchez, F. Rimet, and B. Montuelle, 2012. Using Bioassays and Species Sensitivity Distributions to Assess Herbicide Toxicity Towards Benthic Diatoms, PLoS One7(8): 1-9.","   ","Yes"]
["Freshwater","845-8-RE ",69,0.66990291262135926,"QAQC Assessment is in the Metolachlor QAQC spreadsheet.","Encyonema silesiacum","Exponential Growth Phase","96 hours","EC05","Population: Growth rate (Chlorophyll-a flourescence)","3.11 ug/L","Benthic ",null,null,null,null,null,null,null,"Larras,F., A. Bouchez, F. Rimet, and B. Montuelle, 2012. Using Bioassays and Species Sensitivity Distributions to Assess Herbicide Toxicity Towards Benthic Diatoms, PLoS One7(8): 1-9.","   ","Yes"]
["Freshwater","845-9-RE ",69,0.66990291262135926,"QAQC Assessment is in the Metolachlor QAQC spreadsheet.","Gomphonema parvulum","Exponential Growth Phase","96 hours","EC50","Population: Growth rate (Chlorophyll-a flourescence)","2255 ug/L","Benthic ",null,null,null,null,null,null,null,"Larras,F., A. Bouchez, F. Rimet, and B. Montuelle, 2012. Using Bioassays and Species Sensitivity Distributions to Assess Herbicide Toxicity Towards Benthic Diatoms, PLoS One7(8): 1-9.","   ","Yes"]
["Freshwater","845-10-RE ",69,0.66990291262135926,"QAQC Assessment is in the Metolachlor QAQC spreadsheet.","Gomphonema parvulum","Exponential Growth Phase","96 hours","EC05","Population: Growth rate (Chlorophyll-a flourescence)","904 ug/L","Benthic ",null,null,null,null,null,null,null,"Larras,F., A. Bouchez, F. Rimet, and B. Montuelle, 2012. Using Bioassays and Species Sensitivity Distributions to Assess Herbicide Toxicity Towards Benthic Diatoms, PLoS One7(8): 1-9.","   ","Yes"]
["Freshwater","845-13-RE ",69,0.66990291262135926,"QAQC Assessment is in the Metolachlor QAQC spreadsheet.","Fragilaria ulna","Exponential Growth Phase","96 hours","EC50","Population: Growth rate (Chlorophyll-a flourescence)","51 ug/L","Benthic ",null,null,null,null,null,null,null,"Larras,F., A. Bouchez, F. Rimet, and B. Montuelle, 2012. Using Bioassays and Species Sensitivity Distributions to Assess Herbicide Toxicity Towards Benthic Diatoms, PLoS One7(8): 1-9.","   ","Yes"]
["Freshwater","845-14-RE ",69,0.66990291262135926,"QAQC Assessment is in the Metolachlor QAQC spreadsheet.","Fragilaria ulna","Exponential Growth Phase","96 hours","EC05","Population: Growth rate (Chlorophyll-a flourescence)","12.6 ug/L","Benthic ",null,null,null,null,null,null,null,"Larras,F., A. Bouchez, F. Rimet, and B. Montuelle, 2012. Using Bioassays and Species Sensitivity Distributions to Assess Herbicide Toxicity Towards Benthic Diatoms, PLoS One7(8): 1-9.","   ","Yes"]
["Freshwater","845-19-RE ",69,0.66990291262135926,"QAQC Assessment is in the Metolachlor QAQC spreadsheet.","Achnanthidium minutissimum","Exponential Growth Phase","96 hours","EC50","Population: Growth rate (Chlorophyll-a flourescence)","108 ug/L","Benthic ",null,null,null,null,null,null,null,"Larras,F., A. Bouchez, F. Rimet, and B. Montuelle, 2012. Using Bioassays and Species Sensitivity Distributions to Assess Herbicide Toxicity Towards Benthic Diatoms, PLoS One7(8): 1-9.","   ","Yes"]
["Freshwater","845-20-RE ",69,0.66990291262135926,"QAQC Assessment is in the Metolachlor QAQC spreadsheet.","Achnanthidium minutissimum","Exponential Growth Phase","96 hours","EC05","Population: Growth rate (Chlorophyll-a flourescence)","3.15 ug/L","Benthic ",null,null,null,null,null,null,null,"Larras,F., A. Bouchez, F. Rimet, and B. Montuelle, 2012. Using Bioassays and Species Sensitivity Distributions to Assess Herbicide Toxicity Towards Benthic Diatoms, PLoS One7(8): 1-9.","   ","Yes"]
["Freshwater","845-21-RE ",69,0.66990291262135926,"QAQC Assessment is in the Metolachlor QAQC spreadsheet.","Cyclotella meneghiniana","Exponential Growth Phase","96 hours","EC50","Population: Growth rate (Chlorophyll-a flourescence)","23 ug/L","Benthic ",null,null,null,null,null,null,null,"Larras,F., A. Bouchez, F. Rimet, and B. Montuelle, 2012. Using Bioassays and Species Sensitivity Distributions to Assess Herbicide Toxicity Towards Benthic Diatoms, PLoS One7(8): 1-9.","   ","Yes"]
["Freshwater","845-22-RE ",69,0.66990291262135926,"QAQC Assessment is in the Metolachlor QAQC spreadsheet.","Cyclotella meneghiniana","Exponential Growth Phase","96 hours","EC05","Population: Growth rate (Chlorophyll-a flourescence)","1.59 ug/L","Benthic ",null,null,null,null,null,null,null,"Larras,F., A. Bouchez, F. Rimet, and B. Montuelle, 2012. Using Bioassays and Species Sensitivity Distributions to Assess Herbicide Toxicity Towards Benthic Diatoms, PLoS One7(8): 1-9.","   ","Yes"]
["Freshwater","845-11-RE ",69,0.66990291262135926,"QAQC Assessment is in the Metolachlor QAQC spreadsheet.","Fragilaria capucina var vaucheriae","Exponential Growth Phase","96 hours","EC50","Population: Growth rate (Chlorophyll-a flourescence)","4.03 ug/L","Benthic ",null,null,null,null,null,null,null,"Larras,F., A. Bouchez, F. Rimet, and B. Montuelle, 2012. Using Bioassays and Species Sensitivity Distributions to Assess Herbicide Toxicity Towards Benthic Diatoms, PLoS One7(8): 1-9.","   ","Yes"]
["Freshwater","845-12-RE ",69,0.66990291262135926,"QAQC Assessment is in the Metolachlor QAQC spreadsheet.","Fragilaria capucina var vaucheriae","Exponential Growth Phase","96 hours","EC05","Population: Growth rate (Chlorophyll-a flourescence)","0.069 ug/L","Benthic ",null,null,null,null,null,null,null,"Larras,F., A. Bouchez, F. Rimet, and B. Montuelle, 2012. Using Bioassays and Species Sensitivity Distributions to Assess Herbicide Toxicity Towards Benthic Diatoms, PLoS One7(8): 1-9.","   ","Yes"]
["Freshwater","845-15-RE ",69,0.66990291262135926,"QAQC Assessment is in the Metolachlor QAQC spreadsheet.","Fragilaria rumpens","Exponential Growth Phase","96 hours","EC50","Population: Growth rate (Chlorophyll-a flourescence)","122 ug/L","Benthic ",null,null,null,null,null,null,null,"Larras,F., A. Bouchez, F. Rimet, and B. Montuelle, 2012. Using Bioassays and Species Sensitivity Distributions to Assess Herbicide Toxicity Towards Benthic Diatoms, PLoS One7(8): 1-9.","   ","Yes"]
["Freshwater","845-16-RE ",69,0.66990291262135926,"QAQC Assessment is in the Metolachlor QAQC spreadsheet.","Fragilaria rumpens","Exponential Growth Phase","96 hours","EC05","Population: Growth rate (Chlorophyll-a flourescence)","18 ug/L","Benthic ",null,null,null,null,null,null,null,"Larras,F., A. Bouchez, F. Rimet, and B. Montuelle, 2012. Using Bioassays and Species Sensitivity Distributions to Assess Herbicide Toxicity Towards Benthic Diatoms, PLoS One7(8): 1-9.","   ","Yes"]
["Freshwater","845-17-RE ",69,0.66990291262135926,"QAQC Assessment is in the Metolachlor QAQC spreadsheet.","Nitzschia palea","Exponential Growth Phase","96 hours","EC50","Population: Growth rate (Chlorophyll-a flourescence)","1539 ug/L","Benthic ",null,null,null,null,null,null,null,"Larras,F., A. Bouchez, F. Rimet, and B. Montuelle, 2012. Using Bioassays and Species Sensitivity Distributions to Assess Herbicide Toxicity Towards Benthic Diatoms, PLoS One7(8): 1-9.","   ","Yes"]
["Freshwater","845-18-RE ",69,0.66990291262135926,"QAQC Assessment is in the Metolachlor QAQC spreadsheet.","Nitzschia palea","Exponential Growth Phase","96 hours","EC05","Population: Growth rate (Chlorophyll-a flourescence)","106 ug/L","Benthic ",null,"EC10",null,null,null,null,null,"Larras,F., A. Bouchez, F. Rimet, and B. Montuelle, 2012. Using Bioassays and Species Sensitivity Distributions to Assess Herbicide Toxicity Towards Benthic Diatoms, PLoS One7(8): 1-9.","   ","Yes"]
["Freshwater","845-85",69,0.66990291262135926,"QAQC Assessment is in the Metolachlor QAQC spreadsheet.","Craticula accomoda","Exponential Growth Phase","96 hours","EC10","Population: Growth rate (Chlorophyll-a flourescence)","644 ug/L","Planktonic",null,"185 ug/L","Benthic",null,null,null,null,"Larras,F., A. Bouchez, F. Rimet, and B. Montuelle, 2012. Using Bioassays and Species Sensitivity Distributions to Assess Herbicide Toxicity Towards Benthic Diatoms, PLoS One7(8): 1-9.",959,"Yes"]
["Freshwater","845-88",69,0.66990291262135926,"QAQC Assessment is in the Metolachlor QAQC spreadsheet.","Sellaphora minina","Exponential Growth Phase","96 hours","EC10","Population: Growth rate (Chlorophyll-a flourescence)","3218 ug/L","Planktonic",null,"693 ug/L","Benthic",null,null,null,null,"Larras,F., A. Bouchez, F. Rimet, and B. Montuelle, 2012. Using Bioassays and Species Sensitivity Distributions to Assess Herbicide Toxicity Towards Benthic Diatoms, PLoS One7(8): 1-9.",959,"Yes"]
["Freshwater","845-90",69,0.66990291262135926,"QAQC Assessment is in the Metolachlor QAQC spreadsheet.","Mayamaea fossalis","Exponential Growth Phase","96 hours","EC10","Population: Growth rate (Chlorophyll-a flourescence)","96 ug/L","Planktonic",null,"91 ug/L","Benthic",null,null,null,null,"Larras,F., A. Bouchez, F. Rimet, and B. Montuelle, 2012. Using Bioassays and Species Sensitivity Distributions to Assess Herbicide Toxicity Towards Benthic Diatoms, PLoS One7(8): 1-9.",959,"Yes"]
["Freshwater","845-92",69,0.66990291262135926,"QAQC Assessment is in the Metolachlor QAQC spreadsheet.","Encyonema silesiacum","Exponential Growth Phase","96 hours","EC10","Population: Growth rate (Chlorophyll-a flourescence)","3.98 ug/L","Planktonic",null,"90 ug/L","Benthic",null,null,null,null,"Larras,F., A. Bouchez, F. Rimet, and B. Montuelle, 2012. Using Bioassays and Species Sensitivity Distributions to Assess Herbicide Toxicity Towards Benthic Diatoms, PLoS One7(8): 1-9.",959,"Yes"]
["Freshwater","845-95",69,0.66990291262135926,"QAQC Assessment is in the Metolachlor QAQC spreadsheet.","Gomphonema parvulum","Exponential Growth Phase","96 hours","EC10","Population: Growth rate (Chlorophyll-a flourescence)","1016 ug/L","Planktonic",null,"53 ug/L","Benthic",null,null,null,null,"Larras,F., A. Bouchez, F. Rimet, and B. Montuelle, 2012. Using Bioassays and Species Sensitivity Distributions to Assess Herbicide Toxicity Towards Benthic Diatoms, PLoS One7(8): 1-9.",959,"Yes"]
["Freshwater","845-98",69,0.66990291262135926,"QAQC Assessment is in the Metolachlor QAQC spreadsheet.","Fragilaria capucina var vaucheriae","Exponential Growth Phase","96 hours","EC10","Population: Growth rate (Chlorophyll-a flourescence)","0.11 ug/L","Planktonic",null,"21 ug/L","Benthic",null,null,null,null,"Larras,F., A. Bouchez, F. Rimet, and B. Montuelle, 2012. Using Bioassays and Species Sensitivity Distributions to Assess Herbicide Toxicity Towards Benthic Diatoms, PLoS One7(8): 1-9.",959,"Yes"]
["Freshwater","845-100",69,0.66990291262135926,"QAQC Assessment is in the Metolachlor QAQC spreadsheet.","Ulnaria ulna","Exponential Growth Phase","96 hours","EC10","Population: Growth rate (Chlorophyll-a flourescence)","18 ug/L","Planktonic",null,"24 ug/L","Benthic",null,null,null,null,"Larras,F., A. Bouchez, F. Rimet, and B. Montuelle, 2012. Using Bioassays and Species Sensitivity Distributions to Assess Herbicide Toxicity Towards Benthic Diatoms, PLoS One7(8): 1-9.",959,"Yes"]
["Freshwater","845-103",69,0.66990291262135926,"QAQC Assessment is in the Metolachlor QAQC spreadsheet.","Fragilaria rumpens","Exponential Growth Phase","96 hours","EC10","Population: Growth rate (Chlorophyll-a flourescence)","30 ug/L","Planktonic",null,"0.76 ug/L","Benthic",null,null,null,null,"Larras,F., A. Bouchez, F. Rimet, and B. Montuelle, 2012. Using Bioassays and Species Sensitivity Distributions to Assess Herbicide Toxicity Towards Benthic Diatoms, PLoS One7(8): 1-9.",959,"Yes"]
["Freshwater","845-105",69,0.66990291262135926,"QAQC Assessment is in the Metolachlor QAQC spreadsheet.","Nitzschia palea","Exponential Growth Phase","96 hours","EC10","Population: Growth rate (Chlorophyll-a flourescence)","196 ug/L","Planktonic",null,"380 ug/L","Benthic",null,null,null,null,"Larras,F., A. Bouchez, F. Rimet, and B. Montuelle, 2012. Using Bioassays and Species Sensitivity Distributions to Assess Herbicide Toxicity Towards Benthic Diatoms, PLoS One7(8): 1-9.",959,"Yes"]
["Freshwater","845-107",69,0.66990291262135926,"QAQC Assessment is in the Metolachlor QAQC spreadsheet.","Achnanthidium minutissimum","Exponential Growth Phase","96 hours","EC10","Population: Growth rate (Chlorophyll-a flourescence)","7.67 ug/L","Planktonic",null,"45 ug/L","Benthic",null,null,null,null,"Larras,F., A. Bouchez, F. Rimet, and B. Montuelle, 2012. Using Bioassays and Species Sensitivity Distributions to Assess Herbicide Toxicity Towards Benthic Diatoms, PLoS One7(8): 1-9.",959,"Yes"]
["Freshwater","845-110",69,0.66990291262135926,"QAQC Assessment is in the Metolachlor QAQC spreadsheet.","Cyclotella meneghiniana","Exponential Growth Phase","96 hours","EC10","Population: Growth rate (Chlorophyll-a flourescence)","2.74 ug/L","Planktonic",null,"27 ug/L","Benthic",null,null,null,null,"Larras,F., A. Bouchez, F. Rimet, and B. Montuelle, 2012. Using Bioassays and Species Sensitivity Distributions to Assess Herbicide Toxicity Towards Benthic Diatoms, PLoS One7(8): 1-9.",959,"Yes"]
["Freshwater","888-3",65,0.6310679611650486,"QAQC Assessment is in the Metsulfuron-methyl QAQC spreadsheet.","Selenastrum capricornutum","24 hr-old culture","72 hours","Population: Growth Inhibition","IC50","10.5 ug/L",null,null,null,null,null,null,null,null,"Fai,P.B., A. Grant, and B. Reid, 2007. Chlorophyll a Fluorescence as a Biomarker for Rapid Toxicity Assessment,  Environ. Toxicol. Chem.26(7): 1520-1531. ",null,"Yes"]
["Freshwater","858-4",53,0.5145631067961165,"QAQC Assessment is in the Metribuzin QAQC spreadsheet.","Scenedesmus acutus","not stated","24 hours","IC50","Population Abundance","0.000000057 M",null,null,null,null,null,null,null,null,"Grossmann,K., R. Berghaus, and G. Retzlaff, 1992. Heterotrophic Plant Cell Suspension Cultures for Monitoring Biological Activity in Agrochemical Research. Comparison with Screens Using Algae, Germinating Seeds and Whole Plants, Pestic. Sci.35(3): 283-289.","858","Yes"]
["Freshwater","858-11",53,0.5145631067961165,"QAQC Assessment is in the Metribuzin QAQC spreadsheet.","Lemna paucicostata","not stated","8 days","IC50","Population Abundance","0.000000047 M",null,null,null,null,null,null,null,null,"Grossmann,K., R. Berghaus, and G. Retzlaff, 1992. Heterotrophic Plant Cell Suspension Cultures for Monitoring Biological Activity in Agrochemical Research. Comparison with Screens Using Algae, Germinating Seeds and Whole Plants, Pestic. Sci.35(3): 283-289.","858","Yes"]
["Freshwater","858-2-RE",52,0.50485436893203883,"QAQC Assessment is in the Metribuzin QAQC spreadsheet.","Scenedesmus acutus","not stated","24 hours","EC50","Growth: Cell count","5.7 x 10^-8 M",null,null,null,null,null,null,null,null,"Grossmann,K., Berghaus, R., and Retzlaff, G. 1992. Heterotrophic Plant Cell Suspension Cultures for Monitoring Biological Activity in Agrochemical Research. Comparison with Screens Using Algae, Germinating Seeds and Whole Plants, Pesticide Science, vol. 35, pp. 283-289.","858","Yes"]
["Freshwater","858-6-RE",52,0.50485436893203883,"QAQC Assessment is in the Metribuzin QAQC spreadsheet.","Lemna paucicostata","not stated","8 days","EC50","Growth: FRond area","4.7 x 10^-8 M",null,null,null,null,null,null,null,null,"Grossmann,K., Berghaus, R., and Retzlaff, G. 1992. Heterotrophic Plant Cell Suspension Cultures for Monitoring Biological Activity in Agrochemical Research. Comparison with Screens Using Algae, Germinating Seeds and Whole Plants, Pesticide Science, vol. 35, pp. 283-289.","858","Yes"]
[null,null,null,null,null,null,null,null,null,null,null,null,null,null,null,"This below paper also copies the EC50s and EC10s from above"]
["Freshwater/non-metal/plant","959-2",64,0.72727272727272729,"","Craticula accomoda","Not stated","96 hour","EC50","Growth rate: Fluoresence","1426 ug/L","Microalga","Bacillariophyta","DV culture medium","Not stated","Benthic","Chronic","Not stated","N.A.","Larras, F., Montuelle. B. & Bouchez, A. 2013. Assessment of toxicity thresholds in aquatic environments: Does benthic growth of diatoms affect their exposure and sensitivity to herbicides?, Science of the Total Environment, pp. 469 - 477. ","959","Yes"]
["Freshwater/non-metal/plant","959-4",64,0.72727272727272729,"","Sellaphora minima","Not stated","96 hour","EC50","Growth rate: Fluoresence","2606 ug/L","Microalga","Bacillariophyta","DV culture medium","Not stated","Benthic","Chronic","Not stated","N.A.","Larras, F., Montuelle. B. & Bouchez, A. 2013. Assessment of toxicity thresholds in aquatic environments: Does benthic growth of diatoms affect their exposure and sensitivity to herbicides?, Science of the Total Environment, pp. 469 - 477. ","959","Yes"]
["Freshwater/non-metal/plant","959-6",64,0.72727272727272729,"","Mayamaea fossalis","Not stated","96 hour","EC50","Growth rate: Fluoresence","139 ug/L","Microalga","Bacillariophyta","DV culture medium","Not stated","Benthic","Chronic","Not stated","N.A.","Larras, F., Montuelle. B. & Bouchez, A. 2013. Assessment of toxicity thresholds in aquatic environments: Does benthic growth of diatoms affect their exposure and sensitivity to herbicides?, Science of the Total Environment, pp. 469 - 477. ","959","Yes"]
["Freshwater/non-metal/plant","959-9",64,0.72727272727272729,"","Encyonema silesiacum","Not stated","96 hour","EC50","Growth rate: Fluoresence","286 ug/L","Microalga","Bacillariophyta","DV culture medium","Not stated","Benthic","Chronic","Not stated","N.A.","Larras, F., Montuelle. B. & Bouchez, A. 2013. Assessment of toxicity thresholds in aquatic environments: Does benthic growth of diatoms affect their exposure and sensitivity to herbicides?, Science of the Total Environment, pp. 469 - 477. ","959","Yes"]
["Freshwater/non-metal/plant","959-12",64,0.72727272727272729,"","Gomphonema parvulum","Not stated","96 hour","EC50","Growth rate: Fluoresence","1423 ug/L","Microalga","Bacillariophyta","DV culture medium","Not stated","Benthic","Chronic","Not stated","N.A.","Larras, F., Montuelle. B. & Bouchez, A. 2013. Assessment of toxicity thresholds in aquatic environments: Does benthic growth of diatoms affect their exposure and sensitivity to herbicides?, Science of the Total Environment, pp. 469 - 477. ","959","Yes"]
["Freshwater/non-metal/plant","959-14",64,0.72727272727272729,"","Fragilaria capucina var vaucheriae","Not stated","96 hour","EC50","Growth rate: Fluoresence","44 ug/L","Microalga","Bacillariophyta","DV culture medium","Not stated","Benthic","Chronic","Not stated","N.A.","Larras, F., Montuelle. B. & Bouchez, A. 2013. Assessment of toxicity thresholds in aquatic environments: Does benthic growth of diatoms affect their exposure and sensitivity to herbicides?, Science of the Total Environment, pp. 469 - 477. ","959","Yes"]
["Freshwater/non-metal/plant","959-17",64,0.72727272727272729,"","Ulnaria ulna","Not stated","96 hour","EC50","Growth rate: Fluoresence","42 ug/L","Microalga","Bacillariophyta","DV culture medium","Not stated","Benthic","Chronic","Not stated","N.A.","Larras, F., Montuelle. B. & Bouchez, A. 2013. Assessment of toxicity thresholds in aquatic environments: Does benthic growth of diatoms affect their exposure and sensitivity to herbicides?, Science of the Total Environment, pp. 469 - 477. ","959","Yes"]
["Freshwater/non-metal/plant","959-20",64,0.72727272727272729,"","Fragilaria rumpens","Not stated","96 hour","EC50","Growth rate: Fluoresence","8.89 ug/L","Microalga","Bacillariophyta","DV culture medium","Not stated","Benthic","Chronic","Not stated","N.A.","Larras, F., Montuelle. B. & Bouchez, A. 2013. Assessment of toxicity thresholds in aquatic environments: Does benthic growth of diatoms affect their exposure and sensitivity to herbicides?, Science of the Total Environment, pp. 469 - 477. ","959","Yes"]
["Freshwater/non-metal/plant","959-22",64,0.72727272727272729,"","Nitzschia palea","Not stated","96 hour","EC50","Growth rate: Fluoresence","1667 ug/L","Microalga","Bacillariophyta","DV culture medium","Not stated","Benthic","Chronic","Not stated","N.A.","Larras, F., Montuelle. B. & Bouchez, A. 2013. Assessment of toxicity thresholds in aquatic environments: Does benthic growth of diatoms affect their exposure and sensitivity to herbicides?, Science of the Total Environment, pp. 469 - 477. ","959","Yes"]
["Freshwater/non-metal/plant","959-24",64,0.72727272727272729,"","Achnanthidium minutissimum","Not stated","96 hour","EC50","Growth rate: Fluoresence","56 ug/L","Microalga","Bacillariophyta","DV culture medium","Not stated","Benthic","Chronic","Not stated","N.A.","Larras, F., Montuelle. B. & Bouchez, A. 2013. Assessment of toxicity thresholds in aquatic environments: Does benthic growth of diatoms affect their exposure and sensitivity to herbicides?, Science of the Total Environment, pp. 469 - 477. ","959","Yes"]
["Freshwater/non-metal/plant","959-27",64,0.72727272727272729,"","Cyclotella meneghiniana","Not stated","96 hour","EC50","Growth rate: Fluoresence","49 ug/L","Microalga","Bacillariophyta","DV culture medium","Not stated","Benthic","Chronic","Not stated","N.A.","Larras, F., Montuelle. B. & Bouchez, A. 2013. Assessment of toxicity thresholds in aquatic environments: Does benthic growth of diatoms affect their exposure and sensitivity to herbicides?, Science of the Total Environment, pp. 469 - 477. ","959","Yes"]
["Freshwater/non-metal/plant","959-30",64,0.72727272727272729,"","Craticula accomoda","Not stated","96 hour","EC10","Growth rate: Fluoresence","185 ug/L","Microalga","Bacillariophyta","DV culture medium","Not stated","Benthic","Chronic","Not stated","N.A.","Larras, F., Montuelle. B. & Bouchez, A. 2013. Assessment of toxicity thresholds in aquatic environments: Does benthic growth of diatoms affect their exposure and sensitivity to herbicides?, Science of the Total Environment, pp. 469 - 477. ","959","Yes"]
["Freshwater/non-metal/plant","959-32",64,0.72727272727272729,"","Sellaphora minima","Not stated","96 hour","EC10","Growth rate: Fluoresence","693 ug/L","Microalga","Bacillariophyta","DV culture medium","Not stated","Benthic","Chronic","Not stated","N.A.","Larras, F., Montuelle. B. & Bouchez, A. 2013. Assessment of toxicity thresholds in aquatic environments: Does benthic growth of diatoms affect their exposure and sensitivity to herbicides?, Science of the Total Environment, pp. 469 - 477. ","959","Yes"]
["Freshwater/non-metal/plant","959-34",64,0.72727272727272729,"","Mayamaea fossalis","Not stated","96 hour","EC10","Growth rate: Fluoresence","91 ug/L","Microalga","Bacillariophyta","DV culture medium","Not stated","Benthic","Chronic","Not stated","N.A.","Larras, F., Montuelle. B. & Bouchez, A. 2013. Assessment of toxicity thresholds in aquatic environments: Does benthic growth of diatoms affect their exposure and sensitivity to herbicides?, Science of the Total Environment, pp. 469 - 477. ","959","Yes"]
["Freshwater/non-metal/plant","959-37",64,0.72727272727272729,"","Encyonema silesiacum","Not stated","96 hour","EC10","Growth rate: Fluoresence","90 ug/L","Microalga","Bacillariophyta","DV culture medium","Not stated","Benthic","Chronic","Not stated","N.A.","Larras, F., Montuelle. B. & Bouchez, A. 2013. Assessment of toxicity thresholds in aquatic environments: Does benthic growth of diatoms affect their exposure and sensitivity to herbicides?, Science of the Total Environment, pp. 469 - 477. ","959","Yes"]
["Freshwater/non-metal/plant","959-40",64,0.72727272727272729,"","Gomphonema parvulum","Not stated","96 hour","EC10","Growth rate: Fluoresence","53 ug/L","Microalga","Bacillariophyta","DV culture medium","Not stated","Benthic","Chronic","Not stated","N.A.","Larras, F., Montuelle. B. & Bouchez, A. 2013. Assessment of toxicity thresholds in aquatic environments: Does benthic growth of diatoms affect their exposure and sensitivity to herbicides?, Science of the Total Environment, pp. 469 - 477. ","959","Yes"]
["Freshwater/non-metal/plant","959-43",64,0.72727272727272729,"","Fragilaria capucina var vaucheriae","Not stated","96 hour","EC10","Growth rate: Fluoresence","21 ug/L","Microalga","Bacillariophyta","DV culture medium","Not stated","Benthic","Chronic","Not stated","N.A.","Larras, F., Montuelle. B. & Bouchez, A. 2013. Assessment of toxicity thresholds in aquatic environments: Does benthic growth of diatoms affect their exposure and sensitivity to herbicides?, Science of the Total Environment, pp. 469 - 477. ","959","Yes"]
["Freshwater/non-metal/plant","959-46",64,0.72727272727272729,"","Ulnaria ulna","Not stated","96 hour","EC10","Growth rate: Fluoresence","24 ug/L","Microalga","Bacillariophyta","DV culture medium","Not stated","Benthic","Chronic","Not stated","N.A.","Larras, F., Montuelle. B. & Bouchez, A. 2013. Assessment of toxicity thresholds in aquatic environments: Does benthic growth of diatoms affect their exposure and sensitivity to herbicides?, Science of the Total Environment, pp. 469 - 477. ","959","Yes"]
["Freshwater/non-metal/plant","959-49",64,0.72727272727272729,"","Fragilaria rumpens","Not stated","96 hour","EC10","Growth rate: Fluoresence","0.76 ug/L","Microalga","Bacillariophyta","DV culture medium","Not stated","Benthic","Chronic","Not stated","N.A.","Larras, F., Montuelle. B. & Bouchez, A. 2013. Assessment of toxicity thresholds in aquatic environments: Does benthic growth of diatoms affect their exposure and sensitivity to herbicides?, Science of the Total Environment, pp. 469 - 477. ","959","Yes"]
["Freshwater/non-metal/plant","959-51",64,0.72727272727272729,"","Nitzschia palea","Not stated","96 hour","EC10","Growth rate: Fluoresence","380 ug/L","Microalga","Bacillariophyta","DV culture medium","Not stated","Benthic","Chronic","Not stated","N.A.","Larras, F., Montuelle. B. & Bouchez, A. 2013. Assessment of toxicity thresholds in aquatic environments: Does benthic growth of diatoms affect their exposure and sensitivity to herbicides?, Science of the Total Environment, pp. 469 - 477. ","959","Yes"]
["Freshwater/non-metal/plant","959-52",64,0.72727272727272729,"","Achnanthidium minutissimum","Not stated","96 hour","EC10","Growth rate: Fluoresence","45ug/L","Microalga","Bacillariophyta","DV culture medium","Not stated","Benthic","Chronic","Not stated","N.A.","Larras, F., Montuelle. B. & Bouchez, A. 2013. Assessment of toxicity thresholds in aquatic environments: Does benthic growth of diatoms affect their exposure and sensitivity to herbicides?, Science of the Total Environment, pp. 469 - 477. ","959","Yes"]
["Freshwater/non-metal/plant","959-56",64,0.72727272727272729,null,"Cyclotella meneghiniana","Not stated","96 hour","EC10","Growth rate: Fluoresence","27 ug/L","Microalga","Bacillariophyta","DV culture medium","Not stated","Benthic","Chronic","Not stated","N.A.","Larras, F., Montuelle. B. & Bouchez, A. 2013. Assessment of toxicity thresholds in aquatic environments: Does benthic growth of diatoms affect their exposure and sensitivity to herbicides?, Science of the Total Environment, pp. 469 - 477. ","959","Yes"]
["Freshwater/non-metal/plant","960-1",64,0.72727272727272729,null,"Fragilaria crotonensis","Exponential growth phase","96 hour","EC50","Growth rate: Fluoresence","210 ug/L","Microalga","Bacillariophyta","DV culture medium","Not stated","Not stated","Chronic","Not stated","N.A.","Larras, F., Keck, F., Montuelle, B., Rimet, F. & Bouchez, A. 2014. Linking Diatom Sensitivity to Herbicides to Phylogeny: A Step Forward for Biomonitoring?, Environmental Science and Technology, vol. 48, pp. 1921 - 1930.","960","Yes"]
["Freshwater/non-metal/plant","960-3",64,0.72727272727272729,null,"Fistulifera saprophila","Exponential growth phase","96 hour","EC50","Growth rate: Fluoresence","91 ug/L","Microalga","Bacillariophyta","DV culture medium","Not stated","Not stated","Chronic","Not stated","N.A.","Larras, F., Keck, F., Montuelle, B., Rimet, F. & Bouchez, A. 2014. Linking Diatom Sensitivity to Herbicides to Phylogeny: A Step Forward for Biomonitoring?, Environmental Science and Technology, vol. 48, pp. 1921 - 1930.","960","Yes"]
["Freshwater/non-metal/plant","960-5",64,0.72727272727272729,null,"Gomphonema clavatum","Exponential growth phase","96 hour","EC50","Growth rate: Fluoresence","448 ug/L","Microalga","Bacillariophyta","DV culture medium","Not stated","Not stated","Chronic","Not stated","N.A.","Larras, F., Keck, F., Montuelle, B., Rimet, F. & Bouchez, A. 2014. Linking Diatom Sensitivity to Herbicides to Phylogeny: A Step Forward for Biomonitoring?, Environmental Science and Technology, vol. 48, pp. 1921 - 1930.","960","Yes"]
["Freshwater/non-metal/non- plant","944-1",68,0.74725274725274726,null,"Tetrahymena pyriformis","Exponential growth phase","9 hour","IC50","Growth rate: Cell growth inhibition","8.18 mg/L","Protozoa","Ciliophora","Oligohymenophorea","Proteose-peptone yeast salts complex medium","28 C","Acute ","Not stated","N.A.","Bonnet, J. L., Bonnemoy, F., Dusser, M. & Bohatier, J. 2007. Assessment of the Potential Toxicity of Herbicides and Their Degradation Products to Nontarget Cells Using Two Microorganisms, the Bacteria Vibrio fischeri and the Ciliate Tetrahymena pyriformis, vol. 22, pp. 78 - 91.","944","Do Not Use - Use the QCQC'd version of this entry below"]
["Freshwater/non-metal/non- plant","944-2",68,0.74725274725274726,null,"Tetrahymena pyriformis","Exponential growth phase","9 hour","IC50","Growth rate: Cell growth inhibition","7.84 mg/L","Protozoa","Ciliophora","Oligohymenophorea","Proteose-peptone yeast salts complex medium","28 C","Acute ","Not stated","N.A.","Bonnet, J. L., Bonnemoy, F., Dusser, M. & Bohatier, J. 2007. Assessment of the Potential Toxicity of Herbicides and Their Degradation Products to Nontarget Cells Using Two Microorganisms, the Bacteria Vibrio fischeri and the Ciliate Tetrahymena pyriformis, vol. 22, pp. 78 - 91.","944","Yes"]
["Freshwater/non-metal/non- plant","944-3",68,0.74725274725274726,null,"Tetrahymena pyriformis","Exponential growth phase","12 hour","IC50","Growth rate: Cell growth inhibition","6.33 mg/L","Protozoa","Ciliophora","Oligohymenophorea","Proteose-peptone yeast salts complex medium","28 C","Acute ","Not stated","N.A.","Bonnet, J. L., Bonnemoy, F., Dusser, M. & Bohatier, J. 2007. Assessment of the Potential Toxicity of Herbicides and Their Degradation Products to Nontarget Cells Using Two Microorganisms, the Bacteria Vibrio fischeri and the Ciliate Tetrahymena pyriformis, vol. 22, pp. 78 - 91.","944","Yes"]
["Freshwater/non-metal/plant","944-4",50,0.56818181818181823,null,"Vibrio fischeri","Not stated","15 minutes","EC10","Population: Growth inhibition (fluorescence)","66.87 mg/L","Bacteria","Proteobacteria","Not stated","Not stated","Not stated","Acute ","Not stated","N.A.","Bonnet, J. L., Bonnemoy, F., Dusser, M. & Bohatier, J. 2007. Assessment of the Potential Toxicity of Herbicides and Their Degradation Products to Nontarget Cells Using Two Microorganisms, the Bacteria Vibrio fischeri and the Ciliate Tetrahymena pyriformis, vol. 22, pp. 78 - 91.","944","Do Not Use - Use the QCQC'd version of this entry below"]
["Freshwater/non-metal/plant","944-5",50,0.56818181818181823,null,"Vibrio fischeri","Not stated","30 minutes","EC10","Population: Growth inhibition (fluorescence)","58.07 mg/L","Bacteria","Proteobacteria","Not stated","Not stated","Not stated","Acute ","Not stated","N.A.","Bonnet, J. L., Bonnemoy, F., Dusser, M. & Bohatier, J. 2007. Assessment of the Potential Toxicity of Herbicides and Their Degradation Products to Nontarget Cells Using Two Microorganisms, the Bacteria Vibrio fischeri and the Ciliate Tetrahymena pyriformis, vol. 22, pp. 78 - 91.","944","Do Not Use - Use the QCQC'd version of this entry below"]
["Freshwater/non-metal/plant","965-1",58,0.65909090909090906,null,"Saccharina japonica","Thalli","15 days","LOEC","Growth Rate: Area","0.00625 mg/L","Macroalgae","Ochrophyta","Artificial seawater","Not stated","Not stated","Chronic",8.4,"N.A.","Kumar, K. S., Choo, K., Yea, S. S., Seo, Y. & Han, T. 2010. Effects of the Phenylurea Herbicide Diuron on the Physiology of Saccharina japonica Aresch, Toxicology and Environmental Health Sciences, vol. 2, pp. 188 - 199.","965","Yes"]
["Freshwater/non-metal/plant","965-2",58,0.65909090909090906,null,"Saccharina japonica","Thalli","15 days","LOEC","Growth rate: Fresh weight","0.025 mg/L","Macroalgae","Ochrophyta","Artificial seawater","Not stated","Not stated","Chronic",8.4,"N.A.","Kumar, K. S., Choo, K., Yea, S. S., Seo, Y. & Han, T. 2010. Effects of the Phenylurea Herbicide Diuron on the Physiology of Saccharina japonica Aresch, Toxicology and Environmental Health Sciences, vol. 2, pp. 188 - 199.","965","Yes"]
["Freshwater/non-metal/plant","965-3",68,0.77272727272727271,null,"Saccharina japonica","Thalli","15 days","EC10","Growth rate: Fresh weight","0.0023 mg/L","Macroalgae","Ochrophyta","Artificial seawater","Not stated","Not stated","Chronic",8.4,"N.A.","Kumar, K. S., Choo, K., Yea, S. S., Seo, Y. & Han, T. 2010. Effects of the Phenylurea Herbicide Diuron on the Physiology of Saccharina japonica Aresch, Toxicology and Environmental Health Sciences, vol. 2, pp. 188 - 199.","965","Yes"]
["Freshwater/non-metal/plant","965-4",68,0.77272727272727271,null,"Saccharina japonica","Thalli","15 days","EC50","Growth rate: Fresh weight","0.0878 mg/L","Macroalgae","Ochrophyta","Artificial seawater","Not stated","Not stated","Chronic",8.4,"N.A.","Kumar, K. S., Choo, K., Yea, S. S., Seo, Y. & Han, T. 2010. Effects of the Phenylurea Herbicide Diuron on the Physiology of Saccharina japonica Aresch, Toxicology and Environmental Health Sciences, vol. 2, pp. 188 - 199.","965","Yes"]
["Freshwater/non-metal/plant","965-5",68,0.77272727272727271,null,"Saccharina japonica","Thalli","15 days","EC10","Growth Rate: Area","0.0039 mg/L","Macroalgae","Ochrophyta","Artificial seawater","Not stated","Not stated","Chronic",8.4,"N.A.","Kumar, K. S., Choo, K., Yea, S. S., Seo, Y. & Han, T. 2010. Effects of the Phenylurea Herbicide Diuron on the Physiology of Saccharina japonica Aresch, Toxicology and Environmental Health Sciences, vol. 2, pp. 188 - 199.","965","Yes"]
["Freshwater/non-metal/plant","965-6",68,0.77272727272727271,null,"Saccharina japonica","Thalli","15 days","EC50","Growth Rate: Area",">0.04 mg/L","Macroalgae","Ochrophyta","Artificial seawater","Not stated","Not stated","Chronic",8.4,"N.A.","Kumar, K. S., Choo, K., Yea, S. S., Seo, Y. & Han, T. 2010. Effects of the Phenylurea Herbicide Diuron on the Physiology of Saccharina japonica Aresch, Toxicology and Environmental Health Sciences, vol. 2, pp. 188 - 199.","965","Yes"]
["Freshwater/non-metal/plant","965-7",68,0.77272727272727271,null,"Saccharina japonica","Thalli","15 days","EC60.37","Growth Rate: Area","0.4 mg/L","Macroalgae","Ochrophyta","Artificial seawater","Not stated","Not stated","Chronic",8.4,"N.A.","Kumar, K. S., Choo, K., Yea, S. S., Seo, Y. & Han, T. 2010. Effects of the Phenylurea Herbicide Diuron on the Physiology of Saccharina japonica Aresch, Toxicology and Environmental Health Sciences, vol. 2, pp. 188 - 199.","965","Yes"]
[]
["MEW_plant","946-1",68,0.74725274725274726,null,"Dunaliaella tertiolecta","Log growth phase","96 hour","EC50","Population: Growth Rate (Cell counts)","9.2 ug/L","Microalga","Chlorophyta","Chlorophyceae","Marinewater","25°C","Chronic","Not stated","20 ppt","DeLorenzo, M. E., Danese, L. E. & Baird, T. D. 2011. Influence of Increasing Temperature and Salinity on Herbicide Toxicity in Estuarine Phytoplankton, Wiley Periodicals, pp. 359 - 371.","946","Yes"]
["MEW_plant","946-3",63,0.69230769230769229,null,"Dunaliaella tertiolecta","Log growth phase","96 hour","LOEC","Population: Growth Rate (Cell counts)","3.8 ug/L","Microalga","Chlorophyta","Chlorophyceae","Marinewater","25°C","Chronic","Not stated","20 ppt","DeLorenzo, M. E., Danese, L. E. & Baird, T. D. 2011. Influence of Increasing Temperature and Salinity on Herbicide Toxicity in Estuarine Phytoplankton, Wiley Periodicals, pp. 359 - 371.","946","Yes"]
["MEW_nonplant","958-1",44,0.46808510638297873,null,"Crassostrea gigas","Embryo","24 hour","LC10","Mortality",">1000 ug/L","Macroinvertebrate","Mollusca ","Bivalvia","Daigo's Artificial Seawater","25°C","Acute","Not stated","Not stated","Tsunemasa, N. & Okamura, H. 2011. Effects of Organotin Alternative Antifoulants on Oyster Embryo, Archives of Environmental Contamination and Toxicology, vol. 61, pp. 128 - 134.","958","Do Not Use - Failed QAQC"]
["Freshwater/non-metal/plant","944-5-OK",54,0.61363636363636365,null,"Vibrio fischeri","Not stated","30 minutes","EC50","Growth Rate (Fluorescence)","58.07 mg/L","Microalga","Proteobacteria","Not stated","28 C","28 C","Acute ","Not stated","N.A.","Bonnet, J. L., Bonnemoy, F., Dusser, M. & Bohatier, J. 2007. Assessment of the Potential Toxicity of Herbicides and Their Degradation Products to Nontarget Cells Using Two Microorganisms, the Bacteria Vibrio fischeri and the Ciliate Tetrahymena pyriformis, vol. 22, pp. 78 - 91.","944","Yes"]
["Freshwater/non-metal/plant","944-4-OK",54,0.61363636363636365,null,"Vibrio fischeri","Not stated","15 minutes","EC50","Growth Rate (Fluorescence)","66.87 mg/L","Microalga","Proteobacteria","Not stated","28 C","28 C","Acute ","Not stated","N.A.","Bonnet, J. L., Bonnemoy, F., Dusser, M. & Bohatier, J. 2007. Assessment of the Potential Toxicity of Herbicides and Their Degradation Products to Nontarget Cells Using Two Microorganisms, the Bacteria Vibrio fischeri and the Ciliate Tetrahymena pyriformis, vol. 22, pp. 78 - 91.","944","Yes"]
["MEW_nonplant","954-1-OK",62,0.65957446808510634,null,"Pagrus auratus","Larvae (2 hrs old)","36 hour","NOEC","Hatching success","50 ug/L","Fish ","Chordata","Actinopterygii","Filtered seawater","24.5 C","Acute","Not stated","40 ppt","Gagnon, M. M. & Rawson, C. A. 2009. Diuron increases spinal deformity in early-life-stage pink snapper Pagrus auratus, Marine Pollution Bulletin, vol. 58, pp. 1078 - 1095. ","954","Yes"]
["MEW_nonplant","958-1-OK",55,0.58510638297872342,null,"Crassostrea gigas","Mature fertilised eggs","24 hour","LC10","Survival Rate",">1000 ug/L","Macroinvertebrate","Mollusca ","Bivalvia","Daigo's Artificial Seawater","25°C","Acute","Not stated","Not stated","Tsunemasa, N. & Okamura, H. 2011. Effects of Organotin Alternative Antifoulants on Oyster Embryo, Archives of Environmental Contamination and Toxicology, vol. 61, pp. 128 - 134.","958","Yes"]
["MEW_nonplant","958-1-RE",56,0.5957446808510638,null,"Crassostrea gigas","Mature fertilised eggs","24 hour","LC10","Survival Rate",">1000 ug/L","Macroinvertebrate","Mollusca ","Bivalvia","Daigo's Artificial Seawater","25°C","Acute","Not stated","Not stated","Tsunemasa, N. & Okamura, H. 2011. Effects of Organotin Alternative Antifoulants on Oyster Embryo, Archives of Environmental Contamination and Toxicology, vol. 61, pp. 128 - 134.","958","Yes"]
["MEW_nonplant","958-2-RE",56,0.5957446808510638,null,"Crassostrea gigas","Mature fertilised eggs","48 hour","LC10","Survival Rate",">1000 ug/L","Macroinvertebrate","Mollusca ","Bivalvia","Daigo's Artificial Seawater","25°C","Acute","Not stated","Not stated","Tsunemasa, N. & Okamura, H. 2011. Effects of Organotin Alternative Antifoulants on Oyster Embryo, Archives of Environmental Contamination and Toxicology, vol. 61, pp. 128 - 134.","958","Yes"]
["MEW_nonplant","958-3-RE",56,0.5957446808510638,null,"Crassostrea gigas","Mature fertilised eggs","24 hour","LC50","Survival Rate",">1000 ug/L","Macroinvertebrate","Mollusca ","Bivalvia","Daigo's Artificial Seawater","25°C","Acute","Not stated","Not stated","Tsunemasa, N. & Okamura, H. 2011. Effects of Organotin Alternative Antifoulants on Oyster Embryo, Archives of Environmental Contamination and Toxicology, vol. 61, pp. 128 - 134.","958","Yes"]
["MEW_nonplant","958-4-RE",56,0.5957446808510638,null,"Crassostrea gigas","Mature fertilised eggs","48 hour","LC50","Survival Rate",">1000 ug/L","Macroinvertebrate","Mollusca ","Bivalvia","Daigo's Artificial Seawater","25°C","Acute","Not stated","Not stated","Tsunemasa, N. & Okamura, H. 2011. Effects of Organotin Alternative Antifoulants on Oyster Embryo, Archives of Environmental Contamination and Toxicology, vol. 61, pp. 128 - 134.","958","Yes"]
["MEW_nonplant","954-1-RE",59,0.62765957446808507,null,"Pagrus auratus","<2.5 hour old eggs","36 hour","NOEC","Hatching success","50 ug/L","Fish","Chordata","Actinopterygii","Filtered sea water","24.5 C","Acute","Not stated","Not stated","Gagnon, M. M. & Rawson, C. A. 2009. Diuron increases spinal deformity in early-life-stage pink snapper Pagrus auratus, Marine Pollution Bulletin 58, 1078 - 1095. ","954","Yes"]
[]
["MEW_nonplant","954-1-OK",62,0.65957446808510634,null,"Pagrus auratus","Larvae (2 hrs old)","36 hour","NOEC","Hatching success","50 ug/L","Fish ","Chordata","Actinopterygii","Filtered seawater","24.5 C","Acute","Not stated","40 ppt","Gagnon, M. M. & Rawson, C. A. 2009. Diuron increases spinal deformity in early-life-stage pink snapper Pagrus auratus, Marine Pollution Bulletin, vol. 58, pp. 1078 - 1095. ","954","Yes"]
["MEW_nonplant","958-1-OK",55,0.58510638297872342,null,"Crassostrea gigas","Mature fertilised eggs","24 hour","LC10","Survival Rate",">1000 ug/L","Macroinvertebrate","Mollusca ","Bivalvia","Daigo's Artificial Seawater","25°C","Acute","Not stated","Not stated","Tsunemasa, N. & Okamura, H. 2011. Effects of Organotin Alternative Antifoulants on Oyster Embryo, Archives of Environmental Contamination and Toxicology, vol. 61, pp. 128 - 134.","958","Yes"]
["MEW_nonplant","958-1-RE",56,0.5957446808510638,null,"Crassostrea gigas","Mature fertilised eggs","24 hour","LC10","Survival Rate",">1000 ug/L","Macroinvertebrate","Mollusca ","Bivalvia","Daigo's Artificial Seawater","25°C","Acute","Not stated","Not stated","Tsunemasa, N. & Okamura, H. 2011. Effects of Organotin Alternative Antifoulants on Oyster Embryo, Archives of Environmental Contamination and Toxicology, vol. 61, pp. 128 - 134.","958","Yes"]
["MEW_nonplant","958-2-RE",56,0.5957446808510638,null,"Crassostrea gigas","Mature fertilised eggs","48 hour","LC10","Survival Rate",">1000 ug/L","Macroinvertebrate","Mollusca ","Bivalvia","Daigo's Artificial Seawater","25°C","Acute","Not stated","Not stated","Tsunemasa, N. & Okamura, H. 2011. Effects of Organotin Alternative Antifoulants on Oyster Embryo, Archives of Environmental Contamination and Toxicology, vol. 61, pp. 128 - 134.","958","Yes"]
["MEW_nonplant","958-3-RE",56,0.5957446808510638,null,"Crassostrea gigas","Mature fertilised eggs","24 hour","LC50","Survival Rate",">1000 ug/L","Macroinvertebrate","Mollusca ","Bivalvia","Daigo's Artificial Seawater","25°C","Acute","Not stated","Not stated","Tsunemasa, N. & Okamura, H. 2011. Effects of Organotin Alternative Antifoulants on Oyster Embryo, Archives of Environmental Contamination and Toxicology, vol. 61, pp. 128 - 134.","958","Yes"]
["MEW_nonplant","958-4-RE",56,0.5957446808510638,null,"Crassostrea gigas","Mature fertilised eggs","48 hour","LC50","Survival Rate",">1000 ug/L","Macroinvertebrate","Mollusca ","Bivalvia","Daigo's Artificial Seawater","25°C","Acute","Not stated","Not stated","Tsunemasa, N. & Okamura, H. 2011. Effects of Organotin Alternative Antifoulants on Oyster Embryo, Archives of Environmental Contamination and Toxicology, vol. 61, pp. 128 - 134.","958","Yes"]
["MEW_nonplant","954-1-RE",59,0.62765957446808507,null,"Pagrus auratus","<2.5 hour old eggs","36 hour","NOEC","Hatching success","50 ug/L","Fish","Chordata","Actinopterygii","Filtered sea water","24.5 C","Acute","Not stated","Not stated","Gagnon, M. M. & Rawson, C. A. 2009. Diuron increases spinal deformity in early-life-stage pink snapper Pagrus auratus, Marine Pollution Bulletin 58, 1078 - 1095. ","954","Yes"]
[]
[]
["MEW_plant","679-1",65,0.7142857142857143,null,"Acropora tenuis","Mature colonies","53 days","NOEC","Reproduction: Polyp fercundity","8.8 ug/L","Coral","Cnidaria","Anthozoa","Unfiltered oceanic seawater","26-29°C","Chronic","Not stated","Not stated","Cantin,N.E., A.P. Negri, and B.L. Willis (2007). Photoinhibition from Chronic Herbicide Exposure Reduces Reproductive Output of Reef-Building Corals, Mar. Ecol. Prog. Ser.344:81-93.","679","Do Not Use - Failed QAQC acceptability criteria = cannot be used"]
["MEW_plant","679-2",65,0.7142857142857143,null,"Acropora tenuis","Mature colonies","53 days","NOEC","Reproduction: Egg size","8.8 ug/L","Coral","Cnidaria","Anthozoa","Unfiltered oceanic seawater","26-29°C","Chronic","Not stated","Not stated","Cantin,N.E., A.P. Negri, and B.L. Willis (2007). Photoinhibition from Chronic Herbicide Exposure Reduces Reproductive Output of Reef-Building Corals, Mar. Ecol. Prog. Ser.344:81-93.","679","Do Not Use - Failed QAQC acceptability criteria = cannot be used"]
["MEW_plant","679-3",65,0.7142857142857143,null,"Acropora tenuis","Mature colonies","53 days","NOEC","Mortality","8.8 ug/L","Coral","Cnidaria","Anthozoa","Unfiltered oceanic seawater","26-29°C","Chronic","Not stated","Not stated","Cantin,N.E., A.P. Negri, and B.L. Willis (2007). Photoinhibition from Chronic Herbicide Exposure Reduces Reproductive Output of Reef-Building Corals, Mar. Ecol. Prog. Ser.344:81-93.","679","Do Not Use - Failed QAQC acceptability criteria = cannot be used"]
["MEW_plant","679-4",63,0.69230769230769229,null,"Acropora valida","Mature colonies","90 days","LOEC","Reproduction: Polyp fercundity","10 ug/L","Coral","Cnidaria","Anthozoa","Unfiltered oceanic seawater","26-29°C","Chronic","Not stated","Not stated","Cantin,N.E., A.P. Negri, and B.L. Willis (2007). Photoinhibition from Chronic Herbicide Exposure Reduces Reproductive Output of Reef-Building Corals, Mar. Ecol. Prog. Ser.344:81-93.","679","Do Not Use - Failed QAQC acceptability criteria = cannot be used"]
["MEW_plant","679-5",63,0.69230769230769229,null,"Acropora valida","Mature colonies","90 days","NOEC","Reproduction: Polyp fercundity","1 ug/L","Coral","Cnidaria","Anthozoa","Unfiltered oceanic seawater","26-29°C","Chronic","Not stated","Not stated","Cantin,N.E., A.P. Negri, and B.L. Willis (2007). Photoinhibition from Chronic Herbicide Exposure Reduces Reproductive Output of Reef-Building Corals, Mar. Ecol. Prog. Ser.344:81-93.","679","Do Not Use - Failed QAQC acceptability criteria = cannot be used"]
["MEW_plant","679-6",63,0.69230769230769229,null,"Acropora valida","Mature colonies","90 days","NOEC","Reproduction: Egg size","1 ug/L","Coral","Cnidaria","Anthozoa","Unfiltered oceanic seawater","26-29°C","Chronic","Not stated","Not stated","Cantin,N.E., A.P. Negri, and B.L. Willis (2007). Photoinhibition from Chronic Herbicide Exposure Reduces Reproductive Output of Reef-Building Corals, Mar. Ecol. Prog. Ser.344:81-93.","679","Do Not Use - Failed QAQC acceptability criteria = cannot be used"]
["MEW_plant","679-7",63,0.69230769230769229,null,"Pocillopora damicornis","Reproductively mature colonies","67 days","NOEC","Reproduction: Egg size","1 ug/L","Coral","Cnidaria","Anthozoa","Unfiltered oceanic seawater","26-29°C","Chronic","Not stated","Not stated","Cantin,N.E., A.P. Negri, and B.L. Willis (2007). Photoinhibition from Chronic Herbicide Exposure Reduces Reproductive Output of Reef-Building Corals, Mar. Ecol. Prog. Ser.344:81-93.","679","Do Not Use - Failed QAQC acceptability criteria = cannot be used"]
["Freshwater/non-metal/non- plant","655-1",66,0.72527472527472525,null,"Oncorhynchus mykiss","Juveniles (<24 hours after hatching)","7 days","LC50","Mortality","74 mg/L","Fish","Chordata","Actinopterygii","Dechlorinated tap water","20°C","Acute ","Not measured","N.A.","Okamura,H., T. Watanabe, I. Aoyama, and M. Hasobe (2002). Toxicity Evaluation of New Antifouling Compounds Using Suspension-Cultured Fish Cells, Chemosphere 46(7): 945-951.","655","Yes"]
["Freshwater/non-metal/non- plant","655-2",66,0.72527472527472525,null,"Oncorhynchus mykiss","Juveniles (<24 hours after hatching)","14 days","LC50","Mortality","15 mg/L","Fish","Chordata","Actinopterygii","Dechlorinated tap water","20°C","Acute ","Not measured","N.A.","Okamura,H., T. Watanabe, I. Aoyama, and M. Hasobe (2002). Toxicity Evaluation of New Antifouling Compounds Using Suspension-Cultured Fish Cells, Chemosphere 46(7): 945-951.","655","Yes"]
["Freshwater/non-metal/non- plant","655-3",66,0.72527472527472525,null,"Oncorhynchus mykiss","Juveniles (<24 hours after hatching)","21 days","LC50","Mortality","5.9 mg/L","Fish","Chordata","Actinopterygii","Dechlorinated tap water","20°C","Chronic","Not measured","N.A.","Okamura,H., T. Watanabe, I. Aoyama, and M. Hasobe (2002). Toxicity Evaluation of New Antifouling Compounds Using Suspension-Cultured Fish Cells, Chemosphere 46(7): 945-951.","655","Yes"]
["Freshwater/non-metal/non- plant","655-4",66,0.72527472527472525,null,"Oncorhynchus mykiss","Juveniles (<24 hours after hatching)","28 days","LC50","Mortality","0.23 mg/L","Fish","Chordata","Actinopterygii","Dechlorinated tap water","20°C","Chronic","Not measured","N.A.","Okamura,H., T. Watanabe, I. Aoyama, and M. Hasobe (2002). Toxicity Evaluation of New Antifouling Compounds Using Suspension-Cultured Fish Cells, Chemosphere 46(7): 945-951.","655","Yes"]
["Freshwater/non-metal/non- plant","653-1",76,0.8351648351648352,null,"Daphnia magna","Adults (5 days old)","7 days","NOAEL","Mortality: Survival","4.0 mg/L","Microinvertebrate","Arthropoda","Branchiopoda","0.45 um filtered well water","Not stated","Chronic","6.9 ± 0.1","N.A.","Nebeker,A.V., and G.S. Schuytema (1998). Chronic Effects of the Herbicide Diuron on Freshwater Cladocerans, Amphipods, Midges, Minnows, Worms, and Snails, Arch. Environ. Contam. Toxicol.35(3): 441-446.","653","Yes"]
["Freshwater/non-metal/non- plant","653-2",76,0.8351648351648352,null,"Daphnia magna","Adults (5 days old)","7 days","LOAEL","Mortality: Survival","7.7 mg/L","Microinvertebrate","Arthropoda","Branchiopoda","0.45 um filtered well water","Not stated","Chronic","6.9 ± 0.1","N.A.","Nebeker,A.V., and G.S. Schuytema (1998). Chronic Effects of the Herbicide Diuron on Freshwater Cladocerans, Amphipods, Midges, Minnows, Worms, and Snails, Arch. Environ. Contam. Toxicol.35(3): 441-446.","653","Yes"]
["Freshwater/non-metal/non- plant","653-3",76,0.8351648351648352,"","Daphnia magna","Adults (5 days old)","7 days","NOAEL","Reproduction: Number of young produced","4.0 mg/L","Microinvertebrate","Arthropoda","Branchiopoda","0.45 um filtered well water","Not stated","Chronic","6.9 ± 0.1","N.A.","Nebeker,A.V., and G.S. Schuytema (1998). Chronic Effects of the Herbicide Diuron on Freshwater Cladocerans, Amphipods, Midges, Minnows, Worms, and Snails, Arch. Environ. Contam. Toxicol.35(3): 441-446.","653","Yes"]
["Freshwater/non-metal/non- plant","653-4",76,0.8351648351648352,"","Daphnia magna","Adults (5 days old)","7 days","LOAEL","Reproduction: Number of young produced","7.7 mg/L","Microinvertebrate","Arthropoda","Branchiopoda","0.45 um filtered well water","Not stated","Chronic","6.9 ± 0.1","N.A.","Nebeker,A.V., and G.S. Schuytema (1998). Chronic Effects of the Herbicide Diuron on Freshwater Cladocerans, Amphipods, Midges, Minnows, Worms, and Snails, Arch. Environ. Contam. Toxicol.35(3): 441-446.","653","Yes"]
["Freshwater/non-metal/non- plant","653-5",76,0.8351648351648352,"","Daphnia magna","Adults (5 days old)","7 days","LC50","Mortality: Survival","7.1 mg/L","Microinvertebrate","Arthropoda","Branchiopoda","0.45 um filtered well water","Not stated","Chronic","6.9 ± 0.1","N.A.","Nebeker,A.V., and G.S. Schuytema (1998). Chronic Effects of the Herbicide Diuron on Freshwater Cladocerans, Amphipods, Midges, Minnows, Worms, and Snails, Arch. Environ. Contam. Toxicol.35(3): 441-446.","653","Yes"]
["Freshwater/non-metal/non- plant","653-6",76,0.8351648351648352,"","Daphnia magna","Adults (5 days old)","96 hour","LC50","Mortality: Survival","17.9 mg/L","Microinvertebrate","Arthropoda","Branchiopoda","0.45 um filtered well water","Not stated","Acute ","6.9 ± 0.1","N.A.","Nebeker,A.V., and G.S. Schuytema (1998). Chronic Effects of the Herbicide Diuron on Freshwater Cladocerans, Amphipods, Midges, Minnows, Worms, and Snails, Arch. Environ. Contam. Toxicol.35(3): 441-446.","653","Yes"]
["Freshwater/non-metal/non- plant","653-7",77,0.84615384615384615,"","Hyalella azteca","2 day old young","10 days","NOAEL","Mortality: Survival","7.9 mg/L","Macroinvertebrate","Arthropoda","Malacostraca","0.45 um filtered well water","22 C","Acute ","6.9 ± 0.1","N.A.","Nebeker,A.V., and G.S. Schuytema (1998). Chronic Effects of the Herbicide Diuron on Freshwater Cladocerans, Amphipods, Midges, Minnows, Worms, and Snails, Arch. Environ. Contam. Toxicol.35(3): 441-446.","653","Yes"]
["Freshwater/non-metal/non- plant","653-8",77,0.84615384615384615,"","Hyalella azteca","2 day old young","10 days","LOAEL","Mortality: Survival","15.7 mg/L","Macroinvertebrate","Arthropoda","Malacostraca","0.45 um filtered well water","22 C","Acute ","6.9 ± 0.1","N.A.","Nebeker,A.V., and G.S. Schuytema (1998). Chronic Effects of the Herbicide Diuron on Freshwater Cladocerans, Amphipods, Midges, Minnows, Worms, and Snails, Arch. Environ. Contam. Toxicol.35(3): 441-446.","653","Yes"]
["Freshwater/non-metal/non- plant","653-9",82,0.90109890109890112,"","Hyalella azteca","2 day old young","10 days","NOAEL","Growth: Length","22.9 mg/L","Macroinvertebrate","Arthropoda","Malacostraca","0.45 um filtered well water","22 C","Acute ","6.9 ± 0.1","N.A.","Nebeker,A.V., and G.S. Schuytema (1998). Chronic Effects of the Herbicide Diuron on Freshwater Cladocerans, Amphipods, Midges, Minnows, Worms, and Snails, Arch. Environ. Contam. Toxicol.35(3): 441-446.","653","Yes"]
["Freshwater/non-metal/non- plant","653-10",82,0.90109890109890112,"","Hyalella azteca","2 day old young","10 days","NOAEL","Growth: Blotted wet weight","22.9 mg/L","Macroinvertebrate","Arthropoda","Malacostraca","0.45 um filtered well water","22 C","Acute ","6.9 ± 0.1","N.A.","Nebeker,A.V., and G.S. Schuytema (1998). Chronic Effects of the Herbicide Diuron on Freshwater Cladocerans, Amphipods, Midges, Minnows, Worms, and Snails, Arch. Environ. Contam. Toxicol.35(3): 441-446.","653","Yes"]
["Freshwater/non-metal/non- plant","653-11",77,0.84615384615384615,"","Hyalella azteca","2 day old young","10 days","LC50","Mortality: Survival","18.4 mg/L","Macroinvertebrate","Arthropoda","Malacostraca","0.45 um filtered well water","22 C","Acute ","6.9 ± 0.1","N.A.","Nebeker,A.V., and G.S. Schuytema (1998). Chronic Effects of the Herbicide Diuron on Freshwater Cladocerans, Amphipods, Midges, Minnows, Worms, and Snails, Arch. Environ. Contam. Toxicol.35(3): 441-446.","653","Yes"]
["Freshwater/non-metal/non- plant","653-12",77,0.84615384615384615,"","Hyalella azteca","2 day old young","96 hour","LC50","Mortality: Survival","19.4 mg/L","Macroinvertebrate","Arthropoda","Malacostraca","0.45 um filtered well water","22 C","Acute ","6.9 ± 0.1","N.A.","Nebeker,A.V., and G.S. Schuytema (1998). Chronic Effects of the Herbicide Diuron on Freshwater Cladocerans, Amphipods, Midges, Minnows, Worms, and Snails, Arch. Environ. Contam. Toxicol.35(3): 441-446.","653","Yes"]
["Freshwater/non-metal/non- plant","653-13",77,0.84615384615384615,"","Chironomus tentans","1st instar larvae (2 days old)","10 days","NOAEL","Mortality: Survival","1.9 mg/L","Macroinvertebrate","Arthropoda","Insecta","0.45 um filtered well water","24 C","Acute ","6.9 ± 0.1","N.A.","Nebeker,A.V., and G.S. Schuytema (1998). Chronic Effects of the Herbicide Diuron on Freshwater Cladocerans, Amphipods, Midges, Minnows, Worms, and Snails, Arch. Environ. Contam. Toxicol.35(3): 441-446.","653","Yes"]
["Freshwater/non-metal/non- plant","653-14",77,0.84615384615384615,"","Chironomus tentans","1st instar larvae (2 days old)","10 days","LOAEL","Mortality: Survival","3.4 mg/L","Macroinvertebrate","Arthropoda","Insecta","0.45 um filtered well water","24 C","Acute ","6.9 ± 0.1","N.A.","Nebeker,A.V., and G.S. Schuytema (1998). Chronic Effects of the Herbicide Diuron on Freshwater Cladocerans, Amphipods, Midges, Minnows, Worms, and Snails, Arch. Environ. Contam. Toxicol.35(3): 441-446.","653","Yes"]
["Freshwater/non-metal/non- plant","653-15",77,0.84615384615384615,"","Chironomus tentans","1st instar larvae (2 days old)","10 days","NOAEL","Growth. Larval weight","3.4 mg/L","Macroinvertebrate","Arthropoda","Insecta","0.45 um filtered well water","24 C","Acute ","6.9 ± 0.1","N.A.","Nebeker,A.V., and G.S. Schuytema (1998). Chronic Effects of the Herbicide Diuron on Freshwater Cladocerans, Amphipods, Midges, Minnows, Worms, and Snails, Arch. Environ. Contam. Toxicol.35(3): 441-446.","653","Yes"]
["Freshwater/non-metal/non- plant","653-16",77,0.84615384615384615,"","Chironomus tentans","1st instar larvae (2 days old)","10 days","LC50","Mortality: Survival","3.3 mg/L","Macroinvertebrate","Arthropoda","Insecta","0.45 um filtered well water","24 C","Acute ","6.9 ± 0.1","N.A.","Nebeker,A.V., and G.S. Schuytema (1998). Chronic Effects of the Herbicide Diuron on Freshwater Cladocerans, Amphipods, Midges, Minnows, Worms, and Snails, Arch. Environ. Contam. Toxicol.35(3): 441-446.","653","Yes"]
["Freshwater/non-metal/non- plant","653-17",76,0.8351648351648352,"","Pimephales promelas","Juveniles (1.5 months)","10 days","NOAEL","Mortality: Survival","20 mg/L","Fish","Chordata","Actinopterygii","0.45 um filtered well water","24 C","Acute ","6.8 ± 0.1","N.A.","Nebeker,A.V., and G.S. Schuytema (1998). Chronic Effects of the Herbicide Diuron on Freshwater Cladocerans, Amphipods, Midges, Minnows, Worms, and Snails, Arch. Environ. Contam. Toxicol.35(3): 441-446.","653","Yes"]
["Freshwater/non-metal/non- plant","653-18",76,0.8351648351648352,"","Pimephales promelas","Juveniles (1.5 months)","10 days","LOAEL","Mortality: Survival","27.1 mg/L","Fish","Chordata","Actinopterygii","0.45 um filtered well water","24 C","Acute ","6.8 ± 0.1","N.A.","Nebeker,A.V., and G.S. Schuytema (1998). Chronic Effects of the Herbicide Diuron on Freshwater Cladocerans, Amphipods, Midges, Minnows, Worms, and Snails, Arch. Environ. Contam. Toxicol.35(3): 441-446.","653","Yes"]
["Freshwater/non-metal/non- plant","653-19",76,0.8351648351648352,"","Pimephales promelas","Juveniles (1.5 months)","10 days","NOAEL","Growth: Weight","<3.4 mg/L","Fish","Chordata","Actinopterygii","0.45 um filtered well water","24 C","Acute ","6.8 ± 0.1","N.A.","Nebeker,A.V., and G.S. Schuytema (1998). Chronic Effects of the Herbicide Diuron on Freshwater Cladocerans, Amphipods, Midges, Minnows, Worms, and Snails, Arch. Environ. Contam. Toxicol.35(3): 441-446.","653","Yes"]
["Freshwater/non-metal/non- plant","653-20",76,0.8351648351648352,"","Pimephales promelas","Juveniles (1.5 months)","10 days","LOAEL","Growth: Weight","3.4 mg/L","Fish","Chordata","Actinopterygii","0.45 um filtered well water","24 C","Acute ","6.8 ± 0.1","N.A.","Nebeker,A.V., and G.S. Schuytema (1998). Chronic Effects of the Herbicide Diuron on Freshwater Cladocerans, Amphipods, Midges, Minnows, Worms, and Snails, Arch. Environ. Contam. Toxicol.35(3): 441-446.","653","Yes"]
["Freshwater/non-metal/non- plant","653-21",76,0.8351648351648352,"","Pimephales promelas","Juveniles (1.5 months)","10 days","NOAEL","Growth: Length","<3.4 mg/L","Fish","Chordata","Actinopterygii","0.45 um filtered well water","24 C","Acute ","6.8 ± 0.1","N.A.","Nebeker,A.V., and G.S. Schuytema (1998). Chronic Effects of the Herbicide Diuron on Freshwater Cladocerans, Amphipods, Midges, Minnows, Worms, and Snails, Arch. Environ. Contam. Toxicol.35(3): 441-446.","653","Yes"]
["Freshwater/non-metal/non- plant","653-22",76,0.8351648351648352,"","Pimephales promelas","Juveniles (1.5 months)","10 days","LOAEL","Growth: Length","3.4 mg/L","Fish","Chordata","Actinopterygii","0.45 um filtered well water","24 C","Acute ","6.8 ± 0.1","N.A.","Nebeker,A.V., and G.S. Schuytema (1998). Chronic Effects of the Herbicide Diuron on Freshwater Cladocerans, Amphipods, Midges, Minnows, Worms, and Snails, Arch. Environ. Contam. Toxicol.35(3): 441-446.","653","Yes"]
["Freshwater/non-metal/non- plant","653-23",76,0.8351648351648352,"","Pimephales promelas","Juveniles (1.5 months)","10 days","LC50","Mortality: Survival","27.1 mg/L","Fish","Chordata","Actinopterygii","0.45 um filtered well water","24 C","Acute ","6.8 ± 0.1","N.A.","Nebeker,A.V., and G.S. Schuytema (1998). Chronic Effects of the Herbicide Diuron on Freshwater Cladocerans, Amphipods, Midges, Minnows, Worms, and Snails, Arch. Environ. Contam. Toxicol.35(3): 441-446.","653","Yes"]
["Freshwater/non-metal/non- plant","653-24",72,0.79120879120879117,"","Pimephales promelas","Embryo/larval","7 days","NOAEL","Mortality: Survival","8.3 mg/L","Fish","Chordata","Actinopterygii","0.45 um filtered well water","24 C","Acute ","6.8 ± 0.1","N.A.","Nebeker,A.V., and G.S. Schuytema (1998). Chronic Effects of the Herbicide Diuron on Freshwater Cladocerans, Amphipods, Midges, Minnows, Worms, and Snails, Arch. Environ. Contam. Toxicol.35(3): 441-446.","653","Yes"]
["Freshwater/non-metal/non- plant","653-25",72,0.79120879120879117,"","Pimephales promelas","Embryo/larval","7 days","LOAEL","Mortality: Survival","15.1 mg/L","Fish","Chordata","Actinopterygii","0.45 um filtered well water","24 C","Acute ","6.8 ± 0.1","N.A.","Nebeker,A.V., and G.S. Schuytema (1998). Chronic Effects of the Herbicide Diuron on Freshwater Cladocerans, Amphipods, Midges, Minnows, Worms, and Snails, Arch. Environ. Contam. Toxicol.35(3): 441-446.","653","Yes"]
["Freshwater/non-metal/non- plant","653-26",72,0.79120879120879117,"","Pimephales promelas","Embryo/larval","7 days","NOAEL","Reproduction: Number of eggs hatched","31.2 mg/L","Fish","Chordata","Actinopterygii","0.45 um filtered well water","24 C","Acute ","6.8 ± 0.1","N.A.","Nebeker,A.V., and G.S. Schuytema (1998). Chronic Effects of the Herbicide Diuron on Freshwater Cladocerans, Amphipods, Midges, Minnows, Worms, and Snails, Arch. Environ. Contam. Toxicol.35(3): 441-446.","653","Yes"]
["Freshwater/non-metal/non- plant","653-27",77,0.84615384615384615,"","Pimephales promelas","Embryo/larval","7 days","NOAEL","Growth: Blotted wet weight","15.1 mg/L","Fish","Chordata","Actinopterygii","0.45 um filtered well water","24 C","Acute ","6.8 ± 0.1","N.A.","Nebeker,A.V., and G.S. Schuytema (1998). Chronic Effects of the Herbicide Diuron on Freshwater Cladocerans, Amphipods, Midges, Minnows, Worms, and Snails, Arch. Environ. Contam. Toxicol.35(3): 441-446.","653","Yes"]
["Freshwater/non-metal/non- plant","653-28",77,0.84615384615384615,"","Pimephales promelas","Embryo/larval","7 days","NOAEL","Growth: Length","4.2 mg/L","Fish","Chordata","Actinopterygii","0.45 um filtered well water","24 C","Acute ","6.8 ± 0.1","N.A.","Nebeker,A.V., and G.S. Schuytema (1998). Chronic Effects of the Herbicide Diuron on Freshwater Cladocerans, Amphipods, Midges, Minnows, Worms, and Snails, Arch. Environ. Contam. Toxicol.35(3): 441-446.","653","Yes"]
["Freshwater/non-metal/non- plant","653-29",77,0.84615384615384615,"","Pimephales promelas","Embryo/larval","7 days","LOAEL","Growth: Length","8.3 mg/L","Fish","Chordata","Actinopterygii","0.45 um filtered well water","24 C","Acute ","6.8 ± 0.1","N.A.","Nebeker,A.V., and G.S. Schuytema (1998). Chronic Effects of the Herbicide Diuron on Freshwater Cladocerans, Amphipods, Midges, Minnows, Worms, and Snails, Arch. Environ. Contam. Toxicol.35(3): 441-446.","653","Yes"]
["Freshwater/non-metal/non- plant","653-30",77,0.84615384615384615,"","Pimephales promelas","Embryo/larval","7 days","LC50","Mortality: Survival","11.7 mg/L","Fish","Chordata","Actinopterygii","0.45 um filtered well water","24 C","Acute ","6.8 ± 0.1","N.A.","Nebeker,A.V., and G.S. Schuytema (1998). Chronic Effects of the Herbicide Diuron on Freshwater Cladocerans, Amphipods, Midges, Minnows, Worms, and Snails, Arch. Environ. Contam. Toxicol.35(3): 441-446.","653","Yes"]
["Freshwater/non-metal/non- plant","653-31",77,0.84615384615384615,"","Lumbriculus variegatus","Adults","10 days","NOAEL","Mortality: Survival","29.1 mg/L","Macroinvertebrate","Annelida","Clitellata","0.45 um filtered well water","23 C","Acute ","6.8 ± 0.1","N.A.","Nebeker,A.V., and G.S. Schuytema (1998). Chronic Effects of the Herbicide Diuron on Freshwater Cladocerans, Amphipods, Midges, Minnows, Worms, and Snails, Arch. Environ. Contam. Toxicol.35(3): 441-446.","653","Yes"]
["Freshwater/non-metal/non- plant","653-32",77,0.84615384615384615,"","Lumbriculus variegatus","Adults","10 days","NOAEL","Growth: Blotted wet weight","1.8 mg/L","Macroinvertebrate","Annelida","Clitellata","0.45 um filtered well water","23 C","Acute ","6.8 ± 0.1","N.A.","Nebeker,A.V., and G.S. Schuytema (1998). Chronic Effects of the Herbicide Diuron on Freshwater Cladocerans, Amphipods, Midges, Minnows, Worms, and Snails, Arch. Environ. Contam. Toxicol.35(3): 441-446.","653","Yes"]
["Freshwater/non-metal/non- plant","653-33",77,0.84615384615384615,"","Lumbriculus variegatus","Adults","10 days","LOAEL","Growth: Blotted wet weight","3.5 mg/L","Macroinvertebrate","Annelida","Clitellata","0.45 um filtered well water","23 C","Acute ","6.8 ± 0.1","N.A.","Nebeker,A.V., and G.S. Schuytema (1998). Chronic Effects of the Herbicide Diuron on Freshwater Cladocerans, Amphipods, Midges, Minnows, Worms, and Snails, Arch. Environ. Contam. Toxicol.35(3): 441-446.","653","Yes"]
["Freshwater/non-metal/non- plant","653-34",72,0.79120879120879117,"","Physa gyrina","15 day old young","10 days","NOAEL","Mortality: Survival","29.1 mg/L","Macroinvertebrate","Mollusca","Gastropoda","0.45 um filtered well water","23 C","Acute ","6.8 ± 0.1","N.A.","Nebeker,A.V., and G.S. Schuytema (1998). Chronic Effects of the Herbicide Diuron on Freshwater Cladocerans, Amphipods, Midges, Minnows, Worms, and Snails, Arch. Environ. Contam. Toxicol.35(3): 441-446.","653","Yes"]
["Freshwater/non-metal/non- plant","653-35",72,0.79120879120879117,"","Physa gyrina","15 day old young","10 days","NOAEL","Growth: Blotted wet weight","13.4 mg/L","Macroinvertebrate","Mollusca","Gastropoda","0.45 um filtered well water","23 C","Acute ","6.8 ± 0.1","N.A.","Nebeker,A.V., and G.S. Schuytema (1998). Chronic Effects of the Herbicide Diuron on Freshwater Cladocerans, Amphipods, Midges, Minnows, Worms, and Snails, Arch. Environ. Contam. Toxicol.35(3): 441-446.","653","Yes"]
["Freshwater/non-metal/non- plant","653-36",72,0.79120879120879117,"","Physa gyrina","15 day old young","10 days","LOAEL","Growth: Blotted wet weight","22.8 mg/L","Macroinvertebrate","Mollusca","Gastropoda","0.45 um filtered well water","23 C","Acute ","6.8 ± 0.1","N.A.","Nebeker,A.V., and G.S. Schuytema (1998). Chronic Effects of the Herbicide Diuron on Freshwater Cladocerans, Amphipods, Midges, Minnows, Worms, and Snails, Arch. Environ. Contam. Toxicol.35(3): 441-446.","653","Yes"]
["Freshwater/non-metal/non- plant","650-1",76,0.8351648351648352,"","Paratya australiensis","Not stated","96 hour","LC50","Mortality","8800 ug/L","Macroinvertebrate","Arthropoda","Malacostraca","Not stated","23 ± 1","Acute ","7 - 8.5","N.A.","Kumar,A., R. Correll, S. Grocke, and C. Bajet (2010). Toxicity of Selected Pesticides to Freshwater Shrimp, Paratya australiensis (Decapoda: Atyidae): Use of Time Series Acute Toxicity Data to Predict Chronic Lethality, Ecotoxicol. Environ. Saf.73(3): 360-369.","650","Yes"]
["Freshwater/non-metal/non- plant","650-2",76,0.8351648351648352,"","Paratya australiensis","Not stated","96 hour","LC10","Mortality","4700 ug/L","Macroinvertebrate","Arthropoda","Malacostraca","Not stated","23 ± 1","Acute ","7 - 8.5","N.A.","Kumar,A., R. Correll, S. Grocke, and C. Bajet (2010). Toxicity of Selected Pesticides to Freshwater Shrimp, Paratya australiensis (Decapoda: Atyidae): Use of Time Series Acute Toxicity Data to Predict Chronic Lethality, Ecotoxicol. Environ. Saf.73(3): 360-369.","650","Yes"]
["Freshwater/non-metal/non- plant","650-3",68,0.74725274725274726,null,"Paratya australiensis","Not stated","96 hour","NOEC","Mortality","5000 ug/L","Macroinvertebrate","Arthropoda","Malacostraca","Not stated","23 ± 1","Acute ","7 - 8.5","N.A.","Kumar,A., R. Correll, S. Grocke, and C. Bajet (2010). Toxicity of Selected Pesticides to Freshwater Shrimp, Paratya australiensis (Decapoda: Atyidae): Use of Time Series Acute Toxicity Data to Predict Chronic Lethality, Ecotoxicol. Environ. Saf.73(3): 360-369.","650","Yes"]
["Freshwater/non-metal/plant","914-1",63,0.71590909090909094,null,"Selenastrum capricornutum","5 days old","96 hour","IC50","Growth: ChlA","0.05 uM","Microalga","Chlorophyta","Mineral culture medium, freshwater","21°C","21°C","Chronic","Not stated","N.A.","El Jay,A., J.M. Ducruet, J.C. Duval, and J.P. Pelletier, 1997. A High-Sensitivity Chlorophyll Fluorescence Assay for Monitoring Herbicide Inhibition of Photosystem II in the Chlorophyte Selenastrum capricornutum: Comparison with Effect on Cell Growth, Arch. Hydrobiol.140(2): 273-286. ","914","Do Not Use - Failed QAQC acceptability criteria = cannot be used"]
["Freshwater/non-metal/non- plant","993-1",67,0.73626373626373631,null,"Ceriodaphnia dubia","<24 hour old neonates","24 hour","EC50","Immobilisation","2300 ug/L","Microinvertebrate","Arthropoda","Branchiopoda","Soft diluted mineral water","25 ± 1 °C","Acute ","Not stated","N.A.","Foster,S., M. Thomas, and W. Korth (1998). Laboratory-Derived Acute Toxicity of Selected Pesticides to Ceriodaphnia dubia, Australas. J. Ecotoxicol.4(1): 53-59.","993","Do Not Use - Unknown purity"]
["Freshwater/non-metal/non- plant","993-2",67,0.73626373626373631,"","Ceriodaphnia dubia","<24 hour old neonates","48 hour","EC50","Immobilisation","1700 ug/L","Microinvertebrate","Arthropoda","Branchiopoda","Soft diluted mineral water","25 ± 1 °C","Acute ","Not stated","N.A.","Foster,S., M. Thomas, and W. Korth (1998). Laboratory-Derived Acute Toxicity of Selected Pesticides to Ceriodaphnia dubia, Australas. J. Ecotoxicol.4(1): 53-59.","993","Do Not Use - Unknown purity"]
["Freshwater/non-metal/non- plant","993-3",67,0.73626373626373631,"","Ceriodaphnia dubia","<24 hour old neonates","24 hour","EC50","Immobilisation","1200 ug/L","Microinvertebrate","Arthropoda","Branchiopoda","Supply water","25 ± 1 °C","Acute ","Not stated","N.A.","Foster,S., M. Thomas, and W. Korth (1998). Laboratory-Derived Acute Toxicity of Selected Pesticides to Ceriodaphnia dubia, Australas. J. Ecotoxicol.4(1): 53-59.","993","Do Not Use - Unknown purity"]
["Freshwater/non-metal/non- plant","993-4",67,0.73626373626373631,null,"Ceriodaphnia dubia","<24 hour old neonates","48 hour","EC50","Immobilisation","1000 ug/L","Microinvertebrate","Arthropoda","Branchiopoda","Supply water","25 ± 1 °C","Acute ","Not stated","N.A.","Foster,S., M. Thomas, and W. Korth (1998). Laboratory-Derived Acute Toxicity of Selected Pesticides to Ceriodaphnia dubia, Australas. J. Ecotoxicol.4(1): 53-59.","993","Do Not Use - Unknown purity"]
["Freshwater/non-metal/plant","625-1",48,0.54545454545454541,null,"Selenastrum capricornutum","Not stated","96 hour","LOEC","Growth Rate: Optical cell density (750 nm)","1.0 uM","Microalga","Chlorophyta","Filter-sterilised double deionized water","25 - 27°C growth chamber","25 - 27°C growth chamber","Chronic","7.6-9.0","N.A.","Schrader,K.K., M.Q. De Regt, P.D. Tidwell, C.S. Tucker, and S.O. Duke (1998). Compounds with Selective Toxicity Towards the Off-Flavor Metabolite-Producing Cyanobacterium Oscillatoria cf. chalybea, Aquaculture163(1-2): 85-99.","625","Do Not Use - Failed QAQC acceptability criteria = cannot be used"]
["Freshwater/non-metal/plant","625-2",48,0.54545454545454541,null,"Selenastrum capricornutum","Not stated","96 hour","LC50","Mortality","36.4 ug/L","Microalga","Chlorophyta","Filter-sterilised double deionized water","25 - 27°C growth chamber","25 - 27°C growth chamber","Chronic","7.6-9.0","N.A.","Schrader,K.K., M.Q. De Regt, P.D. Tidwell, C.S. Tucker, and S.O. Duke (1998). Compounds with Selective Toxicity Towards the Off-Flavor Metabolite-Producing Cyanobacterium Oscillatoria cf. chalybea, Aquaculture163(1-2): 85-99.","625","Do Not Use - Failed QAQC acceptability criteria = cannot be used"]
["Freshwater/non-metal/plant","625-3",48,0.54545454545454541,null,"Oscillatoria cf. chalybea","Not stated","96 hour","LOEC","Growth Rate: Optical cell density (750 nm)","1 uM","Microalga","Chlorophyta","Filter-sterilised double deionized water","25 - 27°C growth chamber","25 - 27°C growth chamber","Chronic","7.6-9.0","N.A.","Schrader,K.K., M.Q. De Regt, P.D. Tidwell, C.S. Tucker, and S.O. Duke (1998). Compounds with Selective Toxicity Towards the Off-Flavor Metabolite-Producing Cyanobacterium Oscillatoria cf. chalybea, Aquaculture163(1-2): 85-99.","625","Do Not Use - Failed QAQC acceptability criteria = cannot be used"]
["Freshwater/non-metal/plant","625-4",48,0.54545454545454541,null,"Oscillatoria cf. chalybea","Not stated","96 hour","LC50","Mortality","28 ug/L","Microalga","Chlorophyta","Filter-sterilised double deionized water","25 - 27°C growth chamber","25 - 27°C growth chamber","Chronic","7.6-9.0","N.A.","Schrader,K.K., M.Q. De Regt, P.D. Tidwell, C.S. Tucker, and S.O. Duke (1998). Compounds with Selective Toxicity Towards the Off-Flavor Metabolite-Producing Cyanobacterium Oscillatoria cf. chalybea, Aquaculture163(1-2): 85-99.","625","Do Not Use - Failed QAQC acceptability criteria = cannot be used"]
["Freshwater/non-metal/plant","626-1",56,0.63636363636363635,null,"Anabaena doliolum","Exponential growth phase","12 days","IC50","Growth rate: Optical cell density","0.4 ug/ml","Microalga","Cyanobacteria","Allen and Arnon's medium","24 ± 1°C","24 ± 1°C","Chronic","Not stated","N.A.","Singh,D.P., and K. Kshatriya (2002). Characterization of Salinity-Tolerant Mutant of Anabaena doliolum Exhibiting Multiple Stress Tolerance, Curr. Microbiol.45(3): 165-170.","626","Do Not Use - Unknown purity"]
["Freshwater/non-metal/non- plant","994-1",60,0.65934065934065933,null,"Daphnia magna","<24 hour old neonates","48 hour","IC50","Immobilisation","8.6 mg/L","Microinvertebrate","Arthropoda","Branchiopoda","Non-chlorinated tap water and spring water 1:1","20 (+ - 1) C","Acute ","Not stated","N.A.","Hernando,M.D., M. Ejerhoon, A.R. Fernandez-Alba, and Y. Chisti (2003). Combined Toxicity Effects of MTBE and Pesticides Measured with Vibrio fischeri and Daphnia magna Bioassays, Water Res.37(17): 4091-4098.","994","Yes"]
["MEW_nonplant","995-1",75,0.7978723404255319,null,"Paracentrotus lividus","Not stated","48 hour","EC50","Reproduction: Fertilisation rate","5.09 mg/L","Macroinvertebrate","Echinodermata","Echinoidea","Natural filtered seawater (FSW)","18 (+ - 1) C","Acute","8.0 ± 0.2",0.38,"Manzo,S., S. Buono, and C. Cremisini (2006). Toxic Effects of Irgarol and Diuron on Sea Urchin Paracentrotus lividus Early Development, Fertilization, and Offspring Quality, Arch. Environ. Contam. Toxicol.51(1): 61-68. ","995","Yes"]
["MEW_nonplant","995-2",70,0.74468085106382975,null,"Paracentrotus lividus","Not stated","48 hour","NOEC","Reproduction: Fertilisation rate","0.5 mg/L","Macroinvertebrate","Echinodermata","Echinoidea","Natural filtered seawater (FSW)","18 (+ - 1) C","Acute","8.0 ± 0.2",0.38,"Manzo,S., S. Buono, and C. Cremisini (2006). Toxic Effects of Irgarol and Diuron on Sea Urchin Paracentrotus lividus Early Development, Fertilization, and Offspring Quality, Arch. Environ. Contam. Toxicol.51(1): 61-68. ","995","Yes"]
["MEW_nonplant","995-3",65,0.69148936170212771,null,"Paracentrotus lividus","Not stated","48 hour","LOEC","Reproduction: Fertilisation rate","1 mg/L","Macroinvertebrate","Echinodermata","Echinoidea","Natural filtered seawater (FSW)","18 (+ - 1) C","Acute","8.0 ± 0.2",0.38,"Manzo,S., S. Buono, and C. Cremisini (2006). Toxic Effects of Irgarol and Diuron on Sea Urchin Paracentrotus lividus Early Development, Fertilization, and Offspring Quality, Arch. Environ. Contam. Toxicol.51(1): 61-68. ","995","Yes"]
["MEW_plant","996-1",60,0.65934065934065933,null,"Dunaliaella tertiolecta","Exponential growth phase","96 hour","EC50","Population: Growth rate: Growth inhibition","5.9 ug/L","Microalga","Chlorophyta","Chlorophyceae","F2 marine media ","20 ± 1°C","Chronic","Not stated","Not stated","Gatidou,G., and N.S. Thomaidis (2007). Evaluation of Single and Joint Toxic Effects of Two Antifouling Biocides, Their Main Metabolites and Copper Using Phytoplankton Bioassays, Aquat. Toxicol.85(3): 184-191. ","996","Yes"]
["Freshwater/non-metal/plant","996-2",55,0.625,null,"Navicula forcipata","Exponential growth phase","96 hour","EC50","Population: Growth rate: Growth inhibition","27 ug/L","Microalga","Bacillariophyta","Not stated","20 ± 1 °C","20 ± 1 °C","Chronic","Not stated","N.A.","Gatidou,G., and N.S. Thomaidis (2007). Evaluation of Single and Joint Toxic Effects of Two Antifouling Biocides, Their Main Metabolites and Copper Using Phytoplankton Bioassays, Aquat. Toxicol.85(3): 184-191. ","996","Yes"]
["MEW_nonplant","997-1",74,0.78723404255319152,null,"Paracentrotus lividus","not stated","30 minutes","EC50","Reproduction: Fertilisation rate","2.87 mg/L","Macroinvertebrate","Echinodermata","Echinoidea","Natural filtered seawater (FSW)","18 (+ - 1) C","Acute","8.0 ± 0.2",0.38,"Manzo,S., S. Buono, and C. Cremisini (2008).Predictability of Copper, Irgarol, and Diuron Combined Effects on Sea Urchin Paracentrotus lividus, Arch. Environ. Contam. Toxicol.54(1): 57-68. ","997","Yes"]
["MEW_nonplant","998-1",81,0.86170212765957444,null,"Psetta maxima","Embryo","2 days","NOEC","Reproduction: % Hatching success","625 ug/L","Fish","Chordata","Actinopterygii","Natural filtered seawater (FSW)","18 (+ - 1) C","Acute","8.29 ± 0.11","34.20 ± 0.15 ppt","Mhadhbi,L., and R. Beiras (2012). Acute Toxicity of Seven Selected Pesticides (Alachlor, Atrazine, Dieldrin, Diuron, Pirimiphos-Methyl, Chlorpyrifos, Diazinon) to the Marine Fish (Turbot, Psetta maxima), Water Air Soil Pollut.223(9): 5917-5930.","998","Yes"]
["MEW_nonplant","998-2",81,0.86170212765957444,null,"Psetta maxima","Embryo","2 days","LOEC","Reproduction: % Hatching success","1250 ug/L","Fish","Chordata","Actinopterygii","Natural filtered seawater (FSW)","18 (+ - 1) C","Acute","8.29 ± 0.11","34.20 ± 0.15 ppt","Mhadhbi,L., and R. Beiras (2012). Acute Toxicity of Seven Selected Pesticides (Alachlor, Atrazine, Dieldrin, Diuron, Pirimiphos-Methyl, Chlorpyrifos, Diazinon) to the Marine Fish (Turbot, Psetta maxima), Water Air Soil Pollut.223(9): 5917-5930.","998","Yes"]
["MEW_nonplant","998-3",81,0.86170212765957444,null,"Psetta maxima","Larvae 96hr post-hatch","6 days","NOEC","Reproduction: % Hatching success","625 ug/L","Fish","Chordata","Actinopterygii","Natural filtered seawater (FSW)","18 (+ - 1) C","Acute","8.29 ± 0.11","34.20 ± 0.15 ppt","Mhadhbi,L., and R. Beiras (2012). Acute Toxicity of Seven Selected Pesticides (Alachlor, Atrazine, Dieldrin, Diuron, Pirimiphos-Methyl, Chlorpyrifos, Diazinon) to the Marine Fish (Turbot, Psetta maxima), Water Air Soil Pollut.223(9): 5917-5930.","998","Yes"]
["MEW_nonplant","998-4",81,0.86170212765957444,null,"Psetta maxima","Larvae 96hr post-hatch","6 days","LOEC","Reproduction: % Hatching success","1250 ug/L","Fish","Chordata","Actinopterygii","Natural filtered seawater (FSW)","18 (+ - 1) C","Acute","8.29 ± 0.11","34.20 ± 0.15 ppt","Mhadhbi,L., and R. Beiras (2012). Acute Toxicity of Seven Selected Pesticides (Alachlor, Atrazine, Dieldrin, Diuron, Pirimiphos-Methyl, Chlorpyrifos, Diazinon) to the Marine Fish (Turbot, Psetta maxima), Water Air Soil Pollut.223(9): 5917-5930.","998","Yes"]
["MEW_nonplant","998-5",86,0.91489361702127658,null,"Psetta maxima","Embryo","2 days","LC10","Mortality","1396 ug/L","Fish","Chordata","Actinopterygii","Natural filtered seawater (FSW)","18 (+ - 1) C","Acute","8.29 ± 0.11","34.20 ± 0.15 ppt","Mhadhbi,L., and R. Beiras (2012). Acute Toxicity of Seven Selected Pesticides (Alachlor, Atrazine, Dieldrin, Diuron, Pirimiphos-Methyl, Chlorpyrifos, Diazinon) to the Marine Fish (Turbot, Psetta maxima), Water Air Soil Pollut.223(9): 5917-5930.","998","Yes"]
["MEW_nonplant","998-6",86,0.91489361702127658,null,"Psetta maxima","Embryo","2 days","LC50","Mortality","10076 ug/L","Fish","Chordata","Actinopterygii","Natural filtered seawater (FSW)","18 (+ - 1) C","Acute","8.29 ± 0.11","34.20 ± 0.15 ppt","Mhadhbi,L., and R. Beiras (2012). Acute Toxicity of Seven Selected Pesticides (Alachlor, Atrazine, Dieldrin, Diuron, Pirimiphos-Methyl, Chlorpyrifos, Diazinon) to the Marine Fish (Turbot, Psetta maxima), Water Air Soil Pollut.223(9): 5917-5930.","998","Yes"]
["MEW_nonplant","998-7",86,0.91489361702127658,null,"Psetta maxima","Larvae 96hr post-hatch","6 days","LC10","Mortality","1617 ug/L","Fish","Chordata","Actinopterygii","Natural filtered seawater (FSW)","18 (+ - 1) C","Acute","8.29 ± 0.11","34.20 ± 0.15 ppt","Mhadhbi,L., and R. Beiras (2012). Acute Toxicity of Seven Selected Pesticides (Alachlor, Atrazine, Dieldrin, Diuron, Pirimiphos-Methyl, Chlorpyrifos, Diazinon) to the Marine Fish (Turbot, Psetta maxima), Water Air Soil Pollut.223(9): 5917-5930.","998","Yes"]
["MEW_nonplant","998-8",86,0.91489361702127658,null,"Psetta maxima","Larvae 96hr post-hatch","6 days","LC50","Mortality","7826 ug/L","Fish","Chordata","Actinopterygii","Natural filtered seawater (FSW)","18 (+ - 1) C","Acute","8.29 ± 0.11","34.20 ± 0.15 ppt","Mhadhbi,L., and R. Beiras (2012). Acute Toxicity of Seven Selected Pesticides (Alachlor, Atrazine, Dieldrin, Diuron, Pirimiphos-Methyl, Chlorpyrifos, Diazinon) to the Marine Fish (Turbot, Psetta maxima), Water Air Soil Pollut.223(9): 5917-5930.","998","Yes"]
["Freshwater/non-metal/plant","1000-1",65,0.73863636363636365,null,"Scenedesmus vacuolatus","Exponential growth phase","48 hour","EC50","Growth rate: Optical cell density","14.3 ug/L","Microalga","Chlorophyta","Not stated","25°C","25°C","Chronic","Not stated","N.A.","Copin,P.J., and N. Chevre (2015). Modelling the Effects of Pulse Exposure of Several PSII Inhibitors on Two Algae, Chemosphere137:70-77.","1000","Yes"]
["MEW_plant","NESP-1",91,1,"Buttons weren't working on spreadsheet - however all have been checked and are 100% (NESP REPORT)","Rhodomonas salina","Exponential growth phase","72 hour","NEC","Specific growth rate","1.68 ug/L","Microalgae","Cryptophyta","Cryptophyceae","Guillard’s f/2 medium","26.0 ± 0.6 °C","Chronic","8.5 ± 0.4","34.2 ± 0.6 psu","Negri, A.P., Templeman, S., Flores, F., van Dam, J., Thomas, M., McKenzie, M., Stapp, L., Kaserzon, S., Mann, R.M., Smith, R., Warne, M.St.J. and Mueller, J. (2020) Ecotoxicology of pesticides on the Great Barrier Reef for guideline development and risk assessments. Final report to the National Environmental Science Program. Reef and Rainforest Research Centre Limited, Cairns (120 pp.).",null,"Yes"]
["MEW_plant","NESP-2",91,1,"Buttons weren't working on spreadsheet - however all have been checked and are 100% (NESP REPORT)","Rhodomonas salina","Exponential growth phase","72 hour","EC10","Specific growth rate","1.94 ug/L","Microalgae","Cryptophyta","Cryptophyceae","Guillard’s f/2 medium","26.0 ± 0.6 °C","Chronic","8.5 ± 0.4","34.2 ± 0.6 psu","Negri, A.P., Templeman, S., Flores, F., van Dam, J., Thomas, M., McKenzie, M., Stapp, L., Kaserzon, S., Mann, R.M., Smith, R., Warne, M.St.J. and Mueller, J. (2020) Ecotoxicology of pesticides on the Great Barrier Reef for guideline development and risk assessments. Final report to the National Environmental Science Program. Reef and Rainforest Research Centre Limited, Cairns (120 pp.).",null,"Yes"]
["MEW_plant","NESP-3",91,1,"Buttons weren't working on spreadsheet - however all have been checked and are 100% (NESP REPORT)","Rhodomonas salina","Exponential growth phase","72 hour","EC50","Specific growth rate","6.27 ug/L","Microalgae","Cryptophyta","Cryptophyceae","Guillard’s f/2 medium","26.0 ± 0.6 °C","Chronic","8.5 ± 0.4","34.2 ± 0.6 psu","Negri, A.P., Templeman, S., Flores, F., van Dam, J., Thomas, M., McKenzie, M., Stapp, L., Kaserzon, S., Mann, R.M., Smith, R., Warne, M.St.J. and Mueller, J. (2020) Ecotoxicology of pesticides on the Great Barrier Reef for guideline development and risk assessments. Final report to the National Environmental Science Program. Reef and Rainforest Research Centre Limited, Cairns (120 pp.).",null,"Yes"]
["MEW_plant","NESP-4",91,1,"Buttons weren't working on spreadsheet - however all have been checked and are 100% (NESP REPORT)","Chaetoceros muelleri ","Exponential growth phase","72 hour","NEC","Specific growth rate","1.47 ug/L","Microalgae","Bacillariophyta","Bacillariophyceae","Guillard’s f/2 medium","27.5 ± 0.4 °C","Chronic","8.24 ± 0.2","34.6 ± 0.8 psu","Negri, A.P., Templeman, S., Flores, F., van Dam, J., Thomas, M., McKenzie, M., Stapp, L., Kaserzon, S., Mann, R.M., Smith, R., Warne, M.St.J. and Mueller, J. (2020) Ecotoxicology of pesticides on the Great Barrier Reef for guideline development and risk assessments. Final report to the National Environmental Science Program. Reef and Rainforest Research Centre Limited, Cairns (120 pp.).",null,"Yes"]
["MEW_plant","NESP-5",91,1,"Buttons weren't working on spreadsheet - however all have been checked and are 100% (NESP REPORT)","Chaetoceros muelleri ","Exponential growth phase","72 hour","EC10","Specific growth rate","1.79 ug/L","Microalgae","Bacillariophyta","Bacillariophyceae","Guillard’s f/2 medium","27.5 ± 0.4 °C","Chronic","8.24 ± 0.2","34.6 ± 0.8 psu","Negri, A.P., Templeman, S., Flores, F., van Dam, J., Thomas, M., McKenzie, M., Stapp, L., Kaserzon, S., Mann, R.M., Smith, R., Warne, M.St.J. and Mueller, J. (2020) Ecotoxicology of pesticides on the Great Barrier Reef for guideline development and risk assessments. Final report to the National Environmental Science Program. Reef and Rainforest Research Centre Limited, Cairns (120 pp.).",null,"Yes"]
["MEW_plant","NESP-6",91,1,"Buttons weren't working on spreadsheet - however all have been checked and are 100% (NESP REPORT)","Chaetoceros muelleri ","Exponential growth phase","72 hour","EC50","Specific growth rate","6.27 ug/L","Microalgae","Bacillariophyta","Bacillariophyceae","Guillard’s f/2 medium","27.5 ± 0.4 °C","Chronic","8.24 ± 0.2","34.6 ± 0.8 psu","Negri, A.P., Templeman, S., Flores, F., van Dam, J., Thomas, M., McKenzie, M., Stapp, L., Kaserzon, S., Mann, R.M., Smith, R., Warne, M.St.J. and Mueller, J. (2020) Ecotoxicology of pesticides on the Great Barrier Reef for guideline development and risk assessments. Final report to the National Environmental Science Program. Reef and Rainforest Research Centre Limited, Cairns (120 pp.).",null,"Yes"]
["MEW_plant","NESP-7",91,1,"Buttons weren't working on spreadsheet - however all have been checked and are 100% (NESP REPORT)","Cladocopium goreaui","Exponential growth phase","14 day","NEC","Specific growth rate","2.75 ug/L","Microalgae","Dinoflagellata","Dinophyceae","IMK nutrient media","27 ± 0.6  °C","Chronic","7.8 ± 0.5","32.5 ± 0.7 psu","Negri, A.P., Templeman, S., Flores, F., van Dam, J., Thomas, M., McKenzie, M., Stapp, L., Kaserzon, S., Mann, R.M., Smith, R., Warne, M.St.J. and Mueller, J. (2020) Ecotoxicology of pesticides on the Great Barrier Reef for guideline development and risk assessments. Final report to the National Environmental Science Program. Reef and Rainforest Research Centre Limited, Cairns (120 pp.).",null,"Yes"]
["MEW_plant","NESP-8",91,1,"Buttons weren't working on spreadsheet - however all have been checked and are 100% (NESP REPORT)","Cladocopium goreaui","Exponential growth phase","14 day","EC10","Specific growth rate","2.54 ug/L","Microalgae","Dinoflagellata","Dinophyceae","IMK nutrient media","27 ± 0.6  °C","Chronic","7.8 ± 0.5","32.5 ± 0.7 psu","Negri, A.P., Templeman, S., Flores, F., van Dam, J., Thomas, M., McKenzie, M., Stapp, L., Kaserzon, S., Mann, R.M., Smith, R., Warne, M.St.J. and Mueller, J. (2020) Ecotoxicology of pesticides on the Great Barrier Reef for guideline development and risk assessments. Final report to the National Environmental Science Program. Reef and Rainforest Research Centre Limited, Cairns (120 pp.).",null,"Yes"]
["MEW_plant","NESP-9",91,1,"Buttons weren't working on spreadsheet - however all have been checked and are 100% (NESP REPORT)","Cladocopium goreaui","Exponential growth phase","14 day","EC50","Specific growth rate","4.45 ug/L","Microalgae","Dinoflagellata","Dinophyceae","IMK nutrient media","27 ± 0.6  °C","Chronic","7.8 ± 0.5","32.5 ± 0.7 psu","Negri, A.P., Templeman, S., Flores, F., van Dam, J., Thomas, M., McKenzie, M., Stapp, L., Kaserzon, S., Mann, R.M., Smith, R., Warne, M.St.J. and Mueller, J. (2020) Ecotoxicology of pesticides on the Great Barrier Reef for guideline development and risk assessments. Final report to the National Environmental Science Program. Reef and Rainforest Research Centre Limited, Cairns (120 pp.).",null,"Yes"]
["MEW_plant","NESP-10",91,1,"Buttons weren't working on spreadsheet - however all have been checked and are 100% (NESP REPORT)","Tetraselmis sp.","Exponential growth phase","72 hour","NEC","Specific growth rate","2.27 ug/L","Microalgae","Chlorophyta","n/a","EDTA-free Guillard’s f/2 medium","27 - 29 °C","Chronic","8.1 - 8.2","32 - 33 psu","Negri, A.P., Templeman, S., Flores, F., van Dam, J., Thomas, M., McKenzie, M., Stapp, L., Kaserzon, S., Mann, R.M., Smith, R., Warne, M.St.J. and Mueller, J. (2020) Ecotoxicology of pesticides on the Great Barrier Reef for guideline development and risk assessments. Final report to the National Environmental Science Program. Reef and Rainforest Research Centre Limited, Cairns (120 pp.).",null,"Yes"]
["MEW_plant","NESP-11",91,1,"Buttons weren't working on spreadsheet - however all have been checked and are 100% (NESP REPORT)","Tetraselmis sp.","Exponential growth phase","72 hour","EC10","Specific growth rate","1.64 ug/L","Microalgae","Chlorophyta","n/a","EDTA-free Guillard’s f/2 medium","27 - 29 °C","Chronic","8.1 - 8.2","32 - 33 psu","Negri, A.P., Templeman, S., Flores, F., van Dam, J., Thomas, M., McKenzie, M., Stapp, L., Kaserzon, S., Mann, R.M., Smith, R., Warne, M.St.J. and Mueller, J. (2020) Ecotoxicology of pesticides on the Great Barrier Reef for guideline development and risk assessments. Final report to the National Environmental Science Program. Reef and Rainforest Research Centre Limited, Cairns (120 pp.).",null,"Yes"]
["MEW_plant","NESP-12",91,1,"Buttons weren't working on spreadsheet - however all have been checked and are 100% (NESP REPORT)","Tetraselmis sp.","Exponential growth phase","72 hour","EC50","Specific growth rate","5.24 ug/L","Microalgae","Chlorophyta","n/a","EDTA-free Guillard’s f/2 medium","27 - 29 °C","Chronic","8.1 - 8.2","32 - 33 psu","Negri, A.P., Templeman, S., Flores, F., van Dam, J., Thomas, M., McKenzie, M., Stapp, L., Kaserzon, S., Mann, R.M., Smith, R., Warne, M.St.J. and Mueller, J. (2020) Ecotoxicology of pesticides on the Great Barrier Reef for guideline development and risk assessments. Final report to the National Environmental Science Program. Reef and Rainforest Research Centre Limited, Cairns (120 pp.).",null,"Yes"]
["MEW_plant","NESP-13",91,1,"Buttons weren't working on spreadsheet - however all have been checked and are 100% (NESP REPORT)","Tisochrysis lutea","Exponential growth phase","72 hour","NEC","Specific growth rate","0.781 ug/L","Microalgae","Haptophyta","Coccolithophyceae","EDTA-free Guillard’s f/2 medium","27 - 29 °C","Chronic","7.9 - 8.3","28 - 33 psu","Negri, A.P., Templeman, S., Flores, F., van Dam, J., Thomas, M., McKenzie, M., Stapp, L., Kaserzon, S., Mann, R.M., Smith, R., Warne, M.St.J. and Mueller, J. (2020) Ecotoxicology of pesticides on the Great Barrier Reef for guideline development and risk assessments. Final report to the National Environmental Science Program. Reef and Rainforest Research Centre Limited, Cairns (120 pp.).",null,"Yes"]
["MEW_plant","NESP-14",91,1,"Buttons weren't working on spreadsheet - however all have been checked and are 100% (NESP REPORT)","Tisochrysis lutea","Exponential growth phase","72 hour","EC10","Specific growth rate","0.6 ug/L","Microalgae","Haptophyta","Coccolithophyceae","EDTA-free Guillard’s f/2 medium","27 - 29 °C","Chronic","7.9 - 8.3","28 - 33 psu","Negri, A.P., Templeman, S., Flores, F., van Dam, J., Thomas, M., McKenzie, M., Stapp, L., Kaserzon, S., Mann, R.M., Smith, R., Warne, M.St.J. and Mueller, J. (2020) Ecotoxicology of pesticides on the Great Barrier Reef for guideline development and risk assessments. Final report to the National Environmental Science Program. Reef and Rainforest Research Centre Limited, Cairns (120 pp.).",null,"Yes"]
["MEW_plant","NESP-15",91,1,"Buttons weren't working on spreadsheet - however all have been checked and are 100% (NESP REPORT)","Tisochrysis lutea","Exponential growth phase","72 hour","EC50","Specific growth rate","3.96 ug/L","Microalgae","Haptophyta","Coccolithophyceae","EDTA-free Guillard’s f/2 medium","27 - 29 °C","Chronic","7.9 - 8.3","28 - 33 psu","Negri, A.P., Templeman, S., Flores, F., van Dam, J., Thomas, M., McKenzie, M., Stapp, L., Kaserzon, S., Mann, R.M., Smith, R., Warne, M.St.J. and Mueller, J. (2020) Ecotoxicology of pesticides on the Great Barrier Reef for guideline development and risk assessments. Final report to the National Environmental Science Program. Reef and Rainforest Research Centre Limited, Cairns (120 pp.).",null,"Yes"]
[]
["Data from USEPA Office of Pesticides Program Database"]
["RecordID","Document ID","Taxa","Common name","Scientific name","Life stage","Method guideline","Media type\n(S= marine; F= fresh)","Purity (active ingredient %)","Duration","Measure of toxicity","Less than or greater than","Toxic concentration","Units","NOEL","QAQC Check #1"]
[24155,2083002,"Aquatic Plant","Duckweed","Lemna gibba","N.R","123-2","S","Tech","7 D","EC50","",13,"PPB",2.4900000000000002,"Yes"]
[24156,2083004,"Crustacea","Water flea","Daphnia magna","LifCyc","72-4","SR","Tech","21 D","LOEC","",0.113,"PPM",5.7000000000000002E-2,"Yes"]
[1888,2012614,"Fishes","Fathead minnow","Pimephales promelas","N.R.","72-1","S",98.6,"96 hr","LC50","",14.2,"PPM","N.R.","Yes"]
[1869,2049116,"Aquatic Plant","Diatom","Thalassiosira fluviatilis","N.R.","122-2","S",95,"72 hr","EC50","",95,"PPB","N.R.","Yes"]
[1882,2012615,"Crustacea","Mysid","Americamysis bahia","0.12g","72-3","S",99,"96 hr","LC50","",1.1000000000000001,"PPM",0.6,"Yes"]
[1881,2079104,"Crustacea","Scud","Gammarus fasciatus","1st-I","72-2","S",95,"96 hr","LC50","",0.16,"PPM","N.R.","Yes"]
[1872,2049116,"Aquatic Plant","Marine algae","Stauroneis amphoroides","N.R.","122-2","S",95,"72 hr","EC50","",31,"PPB","N.R.","Yes"]
[1870,2049116,"Aquatic Plant","Marine algae","Achnanthes brevipes","N.R.","122-2","S",95,"72 hr","EC50","",24,"PPB","N.R.","Yes"]
[1892,"2012603/09","Fishes","Bluegill sunfish","Lepomis macrochirus","N.R.","72-1","S",95,"96 hr","LC50","",3.2,"PPM","N.R.","Yes"]
[1871,2049116,"Aquatic Plant","Marine diatom","Navicula incerta","N.R.","122-2","S",95,"72 hr","EC50","",93,"PPB","N.R.","Yes"]
[1876,2049116,"Aquatic Plant","Green algae","Dunaliella tertiolecta","N.R.","122-2","S",95,"10 D","EC50","",20,"PPB","N.R.","Yes"]
[1875,2049116,"Aquatic Plant","Marine algae","Nitzschia closterium","N.R.","122-2","S",95,"72 hr","EC50","",50,"PPB","N.R.","Yes"]
[1874,2049116,"Aquatic Plant","Marine diatom","Phaeodactylum tricornutum","N.R.","122-2","S",95,"10 D","EC50","",10,"PPB","N.R.","Yes"]
[1873,2049116,"Aquatic Plant","Marine algae","Amphora exigua","N.R.","122-2","S",95,"72 hr","EC50","",31,"PPB","N.R.","Yes"]
[1880,2079104,"Crustacea","Water flea","Daphnia pulex","1st-I","72-2","S",95,"48 hr","EC50","",1.4,"PPM","N.R.","Yes"]
[1907,2049116,"Aquatic Plant","Marine algae","Porphyridium cruentum","N.R.","122-2","S",95,"72 hr","EC50","",24,"PPB","N.R.","Yes"]
[5130,2059424,"Aquatic Plant","Green algae","Selenastrum capricornutum","N.R.","123-2","S",96.8,"96 hr","EC50","",2.4,"PPB",0.44,"Yes"]
[5131,2012699,"Mollusca","Eastern oyster","Crassostrea virginica","SPAT","72-3","F",96.8,"96 hr","EC50","",4.8,"PPM",2.4,"Yes"]
[1889,2079104,"Fishes","Cutthroat trout","Oncorhynchus clarkii","0.3 g","72-1","S",95,"96 hr","LC50","",1.4,"PPM","N.R.","Yes"]
[1868,2049116,"Aquatic Plant","Marine algae","Cyclotella nana","N.R.","122-2","S",95,"72 hr","EC50","",39,"PPB","N.R.","Yes"]
[1899,2049421,"Fishes","Bluegill sunfish","Lepomis macrochirus","0.8 g","72-1","S",95,"96 hr","LC50","",2.8,"PPM","N.R.","Yes"]
[1898,2049421,"Fishes","Lake trout","Salvelinus namaycush","0.4 g","72-1","S",95,"96 hr","LC50","",1.2,"PPM","N.R.","Yes"]
[1897,2049421,"Fishes","Cutthroat trout","Oncorhynchus clarkii","N.R.","72-1","S",95,"96 hr","LC50","",0.71,"PPM","N.R.","Yes"]
[1896,2049421,"Fishes","Coho salmon","Oncorhynchus kisutch","N.R.","72-1","S",95,"96 hr","LC50","<",2.4,"PPM","N.R.","Yes"]
[1894,2079104,"Fishes","Rainbow trout","Oncorhynchus mykiss","N.R.","72-1","S","80WP","96 hr","LC50","",16,"PPM","N.R.","Do Not Use - Purity not >80%"]
[1891,"2012602/10","Fishes","Rainbow trout","Oncorhynchus mykiss","1.28 g","72-1","S",95,"96 hr","LC50","",1.95,"PPM","N.R.","Yes"]
[1890,2079104,"Fishes","Lake trout","Salvelinus namaycush","N.R.","72-1","S",95,"96 hr","LC50","",2.7,"PPM","N.R.","Yes"]
[1867,2049116,"Aquatic Plant","Marine algae","Isochrysis galbana","N.R.","122-2","S",95,"10 D","EC50","",10,"PPB","N.R.","Yes"]
[1893,2012617,"Fishes","Sheepshead minnow","Cyprinodon variegatus","0.63 g","72-3","S",99,"96 hr","LC50","",6.7,"PPM",3.6,"Yes"]
[1866,2049116,"Aquatic Plant","Marine algae","Monochrysis lutheri","N.R.","122-2","S",95,"72 hr","EC50","",18,"PPB","N.R.","Yes"]
[10475,2049116,"Fishes","Striped mullet","Mugil cephalus","Juv","72-3","S",95,"48 hr","LC50","",6.3,"PPM","N.R.","Yes"]
[10474,2049116,"Mollusca","Eastern oyster","Crassostrea virginica","EmbLrv","72-3","F",95,"96 hr","EC50","",1.8,"PPM","N.R.","Yes"]
[12241,"2012601/11","Crustacea","Water flea","Daphnia magna","LifCyc","72-4","S",98.2,"28 D","LOEC",">",0.2,"PPM",0.2,"Yes"]
[12242,2012702,"Crustacea","Mysid","Americamysis bahia","LifCyc","72-4","F",96.8,"28 D","LOEC","",0.56000000000000005,"PPM",0.27,"Yes"]
[12243,2012700,"Fishes","Sheepshead minnow","Cyprinodon variegatus","ErlyLf","72-4","F",96.8,"38 D","LOEC","<",0.44,"PPM","N.D.","Yes"]
[12244,2012614,"Fishes","Fathead minnow","Pimephales promelas","ErlyLf","72-4","S",98.6,"60day","LOEC","",61.8,"PPB",26.4,"Yes"]
[10473,2049116,"Crustacea","Brown shrimp","Penaeus aztecus","Juv","72-3","F",95,"48 hr","LC50",">",1,"PPM","N.R.","Yes"]
["Michael added in from OPP",null,null,null,"Chlamydomonas sp.","N.R.","122-2","S","95","72 hr","EC50","","37","PPB","N.R.","Do Not Use - Not species specific, and data already exists for Chlamydomonas moewusii, therefore this would not be used"]
["Michael added in from OPP",null,null,null,"Chlorococcum sp.","N.R.","122-2","S","95","10 D","EC50","","10","PPB","N.R.","Do Not Use - Not species specific, and data already exists for Chlorococcum minor, therefore this would not be used"]
["Michael added in from OPP",null,null,null,"Chlorella sp.","N.R.","122-2","F","95","72 hr","EC50","","19","PPB","N.R.","Yes"]
["Michael added in from OPP",null,null,null,"Neochloris sp.","N.R.","122-2","S","95","72 hr","EC50","","28","PPB","N.R.","Yes"]
["Michael added in from OPP",null,null,null,"Platymonas sp.","N.R.","122-2","S","95","72 hr","EC50","","17","PPB","N.R.","Yes"]
["Michael added in from OPP",null,null,null,"Synechococcus leopoliensis","N.R.","123-2","S","99.1","72 hr","EC50","","16.9","PPB","N.R.","Yes"]
["Michael added in from OPP",null,null,null,"Navicula pelliculosa","N.R.","123-2","S","99.1","72 hr","EC50","","11.1","PPB","N.R.","Yes"]
["Michael added in from OPP",null,null,null,"Scenedesmus subspicatus","N.R.","123-2","S","98.5","96 hr","EC50","","7.0","PPB","N.R.","Yes"]
["Michael added in from OPP",null,null,null,"Synechococcus leopoliensis","N.R.","123-2","S","99.1","72 hr","NOEL","","1.14","PPB",null,"Yes"]
["Michael added in from OPP",null,null,null,"Navicula pelliculosa","N.R.","123-2","S","99.1","72 hr","NOEL","","9.17","PPB",null,"Yes"]
["Michael added in from OPP",null,null,null,"Scenedesmus subspicatus","N.R.","123-2","S","98.5","96 hr","NOEL","","2.3","PPB",null,"Yes"]
[]
["Data previously collated"]
["ID","Data Source ID","Phylum","Species Common Name","Species Scientific Name","Hetero/Phototroph","Species Group","Media Type","Observed Duration Mean (Days)","Observed Duration Units (Days)","Life Stage","Acute/Chronic","Endpoint","Effect","Effect Measurement","Conc 1 Mean (ug/L)","Conc 1 Units (ug/L)","Quality Score 1","Quality Accepted","Metadata Accepted","Random Metadata Quality Check (RMQC)","QAQC Check #1"]
[85,608,"Tracheophyta","Duckweed","Lemna aequinoctialis","phototroph","Flowers, Trees, Shrubs, Ferns","FW",8,"d","","chronic","EC50","POP","COVR",4.6999999999999997E-8,"M",52,true,true,true,"Yes"]
[85,608,"Tracheophyta","Duckweed","Lemna aequinoctialis","phototroph","Flowers, Trees, Shrubs, Ferns","FW",8,"d",null,"chronic","EC50","POP","COVR",4.6999999999999997E-8,"M",52,true,true,true,"Yes"]
[287,639,"Chordata","Fathead Minnow","Pimephales promelas","Heterotroph","Fish; Standard Test Species","FW",1,"d","Adult","Acute","EC50","MOR","MORT",23300,"ug/L",54,true,false,true,"Yes"]
[288,639,"Chordata","Fathead Minnow","Pimephales promelas","Heterotroph","Fish; Standard Test Species","FW",2,"d","Adult","Acute","EC50","MOR","MORT",19900,"ug/L",54,true,false,true,"Yes"]
[289,639,"Chordata","Fathead Minnow","Pimephales promelas","Heterotroph","Fish; Standard Test Species","FW",4,"d","Adult","Acute","EC50","MOR","MORT",14200,"ug/L",54,true,false,true,"Yes"]
[290,639,"Chordata","Fathead Minnow","Pimephales promelas","Heterotroph","Fish; Standard Test Species","FW",8.1667000000000005,"d","Adult","Acute","EC50","MOR","MORT",7700,"ug/L",54,true,false,true,"Yes"]
[291,639,"Chordata","Fathead Minnow","Pimephales promelas","Heterotroph","Fish; Standard Test Species","FW",5,"d","","","NOEC","DVP","ABNM",33.4,"ug/L",54,false,false,false,"Yes"]
[294,639,"Chordata","Fathead Minnow","Pimephales promelas","Heterotroph","Fish; Standard Test Species","FW",5,"d","","","NOEC","MOR","HTCH",29,"ug/L",54,false,false,false,"Yes"]
[292,639,"Chordata","Fathead Minnow","Pimephales promelas","Heterotroph","Fish; Standard Test Species","FW",60,"days post hatch","Juveniles","","NOEC","GRO","LGTH",29,"ug/L",54,false,false,false,"Yes"]
[293,639,"Chordata","Fathead Minnow","Pimephales promelas","Heterotroph","Fish; Standard Test Species","FW",60,"days post hatch","Juveniles","","NOEC","GRO","WWGT",29,"ug/L",54,false,false,false,"Yes"]
[1225,676,"Cnidaria","","Acropora millepora","Heterotroph","","Marine",4,"d","Larvae","Chronic","NOEC","MOR","LARVAE SURV",1000,"ug/L",55,true,true,true,"Yes"]
[1238,676,"Cnidaria","","Pocillopora damicornis","Heterotroph","","Marine",4,"d","Larvae","Chronic","NOEC","MOR","LARVAE SURV",1000,"ug/L",55,true,true,false,"Yes"]
[1509,710,"Rhodophyta","Red Algae","Ceramium tenuicorne","Phototroph","Algae, Moss, Fungi","Marine",7,"d","","chronic","EC50","POP","PGRT",3.4,"ug/L",55,true,true,true,"Yes"]
[154,624,"Chlorophyta","Green Algae","Scenedesmus subspicatus","phototroph","Algae, Moss, Fungi","FW",1,"d","","acute","NOEC","POP","PGRT",7,"ug/L",55,true,true,true,"Yes"]
[153,624,"Chlorophyta","Green Algae","Scenedesmus subspicatus","phototroph","Algae, Moss, Fungi","FW",3,"d","","chronic","EC50","POP","PGRT",36,"ug/L",55,true,true,true,"Yes"]
[155,624,"Chlorophyta","Green Algae","Scenedesmus subspicatus","phototroph","Algae, Moss, Fungi","FW",3,"d","","chronic","NOEC","POP","PGRT",10,"ug/L",55,true,true,true,"Yes"]
[1509,710,"Rhodophyta","Red Algae","Ceramium tenuicorne","Phototroph","Algae, Moss, Fungi","Marine",7,"d",null,"chronic","EC50","POP","PGRT",3.4,"ug/L",55,true,true,true,"Yes"]
[null,710,null,null,"Nitocra spinipes","Heterotroph","Crustaceans","Marine",4,"d",null,null,"LC50","MOR","MORT",4000,"ug/L",55,null,null,null,"Yes"]
[146,620,"Chlorophyta","Green Algae","Desmodesmus subspicatus","phototroph","Algae, Moss, Fungi","FW",3,"d","","chronic","EC50","POP","PGRT",46.3,"ug/L",58,true,true,true,"Yes"]
[295,639,"Chordata","Fathead Minnow","Pimephales promelas","Heterotroph","Fish; Standard Test Species","FW",60,"days post hatch","Juveniles","Chronic","NOEC","MOR","SURV",33.4,"ug/L",59,true,false,true,"Yes"]
[1421,681,"Chlorophyta","Green Algae","Dunaliella tertiolecta","phototroph","Algae","Marine",10,"d","","chronic","EC50","POP","ABND SPECTRO",20,"ug/L",59,true,true,true,"Yes"]
[1422,681,"Haptophyta","","Isochrysis galbana","phototroph","Algae","Marine",10,"d","","chronic","EC50","POP","ABND SPECTRO",10,"ug/L",59,true,true,true,"Yes"]
[1423,681,"Ochrophyta","Diatom","Phaeodactylum tricornutum","phototroph","Algae","Marine",10,"d","","chronic","EC50","POP","ABND SPECTRO",10,"ug/L",59,true,true,true,"Yes"]
[1420,681,"Chlorophyta","Green Algae","Chlorococcum sp.","phototroph","Algae","Marine",10,"d",null,"chronic","EC50","POP","ABND SPECTRO",10,"ug/L",59,true,true,true,"Do Not Use - Not species specific"]
[1652,682,"Ochrophyta","Diatom","Navicula sp.","Phototroph",null,"Estuarine",3,"d",null,"chronic","EC50","POP","PGRT SPECTRO",7.8,"ug/L",74,true,true,true,"Do Not Use - Not species specific"]
[175,627,"Cyanobacteria","Blue-Green Algae","Anabaena variabilis","phototroph","Algae, Moss, Fungi","FW",12,"d","","chronic","EC50","POP","FLRS",80,"ug/L",60,true,true,true,"Yes"]
[219,634,"Ciliophora","Ciliate","Tetrahymena pyriformis","Heterotroph","Micro-organism","FW",0.375,"d","Not Applicable","Acute","EC50","POP","GENT",8180,"ug/L",60,true,true,true,"Yes"]
[1497,697,"Chlorophyta","Green Algae","Pseudokirchneriella subcapitata","Phototroph","Algae, Moss, Fungi","FW",3,"d","","chronic","LOEC","POP","ABND",15,"ug/L",60,true,true,true,"Yes"]
[131,615,"Chlorophyta","Green Algae","Scenedesmus quadricauda","phototroph","Algae, Moss, Fungi","FW",4,"d","","chronic","EC50","POP","ABND SPECTRO",2.7,"ug/L",61,true,true,false,"Yes"]
[142,618,"Chlorophyta","Green Algae","Chlorella pyrenoidosa","phototroph","Algae, Moss, Fungi","FW",4,"d","","chronic","EC50","POP","ABND SPECTRO",1.3,"ug/L",61,true,true,true,"Yes"]
[134,616,"Chlorophyta","Green Algae","Chlorella vulgaris","phototroph","Algae, Moss, Fungi; Standard Test Species","FW",4,"d",null,"chronic","EC50","POP","FLRS",4.3,"ug/L",61,true,true,true,"Yes"]
[128,614,"Chlorophyta","Green Algae","Scenedesmus obliquus","phototroph","Algae, Moss, Fungi","FW",4,"d",null,"chronic","EC50","POP","FLRS",4.09,"ug/L",61,true,true,true,"Yes"]
[138,617,"Chlorophyta","Green Algae","Pseudokirchneriella subcapitata","phototroph","Algae, Moss, Fungi; Standard Test Species","FW",4,"d",null,"chronic","EC50","POP","FLRS",0.7,"ug/L",61,true,true,true,"Yes"]
[1504,702,"Haptophyta","Coccolithophorid","Emiliania huxleyi","Phototroph","Algae, Moss, Fungi","Marine",3,"d","","chronic","NOEC","POP","ABND",0.54,"ug/L",63,true,true,true,"Yes"]
[1232,676,"Dinophyta","Zooxanthellae","Pocillopora damicornis","phototroph","","Marine",4,"d","","Chronic","NOEC","POP","ABND",1,"ug/L",65,true,true,true,"Yes"]
[1490,689,"Rhodophyta","Red Algae","Gracilaria tenuistipitata","Phototroph","Algae, Moss, Fungi","Marine",4,"d","","chronic","NOEC","POP","PGRT",1.3,"ug/L",65,true,true,true,"Yes"]
[1491,689,"Rhodophyta","Red Algae","Gracilaria tenuistipitata","Phototroph","Algae, Moss, Fungi","Marine",4,"d","","chronic","NOEC","POP","PGRT",2,"ug/L",65,true,true,true,"Yes"]
[1496,697,"Chlorophyta","Green Algae","Pseudokirchneriella subcapitata","Phototroph","Algae, Moss, Fungi","FW",3,"d","","chronic","EC50","POP","ABND",45,"ug/L",66,true,true,true,"Yes"]
[null,675,"Tracheophyta","Eel grass","Zostera marina","phototroph","","Marine",10,"d","","Chronic","LOEC","GRO","BMAS",5,"ug/L",67,null,null,null,"Yes"]
[1219,675,"Tracheophyta","Eel grass","Zostera marina","phototroph","","Marine",10,"d","","Chronic","NOEC","GRO","BMAS",2.5,"ug/L",67,true,true,true,"Yes"]
[1501,702,"Haptophyta","Coccolithophorid","Emiliania huxleyi","Phototroph","Algae, Moss, Fungi","Marine",3,"d","","chronic","EC50","POP","ABND",2.2599999999999998,"ug/L",68,true,true,true,"Yes"]
[1507,708,"Ochrophyta","Diatom","Phaeodactylum tricornutum","Phototroph","Algae, Moss, Fungi","Marine",3,"d","","chronic","EC50","POP","PGRT",0.09,"uM",69,true,true,true,"Yes"]
[null,708,"Ochrophyta","Diatom","Phaeodactylum tricornutum","Phototroph","Algae, Moss, Fungi","Marine",7,"d",null,"chronic","EC50","POP","PGRT",0.33,"uM",69,null,null,null,"Yes"]
[1488,689,"Rhodophyta","Red Algae","Gracilaria tenuistipitata","Phototroph","Algae, Moss, Fungi","Marine",4,"d","","chronic","EC50","POP","PGRT",15,"ug/L",70,true,true,true,"Yes"]
[1489,689,"Rhodophyta","Red Algae","Gracilaria tenuistipitata","Phototroph","Algae, Moss, Fungi","Marine",4,"d","","chronic","EC50","POP","PGRT",20,"ug/L",70,true,true,true,"Yes"]
[50,605,"Chlorophyta","Green Algae","Pseudokirchneriella subcapitata","phototroph","Algae, Moss, Fungi; Standard Test Species","FW",3,"d","","chronic","EC50","POP","PGRT",10.5,"ug/L",70,true,true,true,"Yes"]
[1499,700,"Ochrophyta","Neptune'S Necklace","Hormosira banksii","Phototroph","Algae, Moss, Fungi","Marine",2,"d","","chronic","EC50","REP","GERM",6290,"ug/L",72,true,true,true,"Yes"]
[null,700,"Ochrophyta","Neptune'S Necklace","Hormosira banksii","Phototroph","Algae, Moss, Fungi","Marine",2,"d",null,"chronic","EC50","GRO","LGTH",6750,"ug/L",72,null,null,null,"Yes"]
[1510,711,"Ochrophyta","Diatom","Chaetoceros gracilis","Phototroph","Algae, Moss, Fungi","Marine",3,"d","","chronic","EC50","POP","ABND",36,"ug/L",72,true,true,true,"Yes"]
[1517,712,"Ochrophyta","Algae","Entomoneis punctulata","Phototroph","Algae, Moss, Fungi","Marine",3,"d","","chronic","LOEC","POP","PGRT",6,"ug/L",72,true,true,true,"Yes"]
[1519,712,"Ochrophyta","Algae","Entomoneis punctulata","Phototroph","Algae, Moss, Fungi","Marine",3,"d","","chronic","NOEC","POP","PGRT",2,"ug/L",72,true,true,true,"Yes"]
[1518,712,"Ochrophyta","Diatom","Nitzschia closterium","Phototroph","Algae, Moss, Fungi","Marine",3,"d","","chronic","LOEC","POP","PGRT",6,"ug/L",72,true,true,true,"Yes"]
[1520,712,"Ochrophyta","Diatom","Nitzschia closterium","Phototroph","Algae, Moss, Fungi","Marine",3,"d","","chronic","NOEC","POP","PGRT",2,"ug/L",72,true,true,true,"Yes"]
[1432,682,"Chlorophyta","Green Algae","Nephroselmis pyriformis","Phototroph","Algae","Estuarine",3,"d","","chronic","EC50","POP","PGRT SPECTRO",8,"ug/L",74,true,true,true,"Yes"]
[1655,682,"Chlorophyta","Green Algae","Nephroselmis pyriformis","Phototroph","","Estuarine",3,"d","","chronic","EC10","POP","PGRT SPECTRO",5.2,"ug/L",74,true,true,true,"Yes"]
[1855,682,"Chlorophyta","","Nephroselmis pyriformis","phototroph","","Estuarine",3,"d","","chronic","EC50","POP","ABND SPECTRO",5.8,"ug/L",74,true,true,true,"Yes"]
[1856,682,"Chlorophyta","","Nephroselmis pyriformis","phototroph","","Estuarine",3,"d","","chronic","EC10","POP","ABND SPECTRO",2.2000000000000002,"ug/L",74,true,true,true,"Yes"]
[192,630,"Tracheophyta","Duckweed","Lemna minor","phototroph","Flowers, Trees, Shrubs, Ferns","FW",7,"d",null,"chronic","EC50","POP","FLRS",25,"ug/L",74,true,true,true,"Yes"]
[193,630,"Tracheophyta","Duckweed","Lemna minor","phototroph","Flowers, Trees, Shrubs, Ferns","FW",7,"d",null,"chronic","LOEC","POP","FLRS",5,"ug/L",74,true,true,true,"Yes"]
[382,647,"Chordata","Fathead Minnow","Pimephales promelas","Heterotroph","Fish; Standard Test Species","FW",7,"d","Larvae","Chronic","NOEC","MOR","MORT",10,"ug/L",81,true,false,true,"Yes"]
[644,660,"Chordata","Bullfrog","Rana catesbeiana","Heterotroph","Amphibians; Standard Test Species; U.S. Exotic/Nuisance Species","FW",10,"d","Larvae","Chronic","NOEC","GRO","DWGT",7600,"ug/L",82,true,true,true,"Yes"]
[647,660,"Chordata","Bullfrog","Rana catesbeiana","Heterotroph","Amphibians; Standard Test Species; U.S. Exotic/Nuisance Species","FW",10,"d","Larvae","Chronic","NOEC","GRO","LGTH",14500,"ug/L",82,true,true,true,"Yes"]
[631,660,"Chordata","Pacific Chorus Frog","Pseudacris regilla","Heterotroph","Amphibians","FW",14,"d","Larvae","Chronic","NOEC","GRO","DWGT",21000,"ug/L",82,true,true,true,"Yes"]
[633,660,"Chordata","Pacific Chorus Frog","Pseudacris regilla","Heterotroph","Amphibians","FW",14,"d","Larvae","Chronic","NOEC","GRO","LGTH",14500,"ug/L",82,true,true,true,"Yes"]
[639,660,"Chordata","Northern Red-legged Frog","Rana aurora","Heterotroph","Amphibians","FW",14,"d","Larvae","Chronic","NOEC","GRO","WWGT",7600,"ug/L",82,true,true,true,"Yes"]
[645,660,"Chordata","Bullfrog","Rana catesbeiana","Heterotroph","Amphibians; Standard Test Species; U.S. Exotic/Nuisance Species","FW",14,"d","Larvae","Chronic","NOEC","GRO","DWGT",14500,"ug/L",82,true,true,true,"Yes"]
[651,660,"Chordata","Bullfrog","Rana catesbeiana","Heterotroph","Amphibians; Standard Test Species; U.S. Exotic/Nuisance Species","FW",14,"d","Larvae","Chronic","NOEC","GRO","WWGT",21100,"ug/L",82,true,true,true,"Yes"]
[646,660,"Chordata","Bullfrog","Rana catesbeiana","Heterotroph","Amphibians; Standard Test Species; U.S. Exotic/Nuisance Species","FW",21,"d","Larvae","Chronic","NOEC","GRO","DWGT",7600,"ug/L",82,true,true,true,"Yes"]
[658,660,"Chordata","African Clawed Frog","Xenopus laevis","Heterotroph","Amphibians; Standard Test Species","FW",4,"d","Embryo","Acute","NOEC","GRO","DWGT",21100,"ug/L",82,true,true,true,"Yes"]
[659,660,"Chordata","African Clawed Frog","Xenopus laevis","Heterotroph","Amphibians; Standard Test Species","FW",4,"d","Embryo","Acute","NOEC","GRO","LGTH",7600,"ug/L",82,true,true,true,"Yes"]
[1836,660,"Chordata","","Xenopus laevis","Heterotroph","","FW",4,"d","Embryo","Acute","NOEC","GRO","DWGT",14500,"ug/L",82,true,true,true,"Yes"]
[635,660,"Chordata","Pacific Chorus Frog","Pseudacris regilla","Heterotroph","Amphibians","FW",14,"d","Larvae","Chronic","NOEC","GRO","LGTH",29100,"ug/L",82,false,false,true,"Yes"]
[636,660,"Chordata","Pacific Chorus Frog","Pseudacris regilla","Heterotroph","Amphibians","FW",14,"d","Larvae","Chronic","NOEC","GRO","WWGT",29100,"ug/L",82,false,false,true,"Yes"]
[656,660,"Chordata","African Clawed Frog","Xenopus laevis","Heterotroph","Amphibians; Standard Test Species","FW",14,"d","Larvae","Chronic","NOEC","GRO","DWGT",29100,"ug/L",82,false,false,true,"Yes"]
[657,660,"Chordata","African Clawed Frog","Xenopus laevis","Heterotroph","Amphibians; Standard Test Species","FW",14,"d","Larvae","Chronic","NOEC","GRO","LGTH",29100,"ug/L",82,false,false,true,"Yes"]
[660,660,"Chordata","African Clawed Frog","Xenopus laevis","Heterotroph","Amphibians; Standard Test Species","FW",14,"d","Larvae","Chronic","NOEC","GRO","WWGT",29100,"ug/L",82,false,false,true,"Yes"]
[649,660,"Chordata","Bullfrog","Rana catesbeiana","Heterotroph","Amphibians; Standard Test Species; U.S. Exotic/Nuisance Species","FW",21,"d","Larvae","Chronic","NOEC","GRO","LGTH",29100,"ug/L",82,false,false,true,"Yes"]
[652,660,"Chordata","Bullfrog","Rana catesbeiana","Heterotroph","Amphibians; Standard Test Species; U.S. Exotic/Nuisance Species","FW",21,"d","Larvae","Chronic","NOEC","GRO","WWGT",29100,"ug/L",82,false,false,true,"Yes"]
[1515,712,"Ochrophyta","Algae","Entomoneis punctulata","Phototroph","Algae, Moss, Fungi","Marine",3,"d","","chronic","EC50","POP","PGRT",24,"ug/L",82,true,true,true,"Yes"]
[1516,712,"Ochrophyta","Diatom","Nitzschia closterium","Phototroph","Algae, Moss, Fungi","Marine",3,"d","","chronic","EC50","POP","PGRT",17,"ug/L",82,true,true,true,"Yes"]
[648,660,"Chordata","Bullfrog","Rana catesbeiana","Heterotroph","Amphibians; Standard Test Species; U.S. Exotic/Nuisance Species","FW",14,"d","Larvae","Chronic","NOEC","GRO","LGTH",14500,"ug/L",82,true,true,true,"Yes"]
[381,647,"Chordata","Fathead Minnow","Pimephales promelas","Heterotroph","Fish; Standard Test Species","FW",7,"d","Larvae","Chronic","NOEC","GRO","BMAS",10,"ug/L",84,true,false,true,"Yes"]
[379,647,"Arthropoda","Water Flea","Ceriodaphnia dubia","Heterotroph","Crustaceans; Standard Test Species","FW",8,"d","Not Applicable","Chronic","NOEC","MOR","MORT",10,"ug/L",84,true,false,true,"Yes"]
[380,647,"Arthropoda","Water Flea","Ceriodaphnia dubia","Heterotroph","Crustaceans; Standard Test Species","FW",8,"d","Not Applicable","Chronic","NOEC","REP","PROG",10,"ug/L",84,true,false,true,"Yes"]
[1521,699,"Ochrophyta","Neptune'S Necklace","Hormosira banksii","Phototroph","Algae, Moss, Fungi","Marine",2,"d","Gametes","chronic","EC50","REP","GERM",4650,"ug/L",86,true,true,true,"Yes"]
[629,660,"Chordata","Pacific Chorus Frog","Pseudacris regilla","Heterotroph","Amphibians","FW",14,"d","Larvae","Chronic","EC50","MOR","MORT",10800,"ug/L",87,true,true,true,"Yes"]
[630,660,"Chordata","Pacific Chorus Frog","Pseudacris regilla","Heterotroph","Amphibians","FW",14,"d","Larvae","Chronic","EC50","MOR","MORT",19600,"ug/L",87,true,true,true,"Yes"]
[638,660,"Chordata","Northern Red-legged Frog","Rana aurora","Heterotroph","Amphibians","FW",14,"d","Larvae","Chronic","EC50","MOR","MORT",22200,"ug/L",87,true,true,true,"Yes"]
[653,660,"Chordata","African Clawed Frog","Xenopus laevis","Heterotroph","Amphibians; Standard Test Species","FW",14,"d","Larvae","Chronic","EC50","MOR","MORT",8100,"ug/L",87,true,true,true,"Yes"]
[1835,660,"Chordata","","Xenopus laevis","Heterotroph","","FW",14,"d","Larvae","Chronic","EC50","MOR","MORT",14500,"ug/L",87,true,true,true,"Yes"]
[643,660,"Chordata","Bullfrog","Rana catesbeiana","Heterotroph","Amphibians; Standard Test Species; U.S. Exotic/Nuisance Species","FW",21,"d","Larvae","Chronic","EC50","MOR","MORT",12700,"ug/L",87,true,true,true,"Yes"]
[628,660,"","Pacific Chorus Frog","Pseudacris regilla","Heterotroph","Amphibians","FW",10,"d","Embryo","","EC50","MOR","MORT",29100,"ug/L",87,false,false,true,"Yes"]
[641,660,"Chordata","Bullfrog","Rana catesbeiana","Heterotroph","Amphibians; Standard Test Species; U.S. Exotic/Nuisance Species","FW",10,"d","Larvae","Chronic","EC50","MOR","MORT",29100,"ug/L",87,false,false,true,"Yes"]
[642,660,"Chordata","Bullfrog","Rana catesbeiana","Heterotroph","Amphibians; Standard Test Species; U.S. Exotic/Nuisance Species","FW",14,"d","Larvae","Chronic","EC50","MOR","MORT",29100,"ug/L",87,false,false,true,"Yes"]
[654,660,"Chordata","African Clawed Frog","Xenopus laevis","Heterotroph","Amphibians; Standard Test Species","FW",4,"d","Embryo","Acute","EC50","MOR","MORT",29100,"ug/L",87,false,false,true,"Yes"]
[1251,679,"Cnidaria","","Acropora valida","Heterotroph","","Marine",90,"d","","Chronic","NOEC","","FCND",0.91,"ug/L","",false,false,false,"Yes"]
[1252,679,"Cnidaria","","Acropora valida","Heterotroph","","Marine",90,"d","","Chronic","NOEC","","SIZE",8.8000000000000007,"ug/L","",false,false,false,"Yes"]
[1928,791,"Tracheophyta","Duckweed","Lemna aequinoctialis","phototroph","","FW",4,"d","","Acute","EC10","POP","ABND",2.79,"ug/L","",true,true,false,"Yes"]
[1929,791,"Tracheophyta","Duckweed","Lemna aequinoctialis","phototroph","","FW",4,"d","","Acute","EC90","POP","ABND",17.100000000000001,"ug/L","",true,true,false,"Yes"]
[1899,791,"Haptophyta","","Isochrysis galbana","phototroph","","Marine",3,"d",null,"Chronic","EC50","POP","ABND",2.77,"ug/L","",true,true,false,"Yes"]
[1922,791,"Haptophyta","","Isochrysis galbana","phototroph","","Marine",3,"d",null,"Chronic","EC10","POP","ABND",1.0900000000000001,"ug/L","",true,true,false,"Yes"]
[1923,791,"Haptophyta","","Isochrysis galbana","phototroph","","Marine",3,"d",null,"Chronic","EC90","POP","ABND",7.08,"ug/L","",true,true,false,"Yes"]
[143,619,"Chlorophyta","Green Algae","Pseudokirchneriella subcapitata","phototroph","Algae, Moss, Fungi; Standard Test Species","FW",3,"d","","acute","EC50","POP","PGRT",100,"ug/L","",false,false,false,"Do Not Use - Only tests one concentration."]
[220,635,"Ciliophora","Ciliate","Tetrahymena pyriformis","Heterotroph","Invertebrates","FW",0.375,"d","","","EC50","POP","PGRT",7840,"ug/L","",false,false,false,"Do Not Use - Only tests one concentration."]
[221,635,"Ciliophora","Ciliate","Tetrahymena pyriformis","Heterotroph","Invertebrates","FW",0.375,"d","","","EC50","POP","PGRT",8180,"ug/L","",false,false,false,"Do Not Use - Only tests one concentration."]
[]
["Data from Water Quality Guideline Database (Disc)"]
["Species","Media","Acute or Chronic","Test measure","Endpoint","Concentration","Units","Record ID","Duration (hr)","Common name","QAQC Check #1"]
["Carassius auratus","Freshwater","Acute","LC50","MORT",5800,"ug/L",215192,48,"Goldfish","Yes"]
["Carassius sp","Freshwater","Acute","LC50","MORT",63000,"ug/L",206270,96,"Carp","Yes"]
["Ctenopharyngodon idella","Freshwater","Acute","LC50","MORT",44000,"ug/L",200575,48,"Grass carp, white amur","Yes"]
["Ctenopharyngodon idella","Freshwater","Acute","LC50","MORT",31000,"ug/L",200575,96,"Grass carp, white amur","Yes"]
["Cyprinus carpio","Freshwater","Acute","LC50","MORT",3200,"ug/L",215192,48,"Common carp","Yes"]
["Cyprinus carpio","Freshwater","Acute","LC50","MORT",2900,"ug/L",206270,96,"Common carp","Yes"]
["Lepomis macrochirus","Freshwater","Acute","LC50","MORT",7400,"ug/L",202871,48,"Bluegill ","Yes"]
["Lepomis macrochirus","Freshwater","Acute","LC50","MORT",8900,"ug/L",202085,96,"Bluegill ","Yes"]
["Lepomis macrochirus","Freshwater","Acute","LC50","MORT",4000,"ug/L",202871,96,"Bluegill ","Yes"]
["Lepomis macrochirus","Freshwater","Acute","LC50","MORT",7600,"ug/L",202085,96,"Bluegill ","Yes"]
["Lepomis macrochirus","Freshwater","Acute","LC50","MORT",5900,"ug/L",202085,96,"Bluegill ","Yes"]
["Lepomis macrochirus","Freshwater","Acute","LC50","MORT",8200,"ug/L",200666,96,"Bluegill ","Yes"]
["Lepomis macrochirus","Freshwater","Acute","LC50","MORT",3200,"ug/L",200344,96,"Bluegill ","Yes"]
["Lepomis macrochirus","Freshwater","Acute","LC50","MORT",84000,"ug/L",200344,96,"Bluegill ","Yes"]
["Lepomis macrochirus","Freshwater","Acute","LC50","MORT",2800,"ug/L",200344,96,"Bluegill ","Yes"]
["Morone saxatilis","Freshwater","Acute","LC50","MORT",500,"ug/L",202012,48,"Striped bass","Yes"]
["Morone saxatilis","Freshwater","Acute","LC50","MORT",8000,"ug/L",202012,48,"Striped bass","Yes"]
["Morone saxatilis","Freshwater","Acute","LC50","MORT",500,"ug/L",202012,72,"Striped bass","Yes"]
["Morone saxatilis","Freshwater","Acute","LC50","MORT",6000,"ug/L",202012,72,"Striped bass","Yes"]
["Morone saxatilis","Freshwater","Acute","LC50","MORT",3100,"ug/L",200909,96,"Striped bass","Yes"]
["Morone saxatilis","Freshwater","Acute","LC50","MORT",6000,"ug/L",202012,96,"Striped bass","Yes"]
["Morone saxatilis","Freshwater","Acute","LC50","MORT",500,"ug/L",202012,96,"Striped bass","Yes"]
["Oncorhynchus clarki","Freshwater","Acute","LC50","MORT",1400,"ug/L",200344,96,"Cutthroat trout","Yes"]
["Oncorhynchus clarki","Freshwater","Acute","LC50","MORT",710,"ug/L",200344,96,"Cutthroat trout","Yes"]
["Oncorhynchus clarki","Freshwater","Acute","LC50","MORT",1400,"ug/L",200666,96,"Cutthroat trout","Yes"]
["Oncorhynchus kisutch ","Freshwater","Acute","LC50","MORT",16000,"ug/L",200879,48,"Coho salmon,silver salmon","Yes"]
["Oncorhynchus mykiss","Freshwater","Acute","LC50","MORT",19600,"ug/L",200344,96,"Rainbow trout","Yes"]
["Oncorhynchus mykiss","Freshwater","Acute","LC50","MORT",23800,"ug/L",200344,96,"Rainbow trout","Yes"]
["Oncorhynchus mykiss","Freshwater","Acute","LC50","MORT",4900,"ug/L",200666,96,"Rainbow trout","Yes"]
["Oncorhynchus mykiss","Freshwater","Acute","LC50","MORT",16000,"ug/L",200666,96,"Rainbow trout","Yes"]
["Oncorhynchus mykiss","Freshwater","Acute","LC50","MORT",16000,"ug/L",200344,96,"Rainbow trout","Yes"]
["Oncorhynchus mykiss","Freshwater","Acute","LC50","MORT",1950,"ug/L",200344,96,"Rainbow trout","Yes"]
["Oryzias latipes","Freshwater","Acute","LC50","MORT",3500,"ug/L",215192,48,"Medaka, high-eyes","Yes"]
["Pimephales promelas","Freshwater","Acute","LC50","MORT",19900,"ug/L",212612,48,"Fathead minnow","Yes"]
["Pimephales promelas","Freshwater","Acute","LC50","MORT",14200,"ug/L",212858,96,"Fathead minnow","Yes"]
["Pimephales promelas","Freshwater","Acute","LC50","MORT",14200,"ug/L",200344,96,"Fathead minnow","Yes"]
["Rasbora heteromorpha","Freshwater","Acute","LC50","MORT",190000,"ug/L",200848,48,"Harlequinfish, red rasbora","Yes"]
["Salmonidae","Freshwater","Acute","LC50","MORT",1100,"ug/L",206270,96,"Trout family","Yes"]
["Salvelinus namaycush ","Freshwater","Acute","LC50","MORT",2700,"ug/L",200344,96,"Lake trout, siscowet","Yes"]
["Salvelinus namaycush ","Freshwater","Acute","LC50","MORT",1200,"ug/L",200344,96,"Lake trout, siscowet","Yes"]
["Salvelinus namaycush ","Freshwater","Acute","LC50","MORT",2700,"ug/L",200666,96,"Lake trout, siscowet","Yes"]
["Tinca tinca ","Freshwater","Acute","LC50","MORT",15500,"ug/L",206270,96,"Tench","Yes"]
["Asellus brevicaudus","Freshwater","Acute","LC50","MORT",15500,"ug/L",200666,96,"Aquatic sowbug","Yes"]
["Daphnia magna","Freshwater","Acute","LC50","MORT",400,"ug/L",206270,96,"Water flea","Yes"]
["Daphnia pulex","Freshwater","Acute","EC50","IMM",1400,"ug/L",200888,48,"Water flea ","Yes"]
["Daphnia pulex","Freshwater","Acute","EC50","IMM",1400,"ug/L",200666,48,"Water flea ","Yes"]
["Gammarus fasciatus","Freshwater","Acute","LC50","MORT",1800,"ug/L",200886,48,"Scud ","Yes"]
["Gammarus fasciatus","Freshwater","Acute","LC50","MORT",160,"ug/L",200344,96,"Scud ","Yes"]
["Gammarus fasciatus","Freshwater","Acute","LC50","MORT",160,"ug/L",200666,96,"Scud ","Yes"]
["Gammarus fasciatus","Freshwater","Acute","LC50","MORT",700,"ug/L",200886,96,"Scud ","Yes"]
["Gammarus lacustris","Freshwater","Acute","LC50","MORT",380,"ug/L",200885,48,"Scud","Yes"]
["Gammarus lacustris","Freshwater","Acute","LC50","MORT",160,"ug/L",200885,96,"Scud","Yes"]
["Simocephalus serrulatus","Freshwater","Acute","EC50","IMM",2000,"ug/L",200666,48,"Water flea","Yes"]
["Simocephalus serrulatus","Freshwater","Acute","EC50","IMM",2000,"ug/L",200888,48,"Water flea","Yes"]
["Aedes aegypti","Freshwater","Acute","LC50","MORT",1200,"ug/L",206270,96,"Mosquito","Yes"]
["Pteronarcys californica ","Freshwater","Acute","LC50","MORT",2800,"ug/L",200889,48,"Stonefly","Yes"]
["Pteronarcys californica ","Freshwater","Acute","LC50","MORT",1200,"ug/L",200666,96,"Stonefly","Yes"]
["Pteronarcys californica ","Freshwater","Acute","LC50","MORT",1200,"ug/L",200889,96,"Stonefly","Yes"]
["Pimephales promelas","Freshwater","Chronic","NOEC","MORT",33.400001525878906,"ug/L",212612,1536,"Fathead minnow","Yes"]
["Mugil curema","Marine","Acute","LC50","MORT",6300,"ug/L",202188,48,"White mullet","Yes"]
["Crassostrea virginica","Marine","Acute","EC50","GRO",1800,"ug/L",200646,96,"American or virginia oyster","Yes"]