{"text_format":"1","workbook":"xlsx","n_sheets":10,"sheets":["Copyright","Cover","Instruction","All Result","Sheet1","FW nonmetal nonplant","FW nonmetal nonplant_WS","FW nonmetal plant","FW nonmetal plant_WS","Sheet2"],"not_rendered":{"charts":0,"images":0,"macros":1,"external_links":0,"defined_names":1,"comments":3,"pivot_tables":0},"unopened":[],"bounds":{"document_bytes":16777216,"sheet_cells":100000,"rows_first":2000,"rows_last":500,"rows_between":2000,"halvings":0,"cell_chars":16384,"cell_head_chars":4096},"cells_cut":0,"cells_raw":0,"read":"whole","date_system":"1900"}

{"sheet":"Copyright","index":0,"n_rows":0,"n_cols":0,"rows_kept":0,"cut":false,"hidden":false,"merged":[]}

{"sheet":"Cover","index":1,"n_rows":20,"n_cols":7,"rows_kept":20,"cut":false,"hidden":false,"merged":[[18,6,18,8],[14,6,14,8],[13,6,13,8],[4,4,4,10],[9,6,9,8],[12,6,12,8],[5,5,6,9]]}
[]
[]
[]
[]
[null,null,null,null,"Ecotoxicity Data Quality Assessment Method V2"]
[null,null,null,null,null,"To be used to assess the quality of data used for the Australian and New Zealand Guidelines for Fresh and Marine Water Quality (including sediment) and the Australian National Environment Protection (Assessment of Site Contamination) Measure"]
[]
[]
[]
[null,null,null,null,null,null,"Developed by "]
{"$rows_left_out":11}
{"sheet":"Instruction","index":2,"n_rows":21,"n_cols":10,"rows_kept":21,"cut":false,"hidden":false,"merged":[[27,6,27,16],[14,6,14,7],[5,4,5,7]]}
[]
[]
[null,"Click here to see \"All Result\" -->","All Result"]
[]
[]
[null,null,null,null,"Freshwater "]
[]
[null,"Tabs contain questionaries -->           ","Freshwater/metal/nonplant",null,"Freshwater/non-metal/non-plant ",null,null,"Freshwater/metal/plant",null,"Freshwater/non-metal/plant"]
[]
[]
{"$rows_left_out":12}
{"sheet":"All Result","index":3,"n_rows":80,"n_cols":21,"rows_kept":80,"cut":false,"hidden":false,"merged":[]}
["Chemical:","Dioxin"]
["Medium:","Freshwater"]
[]
[{"$f":"'FW nonmetal plant'!C2","v":"Category"},{"$f":"'FW nonmetal plant'!C3","v":"Paper and data unique identifier(eg. 1-1,10-150)"},{"$f":"'FW nonmetal plant'!C70","v":"Total score"},{"$f":"'FW nonmetal plant'!C72","v":"Quality Score"},"Comment ",{"$f":"'FW nonmetal plant'!G3","v":"Species (Scientific name)"},{"$f":"'FW nonmetal plant'!G4","v":"Lifestage"},{"$f":"'FW nonmetal plant'!G5","v":"Exposure duration"},{"$f":"'FW nonmetal plant'!G6","v":"Measure of toxicity"},{"$f":"'FW nonmetal plant'!G7","v":"Toxicity endpoint"},{"$f":"'FW nonmetal plant'!G8","v":"Toxicity value"},{"$f":"'FW nonmetal plant'!J2","v":"Taxonomic group"},{"$f":"'FW nonmetal plant'!J3","v":"Phylum"},{"$f":"'FW nonmetal plant'!J4","v":"Class"},{"$f":"'FW nonmetal plant'!J5","v":"Media"},{"$f":"'FW nonmetal plant'!J6","v":"Temperature "},{"$f":"'FW nonmetal plant'!J7","v":"Acute Or Chronic "},{"$f":"'FW nonmetal plant'!J8","v":"PH"},"Salinity","Citation","Citation No."]
["Freshwater/non-metal/plant","50-1",34,0.37362637362637363,"The highest possible grade for this datum is acceptable.","Oedogonium cardiacum","Not stated","33 d","NOEC","Growth (Weight gain - fresh weight)",1330,"Green algae","Chlorophyta","Chlorophyceae","Not stated","Not stated","Chronic","Not stated","N.A.","Isensee AR and Jones GE (1978). Distribution of 2,3,7,8-tetrachlorodibenzo-p-dioxin (TCDD) in aquatic model ecosystem. Environmental Science and Technology, 9, 668-672.","50"]
["Freshwater/non-metal/non- plant","51-1",51,0.56043956043956045,"Acute NOEC not acceptable","Daphnia magna","Neonate <24h old","2 d + 7 d observation in clean water","NOEC","Mortality",1030,"Crustacean","Arthropoda","Branchiopoda","Well water","21-23","Acute","6.8-7.7","N.A.","Adams WJ, de Graeve GM, Sabourin TD, Cooney JD and Mosher GM (1986). Toxicity and bioconcentration of 2,3,7,8-TCDD to fathead minnows (Pimephales promelas). Chemosphere, 15, 1503-1511.","51"]
["Freshwater/non-metal/non- plant","51-2",51,0.56043956043956045,"Acute NOEC not acceptable","Daphnia magna","7 d old","2 d + 7 d observation in clean water","NOEC","Mortality",1030,"Crustacean","Arthropoda","Branchiopoda","Well water","21-23","Acute","6.8-7.7","N.A.","Adams WJ, de Graeve GM, Sabourin TD, Cooney JD and Mosher GM (1986). Toxicity and bioconcentration of 2,3,7,8-TCDD to fathead minnows (Pimephales promelas). Chemosphere, 15, 1503-1511.","51"]
["Freshwater/non-metal/non- plant","51-3",51,0.56043956043956045,"Acute NOEC not acceptable","Daphnia magna","21 d old","2 d + 7 d observation in clean water","NOEC","Mortality",1030,"Crustacean","Arthropoda","Branchiopoda","Well water","21-23","Acute","6.8-7.7","N.A.","Adams WJ, de Graeve GM, Sabourin TD, Cooney JD and Mosher GM (1986). Toxicity and bioconcentration of 2,3,7,8-TCDD to fathead minnows (Pimephales promelas). Chemosphere, 15, 1503-1511.","51"]
["Freshwater/non-metal/non- plant","51-4",51,0.5714285714285714,"Acute NOEC not acceptable","Pimephales promelas","Juveniles 1 - 2 g","4 d + 60 d observation in clean water","NOEC","Mortality",0.70,"Fish","Chordata","Actinopteriygii","Well water","21-23","Acute","6.8-7.7","N.A.","Adams WJ, de Graeve GM, Sabourin TD, Cooney JD and Mosher GM (1986). Toxicity and bioconcentration of 2,3,7,8-TCDD to fathead minnows (Pimephales promelas). Chemosphere, 15, 1503-1511.","51"]
["Freshwater/non-metal/non- plant","51-5",51,0.5714285714285714,"Acute LOEC not acceptable","Pimephales promelas","Juveniles 1 - 2 g","4 d + 60 d observation in clean water","LOEC","Mortality",7.10,"Fish","Chordata","Actinopteriygii","Well water","21-23","Acute","6.8-7.7","N.A.","Adams WJ, de Graeve GM, Sabourin TD, Cooney JD and Mosher GM (1986). Toxicity and bioconcentration of 2,3,7,8-TCDD to fathead minnows (Pimephales promelas). Chemosphere, 15, 1503-1511.","51"]
{"$rows_left_out":71}
{"sheet":"Sheet1","index":4,"n_rows":70,"n_cols":29,"rows_kept":70,"cut":false,"hidden":true,"merged":[]}
[]
[{"$f":"#REF!","v":{"$error":"#REF!"}},{"$f":"#REF!","v":{"$error":"#REF!"}},{"$f":"#REF!","v":{"$error":"#REF!"}},{"$f":"#REF!","v":{"$error":"#REF!"}},{"$f":"#REF!","v":{"$error":"#REF!"}},{"$f":"#REF!","v":{"$error":"#REF!"}},{"$f":"#REF!","v":{"$error":"#REF!"}},{"$f":"#REF!","v":{"$error":"#REF!"}},{"$f":"#REF!","v":{"$error":"#REF!"}},{"$f":"#REF!","v":{"$error":"#REF!"}},{"$f":"#REF!","v":{"$error":"#REF!"}},{"$f":"#REF!","v":{"$error":"#REF!"}},{"$f":"#REF!","v":{"$error":"#REF!"}},{"$f":"#REF!","v":{"$error":"#REF!"}},{"$f":"#REF!","v":{"$error":"#REF!"}},{"$f":"#REF!","v":{"$error":"#REF!"}},{"$f":"#REF!","v":{"$error":"#REF!"}},{"$f":"#REF!","v":{"$error":"#REF!"}},{"$f":"#REF!","v":{"$error":"#REF!"}},{"$f":"#REF!","v":{"$error":"#REF!"}},{"$f":"#REF!","v":{"$error":"#REF!"}},{"$f":"#REF!","v":{"$error":"#REF!"}},{"$f":"#REF!","v":{"$error":"#REF!"}},{"$f":"#REF!","v":{"$error":"#REF!"}},{"$f":"#REF!","v":{"$error":"#REF!"}},{"$f":"#REF!","v":{"$error":"#REF!"}}]
[{"$f":"#REF!","v":{"$error":"#REF!"}},{"$f":"#REF!","v":{"$error":"#REF!"}},{"$f":"#REF!","v":{"$error":"#REF!"}},{"$f":"#REF!","v":{"$error":"#REF!"}}]
[{"$f":"#REF!","v":{"$error":"#REF!"}},{"$f":"#REF!","v":{"$error":"#REF!"}},{"$f":"#REF!","v":{"$error":"#REF!"}},{"$f":"#REF!","v":{"$error":"#REF!"}},{"$f":"#REF!","v":{"$error":"#REF!"}},{"$f":"#REF!","v":{"$error":"#REF!"}},{"$f":"#REF!","v":{"$error":"#REF!"}},{"$f":"#REF!","v":{"$error":"#REF!"}},{"$f":"#REF!","v":{"$error":"#REF!"}},{"$f":"#REF!","v":{"$error":"#REF!"}},{"$f":"#REF!","v":{"$error":"#REF!"}},{"$f":"#REF!","v":{"$error":"#REF!"}},{"$f":"#REF!","v":{"$error":"#REF!"}},{"$f":"#REF!","v":{"$error":"#REF!"}},{"$f":"#REF!","v":{"$error":"#REF!"}},{"$f":"#REF!","v":{"$error":"#REF!"}},{"$f":"#REF!","v":{"$error":"#REF!"}},{"$f":"#REF!","v":{"$error":"#REF!"}},{"$f":"#REF!","v":{"$error":"#REF!"}},{"$f":"#REF!","v":{"$error":"#REF!"}},{"$f":"#REF!","v":{"$error":"#REF!"}},{"$f":"#REF!","v":{"$error":"#REF!"}},{"$f":"#REF!","v":{"$error":"#REF!"}},{"$f":"#REF!","v":{"$error":"#REF!"}},{"$f":"#REF!","v":{"$error":"#REF!"}},{"$f":"#REF!","v":{"$error":"#REF!"}}]
["Answers",{"$f":"IF(#REF!=0,\"\",#REF!)","v":{"$error":"#REF!"}},{"$f":"IF(#REF!=0,\"\",#REF!)","v":{"$error":"#REF!"}},{"$f":"IF(#REF!=0,\"\",#REF!)","v":{"$error":"#REF!"}},{"$f":"IF(#REF!=0,\"\",#REF!)","v":{"$error":"#REF!"}},{"$f":"IF(#REF!=0,\"\",#REF!)","v":{"$error":"#REF!"}},{"$f":"IF(#REF!=0,\"\",#REF!)","v":{"$error":"#REF!"}},{"$f":"IF(#REF!=0,\"\",#REF!)","v":{"$error":"#REF!"}},{"$f":"IF(#REF!=0,\"\",#REF!)","v":{"$error":"#REF!"}},{"$f":"IF(#REF!=0,\"\",#REF!)","v":{"$error":"#REF!"}},{"$f":"IF(#REF!=0,\"\",#REF!)","v":{"$error":"#REF!"}},{"$f":"IF(#REF!=0,\"\",#REF!)","v":{"$error":"#REF!"}},{"$f":"IF(#REF!=0,\"\",#REF!)","v":{"$error":"#REF!"}},{"$f":"IF(#REF!=0,\"\",#REF!)","v":{"$error":"#REF!"}},{"$f":"IF(#REF!=0,\"\",#REF!)","v":{"$error":"#REF!"}},{"$f":"IF(#REF!=0,\"\",#REF!)","v":{"$error":"#REF!"}},{"$f":"IF(#REF!=0,\"\",#REF!)","v":{"$error":"#REF!"}},{"$f":"IF(#REF!=0,\"\",#REF!)","v":{"$error":"#REF!"}},{"$f":"IF(#REF!=0,\"\",#REF!)","v":{"$error":"#REF!"}},{"$f":"IF(#REF!=0,\"\",#REF!)","v":{"$error":"#REF!"}},{"$f":"IF(#REF!=0,\"\",#REF!)","v":{"$error":"#REF!"}},{"$f":"IF(#REF!=0,\"\",#REF!)","v":{"$error":"#REF!"}},{"$f":"IF(#REF!=0,\"\",#REF!)","v":{"$error":"#REF!"}},{"$f":"IF(#REF!=0,\"\",#REF!)","v":{"$error":"#REF!"}}]
[{"$f":"#REF!","v":{"$error":"#REF!"}},{"$f":"#REF!","v":{"$error":"#REF!"}},{"$f":"#REF!","v":{"$error":"#REF!"}},{"$f":"#REF!","v":{"$error":"#REF!"}},{"$f":"#REF!","v":{"$error":"#REF!"}},{"$f":"#REF!","v":{"$error":"#REF!"}},{"$f":"#REF!","v":{"$error":"#REF!"}},{"$f":"#REF!","v":{"$error":"#REF!"}}]
[{"$f":"#REF!","v":{"$error":"#REF!"}},{"$f":"#REF!","v":{"$error":"#REF!"}},{"$f":"#REF!","v":{"$error":"#REF!"}},{"$f":"#REF!","v":{"$error":"#REF!"}},{"$f":"#REF!","v":{"$error":"#REF!"}},{"$f":"IF(#REF!=0,\"\",#REF!)","v":{"$error":"#REF!"}},{"$f":"IF(#REF!=0,\"\",#REF!)","v":{"$error":"#REF!"}},{"$f":"IF(#REF!=0,\"\",#REF!)","v":{"$error":"#REF!"}}]
[]
[]
[]
{"$rows_left_out":61}
{"sheet":"FW nonmetal nonplant","index":5,"n_rows":81,"n_cols":53,"rows_kept":81,"cut":false,"hidden":false,"merged":[[9,2,9,4],[11,2,13,2],[11,7,13,7],[14,2,16,2],[14,7,16,7],[17,2,19,2],[17,7,19,7],[20,2,21,2],[20,7,21,7],[22,2,24,2],[22,7,24,7],[25,2,27,2],[25,7,27,7],[28,2,30,2],[28,7,30,7],[31,2,33,2],[31,7,33,7],[34,2,36,2],[34,7,36,7],[37,2,39,2],[37,7,39,7],[40,2,42,2],[40,7,42,7],[43,2,45,2],[43,7,45,7],[46,2,48,2],[46,7,48,7],[49,2,51,2],[49,7,51,7],[65,2,68,2],[65,7,68,7],[59,7,61,7],[52,2,54,2],[52,7,54,7],[56,7,58,7],[62,2,64,2],[62,7,64,7]]}
[null,1,"Fill in the blank cells below, based on information provided in the paper being assessed. You can either pick an option from the dropdown list or add the appropriate detail using the 'Add to list' button. ",null,null,null,null,null,null,null,null,null,null,null,"* All the text in RED are used for drop down list ,make changes with caution."]
[null,null,"Category",{"$f":"IF(AF3=\"\",0,1)","v":1},"Freshwater/non-metal/non- plant",{"$f":"IF(E3=\"\",0,1)","v":1},"Citation No.",{"$f":"IF(ISERROR(FIND(\"-\",E3)),E3,LEFT(E3,FIND(\"-\",E3)-1))","v":"73"},null,"Taxonomic group",null,null,null,null,"Species",null,null,"Lifestage",null,null,"Exposure duration",null,null,"Measure of toxicity",null,null,"Toxicity endpoint",null,null,"Taxonomic group",null,null,"Phylum",null,null,"Class",null,null,"Media",null,null,"Temperature ",null,null,"Acute Or Chronic",null,null,"PH",null,null,"Salinity/Comdictivity"]
[null,null,"Paper and data unique identifier(eg. 1-1,10-150)",{"$f":"IF(AI3=\"\",0,1)","v":1},"73-1",{"$f":"IF('FW nonmetal plant'!E4=\"\",0,1)","v":1},"Species (Scientific name)",null,null,"Phylum",null,null,null,null,"Aedes albopictus",27,{"$f":"IF(P3=0,\"\",INDEX(O3:O102,P3))","v":"Xenopus laevis"},"1 month",42,{"$f":"IF(S3=0,\"\",INDEX(R3:R102,S3))","v":"Tadpoles stage 48-55"},"11 hour",52,{"$f":"IF(V3=0,\"\",INDEX(U3:U102,V3))","v":"30d + 21d observation"},"LC50",46,{"$f":"IF(Y3=0,\"\",INDEX(X3:X102,Y3))","v":"LC20"},"Mortality",35,{"$f":"IF(AB3=0,\"\",INDEX(AA3:AA102,AB3))","v":"Mortality"},"Fish",13,{"$f":"IF(AE3=0,\"\",INDEX(AD3:AD102,AE3))","v":"Amphibian"},"Chlorophyta",11,{"$f":"IF(AH3=0,\"\",INDEX(AG3:AG102,AH3))","v":"Chordata"},"Branchiopoda",12,{"$f":"IF(AK3=0,\"\",INDEX(AJ3:AJ102,AK3))","v":"Amphibia"},"Freshwater",18,{"$f":"IF(AN3=0,\"\",INDEX(AM3:AM102,AN3))","v":"Well water"},"15°C",33,{"$f":"IF(AQ3=0,\"\",INDEX(AP3:AP102,AQ3))","v":"20 +/- 1"},"Acute ",11,{"$f":"IF(AT3=0,\"\",INDEX(AS3:AS102,AT3))","v":"Chronic"},"N.A.",20,{"$f":"IF(AW3=0,\"\",INDEX(AV3:AV102,AW3))","v":"Not stated"},null,null,"N.A."]
[null,null,"Citation",{"$f":"IF(AL3=\"\",0,1)","v":1},"Adams WJ, de Graeve GM, Sabourin TD, Cooney JD and Mosher GM (1986). Toxicity and bioconcentration of 2,3,7,8-TCDD to fathead minnows (Pimephales promelas). Chemosphere, 15, 1503-1511.",{"$f":"IF(H8=\"\",0,1)","v":1},"Lifestage",null,null,"Class",null,null,null,null,"Australian Bass",null,null,"1 year old",null,null,"13 days",null,null,"N.A.",null,null,"N.A.",null,null,"Microalga",null,null,"N.A.",null,null,"Chlorophyceae  ",null,null,"Marinewater",null,null,"25°C",null,null,"Chronic",null,null,"PH11"]
[null,null,null,{"$f":"IF(AO3=\"\",0,1)","v":1},null,{"$f":"IF(W3=\"\",0,1)","v":1},"Exposure duration",null,null,"Media",null,null,null,null,"N.A.",null,null,"N.A.",null,null,"N.A.",null,null,"NOEC",null,null,"Reproduction",null,null,"N.A.",null,null,"Tracheophyta",null,null,"N.A.",null,null,"N.A.",null,null,"N.A.",null,null,"N.A.",null,null,"PH7.0"]
[null,null,null,{"$f":"IF(AR3=\"\",0,1)","v":1},null,{"$f":"IF(Q3=\"\",0,1)","v":1},"Measure of toxicity",null,null,"Temperature ",null,null,null,null,"Oedogonium cardiacum",null,null,"Not stated",null,null,"33 d",null,null,"NOEC",null,null,"Growth (Weight gain - fresh weight)",null,null,"Green algae",null,null,"Chlorophyta",null,null,"Chlorophyceae",null,null,"Not stated",null,null,"Not stated",null,null,"Acute",null,null,"Not stated"]
[null,null,null,{"$f":"IF(AU3=\"\",0,1)","v":1},null,{"$f":"IF(T3=\"\",0,1)","v":1},"Toxicity endpoint",null,null,"Acute Or Chronic ",null,null,null,null,"Daphnia magna",null,null,"Neonate <24 h old",null,null,"2 d + 7 d observation",null,null,"NOEC + LOEC",null,null,"Mortality",null,null,"Crustacean",null,null,"Arthropoda",null,null,"Branchiopoda",null,null,"Well water",null,null,"21-23",null,null,"Chronic",null,null,"6.8-7.7"]
[null,null,null,null,null,{"$f":"IF(W3=\"\",0,1)","v":1},"Toxicity value",100,null,"PH",null,null,null,null,"Pimephales promelas",null,null,"Juveniles 0.5 - 1.0 g",null,null,"4 d + 60 d observation",null,null,"NOEC",null,null,"Reproduction (biomass)",null,null,"Fish",null,null,"Chordata",null,null,"Actinopterigyii",null,null,"Lake Superior filterd",null,null,"23-27",null,null,"Acute",null,null,6.90]
[null,2,"Select the appropriate answer option to each question. Comments can be added to the cells in column H.",null,null,{"$f":"IF(Z3=\"\",0,1)","v":1},null,null,null,"Salinity/Conductivity","N.A.",null,null,null,"Daphnia magna",null,null,"Neonate <24h old",null,null,"2 d + 7 d observation in clean water",null,null,"LOEC",null,null,"Mortality",null,null,"Crustacean",null,null,"Arthropoda",null,null,"Branchiopoda",null,null,"Not stated",null,null,"2015-12-18",null,null,"Chronic",null,null,"Not stated"]
[null,"*","If the selected answer option does not work try clicking on any other cell first and then click back on the answer option again.",null,null,{"$f":"IF(AC3=\"\",0,1)","v":1},null,null,null,null,null,null,null,null,"Pimephales promelas",null,null,"7 d old",null,null,"4 d + 60 d observation in clean water",null,null,"LC53",null,null,"Reproduction - hatching",null,null,"Fish",null,null,"Chordata",null,null,"Actinopteriygii",null,null,"Dechlorinated tap water",null,null,"2015-12-18",null,null,"Acute",null,null,"6.5-7.0"]
{"$rows_left_out":72}
{"sheet":"FW nonmetal nonplant_WS","index":6,"n_rows":252,"n_cols":24,"rows_kept":252,"cut":false,"hidden":false,"merged":[]}
[]
["Question No.",1,2,3,4,5,6,7,8,9,10,11,12,13,14,15,16.10,16.60,17,18,"Total Score","Quality Score",null,"Comment "]
["Short Questions","Duration of the exposure ","Biological endpoint","Biological effect stated or not","Biological effect quantified or not","Appropriate controls","Control & contaminant concentration","Test acceptability criteria","Characteristics of the test organism"," Type of test media","Type of exposure","Contaminant concentrations","Parallel reference toxicant toxicity tests","Concentration–response relationship","Determine the toxicity","NOEC/LOEC or LC/EC/BEC","pH","Dissolved oxygen","Temperature","Grade or purity"]
["Category","Freshwater/non-metal/non- plant","Paper and data unique identifier(eg. 1-1,10-150)","50-1"]
["Scores",10,0,5,0,5,5,0,0,0,0,4,0,4,0,0,1,0,0,0,34,0.37362637362637363,null,""]
["Answers","33 d","Not provided","NOEC","Not provided","Control (no dioxin)","2-3 replicates","Not provided","Not provided","Not provided","Inferred static","Maximum concentration 1330 ng/L","Not conducted","Concentration-response for bioaccumulation but no effect at highest concentration","Not provided","Not provided","Details provided in Isensee et al (1973) Environ. Sci. Technol. 7: 841.","Not provided","Not provided","No details given"]
["Category","Freshwater/non-metal/non- plant","Paper and data unique identifier(eg. 1-1,10-150)","51.1"]
["Scores",10,5,5,0,5,0,5,5,5,4,4,0,0,0,0,1,1,1,0,51,0.56043956043956045,null,""]
["Answers","2 d + 7 d observation in clean water","\"mortality\" stated","NOEC","No details provided","Control (no dioxin)","2 replicates","Not provided","<24h neonates","Well water & pH, temperature, hardness, DO measured","Static but changed every 2 days","No mortality at maximum concentration 1030 ng/L","Not conducted","no effect at highest concentration","Not provided","Not provided","6.8-7.7","4.5-8.3 mg/L","21-23","No details given - apart from tritiated TCDD, where purity is inferred"]
["Category",null,"Paper and data unique identifier(eg. 1-1,10-150)"]
{"$rows_left_out":243}
{"sheet":"FW nonmetal plant","index":7,"n_rows":79,"n_cols":53,"rows_kept":79,"cut":false,"hidden":false,"merged":[[3,4,7,4],[9,2,9,4],[11,2,13,2],[11,7,13,7],[14,2,16,2],[14,7,16,7],[17,2,19,2],[17,7,19,7],[20,2,21,2],[20,7,21,7],[22,2,24,2],[22,7,24,7],[25,2,27,2],[25,7,27,7],[28,2,30,2],[28,7,30,7],[31,2,33,2],[31,7,33,7],[34,2,36,2],[34,7,36,7],[37,2,39,2],[37,7,39,7],[40,2,42,2],[40,7,42,7],[43,2,45,2],[43,7,45,7],[46,2,48,2],[46,7,48,7],[49,2,51,2],[49,7,51,7],[60,2,62,2],[60,7,62,7],[63,2,66,2],[63,7,66,7],[52,2,54,2],[52,7,54,7],[56,2,59,2],[56,7,59,7]]}
[null,1,"Fill in the blank cells below, based on information provided in the paper being assessed. You can either pick an option from the dropdown list or add the appropriate detail using the 'Add to list' button. ",null,null,null,null,null,null,null,null,null,null,null,"* All the text in RED are used for drop down list ,make changes with caution."]
[null,null,"Category",{"$f":"IF(AF3=\"\",0,1)","v":1},"Freshwater/non-metal/plant",{"$f":"IF(E3=\"\",0,1)","v":1},"Citation No.",{"$f":"IF(ISERROR(FIND(\"-\",E3)),E3,LEFT(E3,FIND(\"-\",E3)-1))","v":"50"},null,"Taxonomic group",null,null,null,null,"Species",null,null,"Lifestage",null,null,"Exposure duration",null,null,"Measure of toxicity",null,null,"Toxicity endpoint",null,null,"Taxonomic group",null,null,"Phylum",null,null,"Class",null,null,"Media",null,null,"Temperature ",null,null,"Acute Or Chronic",null,null,"PH",null,null,"Salinity/Conductivity"]
[null,null,"Paper and data unique identifier(eg. 1-1,10-150)",{"$f":"IF(AI3=\"\",0,1)","v":1},"50-1",{"$f":"IF(#REF!=\"\",0,1)","v":{"$error":"#REF!"}},"Species (Scientific name)",null,null,"Phylum",null,null,null,null,"Aedes albopictus",5,{"$f":"IF(P3=0,\"\",INDEX(O3:O100,P3))","v":"Oedogonium cardiacum"},"1 month",5,{"$f":"IF(S3=0,\"\",INDEX(R3:R100,S3))","v":"Not stated"},"11 hours",5,{"$f":"IF(V3=0,\"\",INDEX(U3:U100,V3))","v":"33 d"},"LC50",5,{"$f":"IF(Y3=0,\"\",INDEX(X3:X100,Y3))","v":"NOEC"},"Mortality",5,{"$f":"IF(AB3=0,\"\",INDEX(AA3:AA100,AB3))","v":"Growth (fresh weight)"},"Fish",4,{"$f":"IF(AE3=0,\"\",INDEX(AD3:AD100,AE3))","v":"Green algae"},"Chlorophyta",4,{"$f":"IF(AH3=0,\"\",INDEX(AG3:AG100,AH3))","v":"Chlorophyta"},"Branchiopoda",4,{"$f":"IF(AK3=0,\"\",INDEX(AJ3:AJ102,AK3))","v":"Chlorophyceae"},"Freshwater",5,{"$f":"IF(AN3=0,\"\",INDEX(AM3:AM100,AN3))","v":"Not stated"},"15°C",5,{"$f":"IF(AQ3=0,\"\",INDEX(AP3:AP100,AQ3))","v":"Not stated"},"Acute ",2,{"$f":"IF(AT3=0,\"\",INDEX(AS3:AS100,AT3))","v":"Chronic"},"N.A.",4,{"$f":"IF(AW3=0,\"\",INDEX(AV3:AV100,AW3))","v":7.50},"30 ppt",null,"N.A."]
[null,null,"Citation",{"$f":"IF(AL3=\"\",0,1)","v":1},"Isensee AR and Jones GE (1978). Distribution of 2,3,7,8-tetrachlorodibenzo-p-dioxin (TCDD) in aquatic model ecosystem. Environmental Science and Technology, 9, 668-672.",{"$f":"IF(AX3=\"\",0,1)","v":1},"Lifestage",null,null,"Class",null,null,null,null,"Australian Bass",null,null,"1 year old",null,null,"13 days ",null,null,"N.A.",null,null,"N.A.",null,null,"Microalga",null,null,"N.A.",null,null,"Chlorophyceae",null,null,"Marinewater",null,null,"25°C",null,null,"Chronic",null,null,"PH11",null,null,"150 uS/cm"]
[null,null,null,{"$f":"IF(AO3=\"\",0,1)","v":1},null,{"$f":"IF(H8=\"\",0,1)","v":1},"Exposure duration",null,null,"Media",null,null,null,null,"N.A.",null,null,"N.A.",null,null,"N.A.",null,null,"NOEC",null,null,"Reproduction",null,null,"N.A.",null,null,"Tracheophyta",null,null,"N.A.",null,null,"N.A.",null,null,"N.A.",null,null,"N.A.",null,null,"PH7.0",null,null,"N.A."]
[null,null,null,{"$f":"IF(AR3=\"\",0,1)","v":1},null,{"$f":"IF(Q3=\"\",0,1)","v":1},"Measure of toxicity",null,null,"Temperature ",null,null,null,null,"Pseudokirchneriella subcapitata",null,null,"Exponential growth",null,null,"21 d",null,null,"EC50",null,null,"Growth (biomass)",null,null,"Green algae",null,null,"Chlorophyta",null,null,"Chlorophyceae",null,null,"AAM ",null,null,24,null,null,null,null,null,7.50]
[null,null,null,{"$f":"IF(AU3=\"\",0,1)","v":1},null,{"$f":"IF(T3=\"\",0,1)","v":1},"Toxicity endpoint",null,null,"Acute Or Chronic ",null,null,null,null,"Oedogonium cardiacum",null,null,"Not stated",null,null,"33 d",null,null,"NOEC",null,null,"Growth (fresh weight)",null,null,null,null,null,null,null,null,null,null,null,"Not stated",null,null,"Not stated"]
[null,null,null,null,null,{"$f":"IF(W3=\"\",0,1)","v":1},"Toxicity value",1330,null,"PH"]
[null,2,"Select the appropriate answer option to each question. Comments can be added to the cells in column H.",null,null,{"$f":"IF(Z3=\"\",0,1)","v":1},null,null,null,"Salinity/Conductivity","N.A."]
[null,"*","If the selected answer option does not work try clicking on any other cell first and then click back on the answer option again.",null,null,{"$f":"IF(AC3=\"\",0,1)","v":1}]
{"$rows_left_out":70}
{"sheet":"FW nonmetal plant_WS","index":8,"n_rows":9,"n_cols":22,"rows_kept":9,"cut":false,"hidden":false,"merged":[]}
[]
["Question No.",1,2,3,4,5,6,7,8,9,10,11,12,13,14,15,16.10,17,18,"Total Score","Quality Score","Comment "]
["Short Questions","Duration of the exposure ","Biological endpoint","Biological effect stated or not","Biological effect quantified or not","Appropriate controls","Control & contaminant concentration","Test acceptability criteria","Characteristics of the test organism"," Type of test media","Type of exposure","Contaminant concentrations","Parallel reference toxicant toxicity tests","Concentration–response relationship","Determine the toxicity","NOEC/LOEC or LC/EC/BEC","pH","Temperature","Grade or purity"]
["Category","Freshwater/non-metal/plant","Paper and data unique identifier(eg. 1-1,10-150)","50-1"]
["Scores",10,0,5,0,5,5,0,0,0,0,4,0,0,4,4,0,0,3,40,0.45454545454545453,""]
["Answers","33 d","Only stated that 'all organisms prospered' imdicating no effects","NOEC","Not quantified","Control - no dioxin","2-3 replicates","Not provided","Just added strands of algae","Not provided","Inferred (static)","Not measured","No ref tox","Inferred","95% CL (550-582)","95% CL (550-582)","Ref to USEPA method","Ref to USEPA method","reagent grade chemical(Cr chloride)"]
["Category","Freshwater/non-metal/plant","Paper and data unique identifier(eg. 1-1,10-150)","50-1"]
["Scores",10,0,5,0,5,5,0,0,0,0,4,0,0,4,4,0,0,3,40,0.45454545454545453,""]
["Answers","33 d","Only stated that 'all organisms prospered' imdicating no effects","NOEC","Not quantified","Control - no dioxin","2-3 replicates","Not provided","Just added strands of algae","Not provided","Inferred (static)","Not measured","No ref tox","Inferred","95% CL (550-582)","95% CL (550-582)","Ref to USEPA method","Ref to USEPA method","reagent grade chemical(Cr chloride)"]

{"sheet":"Sheet2","index":9,"n_rows":0,"n_cols":0,"rows_kept":0,"cut":false,"hidden":false,"merged":[]}