{"text_format":"1","workbook":"xlsx","n_sheets":9,"sheets":["Copyright","Cover","Instruction","All Result","Sheet1","MEW nonplant","MEW nonplant_WS","MEW plant","MEW plant_WS"],"not_rendered":{"charts":0,"images":0,"macros":1,"external_links":0,"defined_names":0,"comments":3,"pivot_tables":0},"unopened":[],"bounds":{"document_bytes":16777216,"sheet_cells":100000,"rows_first":2000,"rows_last":500,"rows_between":2000,"halvings":0,"cell_chars":16384,"cell_head_chars":4096},"cells_cut":0,"cells_raw":0,"read":"whole","date_system":"1900"}

{"sheet":"Copyright","index":0,"n_rows":0,"n_cols":0,"rows_kept":0,"cut":false,"hidden":false,"merged":[]}

{"sheet":"Cover","index":1,"n_rows":20,"n_cols":7,"rows_kept":20,"cut":false,"hidden":false,"merged":[[18,6,18,8],[14,6,14,8],[13,6,13,8],[4,4,4,10],[9,6,9,8],[12,6,12,8],[5,5,6,9]]}
[]
[]
[]
[]
[null,null,null,null,"Ecotoxicity Data Quality Assessment Method V2"]
[null,null,null,null,null,"To be used to assess the quality of data used for the Australian and New Zealand Guidelines for Fresh and Marine Water Quality (including sediment) and the Australian National Environment Protection (Assessment of Site Contamination) Measure"]
[]
[]
[]
[null,null,null,null,null,null,"Developed by "]
{"$rows_left_out":11}
{"sheet":"Instruction","index":2,"n_rows":21,"n_cols":10,"rows_kept":21,"cut":false,"hidden":false,"merged":[[27,6,27,16],[14,6,14,7],[5,4,5,7]]}
[]
[]
[null,"Click here to see \"All Result\" -->","All Result"]
[]
[]
[null,null,null,null,"Freshwater "]
[]
[null,"Tabs contain questionaries -->           ","Freshwater/metal/nonplant",null,"Freshwater/non-metal/non-plant ",null,null,"Freshwater/metal/plant",null,"Freshwater/non-metal/plant"]
[]
[]
{"$rows_left_out":12}
{"sheet":"All Result","index":3,"n_rows":43,"n_cols":21,"rows_kept":43,"cut":false,"hidden":false,"merged":[]}
["Chemical:","Copper"]
["Medium:","Marine"]
[{"$f":"'MEW nonplant'!C2","v":"Category"},{"$f":"'MEW nonplant'!C3","v":"Paper and data unique identifier(eg. 1-1,10-150)"},{"$f":"'MEW nonplant'!C70","v":0},{"$f":"'MEW nonplant'!C72","v":0},"Comment ",{"$f":"'MEW nonplant'!G3","v":"Species (Scientific name)"},{"$f":"'MEW nonplant'!G4","v":"Lifestage"},{"$f":"'MEW nonplant'!G5","v":"Exposure duration"},{"$f":"'MEW nonplant'!G6","v":"Measure of toxicity"},{"$f":"'MEW nonplant'!G7","v":"Toxicity endpoint"},{"$f":"'MEW nonplant'!G8","v":"Toxicity value"},{"$f":"'MEW nonplant'!J2","v":"Taxonomic group"},{"$f":"'MEW nonplant'!J3","v":"Phylum"},{"$f":"'MEW nonplant'!J4","v":"Class"},{"$f":"'MEW nonplant'!J5","v":"Media"},{"$f":"'MEW nonplant'!J6","v":"Temperature "},{"$f":"'MEW nonplant'!J7","v":"Acute Or Chronic "},{"$f":"'MEW nonplant'!J8","v":"PH"},"Slinity","Citation","Citation No."]
["MEW_nonplant","1435-2",75,0.7978723404255319,"The highest possible grade for this datum is acceptable.","Haliotis iris","Larvae","3 d","EC10","Normal development",0.70,"Molluscs","Mollusca","Gastropoda","seawater",14,"Chronic",8,"34 ppt","Rouchon, A. (2015). Effects of metal toxicity on the early life stages of the sea urchin Evechinus chloroticus. A thesis submitted to the Victoria University of Wellington in fulfilment of the requirements for the degree of Doctor of Philosophy in Marine Biology. Victoria University of Wellington. 211 p.","1435"]
["MEW_nonplant","1435-1",75,0.7978723404255319,"The highest possible grade for this datum is acceptable.","Evechinus chloroticus","Larvae","3 d","EC10","Normal development",2.10,"Echinoderms","Echinodermata","Echinoidea","seawater",16,"Chronic",8,"34 ppt","Rouchon, A. (2015). Effects of metal toxicity on the early life stages of the sea urchin Evechinus chloroticus. A thesis submitted to the Victoria University of Wellington in fulfilment of the requirements for the degree of Doctor of Philosophy in Marine Biology. Victoria University of Wellington. 211 p.","1435"]
["MEW_nonplant","1442-1",58,0.61702127659574468,"","Platygyra daedalea","Gametes","5 hr","EC10","Fertilisation",1.40,"Cnidaria","Cnidaria","Anthozoa","seawater","NR","Chronic","NR","NR","Reichelt-Brushett A, Hudspith M. (2016). The effects of metals of emerging concern on the fertilization success of gametes of the tropical scleractinian coral Platygyra daedalea. Chemosphere 150, 398-406.","1442"]
["MEW_nonplant","669-1",72,0.76595744680851063,"","Mimachlamys asperrima","Larvae","48 h","NOEC","Normal development",2,"Molluscs","Mollusca","Bivalve","seawater",18,"Chronic","NR","33 ppt","Krassoi R, Anderson I, Everett D. (1997). Larval abnormalities in doughboy scallops Chlamys (Mimachlamys) asperrima I in response to test conditions and six reference toxicants. Australasian Journal of Ecotoxicology 3, 65-74.","669"]
["MEW_plant","1281-2",66,0.72527472527472525,"","Entomoneis c.f. punctulata","Exponentially-growing","72 h","NOEC","Population growth",0.30,"Diatom","Bacillariophyta","Bacillariophyceae","Filtered seawater",21,"Chronic",8,"34 ppt","Stauber JL, Binet MT, Bao VWW, Boge J, Zhang AQ, Leung KMY, Adams MS. (2008). Comparison of the Qwiklite algal bioluminescence test with marine algal growth rate inhibition bioassays. Environmental Toxicology 23, 617-625.","1281"]
["MEW_plant","1181-2 & 1181-",72,0.79120879120879117,"","Phaeodactylum tricornutum","Exponentially-growing","2 d","IC15","Population growth",1.90,"Diatom","Bacillariophyta","Bacillariophyceae","Filtered seawater",21,"Chronic","NR","NR","Simpson SL, Roland MGE, Stauber JL, Batley GE. (2003). Effect of declining toxicant concentrations on algal bioassay endpoints. Environmental Toxicology and Chemistry 22, 2073-2079.","1181"]
["MEW_plant","1379-2",64,0.70329670329670335,"","Phaeodactylum tricornutum","Exponentially-growing","72 h","IC10","Growth",1.50,"Diatom","Bacillariophyta","Bacillariophyceae","Filtered seawater",21,"Chronic",8.1999999999999993,35,"Osborn HL, Hook SE. (2013). Using transcriptomic profiles in the diatom Phaeodactylum tricornutum to identify and prioritize stressors. Aquatic Toxicology 138, 12-25.","1379"]
{"$rows_left_out":34}
{"sheet":"Sheet1","index":4,"n_rows":70,"n_cols":29,"rows_kept":70,"cut":false,"hidden":true,"merged":[]}
[]
[{"$f":"#REF!","v":{"$error":"#REF!"}},{"$f":"#REF!","v":{"$error":"#REF!"}},{"$f":"#REF!","v":{"$error":"#REF!"}},{"$f":"#REF!","v":{"$error":"#REF!"}},{"$f":"#REF!","v":{"$error":"#REF!"}},{"$f":"#REF!","v":{"$error":"#REF!"}},{"$f":"#REF!","v":{"$error":"#REF!"}},{"$f":"#REF!","v":{"$error":"#REF!"}},{"$f":"#REF!","v":{"$error":"#REF!"}},{"$f":"#REF!","v":{"$error":"#REF!"}},{"$f":"#REF!","v":{"$error":"#REF!"}},{"$f":"#REF!","v":{"$error":"#REF!"}},{"$f":"#REF!","v":{"$error":"#REF!"}},{"$f":"#REF!","v":{"$error":"#REF!"}},{"$f":"#REF!","v":{"$error":"#REF!"}},{"$f":"#REF!","v":{"$error":"#REF!"}},{"$f":"#REF!","v":{"$error":"#REF!"}},{"$f":"#REF!","v":{"$error":"#REF!"}},{"$f":"#REF!","v":{"$error":"#REF!"}},{"$f":"#REF!","v":{"$error":"#REF!"}},{"$f":"#REF!","v":{"$error":"#REF!"}},{"$f":"#REF!","v":{"$error":"#REF!"}},{"$f":"#REF!","v":{"$error":"#REF!"}},{"$f":"#REF!","v":{"$error":"#REF!"}},{"$f":"#REF!","v":{"$error":"#REF!"}},{"$f":"#REF!","v":{"$error":"#REF!"}}]
[{"$f":"#REF!","v":{"$error":"#REF!"}},{"$f":"#REF!","v":{"$error":"#REF!"}},{"$f":"#REF!","v":{"$error":"#REF!"}},{"$f":"#REF!","v":{"$error":"#REF!"}}]
[{"$f":"#REF!","v":{"$error":"#REF!"}},{"$f":"#REF!","v":{"$error":"#REF!"}},{"$f":"#REF!","v":{"$error":"#REF!"}},{"$f":"#REF!","v":{"$error":"#REF!"}},{"$f":"#REF!","v":{"$error":"#REF!"}},{"$f":"#REF!","v":{"$error":"#REF!"}},{"$f":"#REF!","v":{"$error":"#REF!"}},{"$f":"#REF!","v":{"$error":"#REF!"}},{"$f":"#REF!","v":{"$error":"#REF!"}},{"$f":"#REF!","v":{"$error":"#REF!"}},{"$f":"#REF!","v":{"$error":"#REF!"}},{"$f":"#REF!","v":{"$error":"#REF!"}},{"$f":"#REF!","v":{"$error":"#REF!"}},{"$f":"#REF!","v":{"$error":"#REF!"}},{"$f":"#REF!","v":{"$error":"#REF!"}},{"$f":"#REF!","v":{"$error":"#REF!"}},{"$f":"#REF!","v":{"$error":"#REF!"}},{"$f":"#REF!","v":{"$error":"#REF!"}},{"$f":"#REF!","v":{"$error":"#REF!"}},{"$f":"#REF!","v":{"$error":"#REF!"}},{"$f":"#REF!","v":{"$error":"#REF!"}},{"$f":"#REF!","v":{"$error":"#REF!"}},{"$f":"#REF!","v":{"$error":"#REF!"}},{"$f":"#REF!","v":{"$error":"#REF!"}},{"$f":"#REF!","v":{"$error":"#REF!"}},{"$f":"#REF!","v":{"$error":"#REF!"}}]
["Answers",{"$f":"IF(#REF!=0,\"\",#REF!)","v":{"$error":"#REF!"}},{"$f":"IF(#REF!=0,\"\",#REF!)","v":{"$error":"#REF!"}},{"$f":"IF(#REF!=0,\"\",#REF!)","v":{"$error":"#REF!"}},{"$f":"IF(#REF!=0,\"\",#REF!)","v":{"$error":"#REF!"}},{"$f":"IF(#REF!=0,\"\",#REF!)","v":{"$error":"#REF!"}},{"$f":"IF(#REF!=0,\"\",#REF!)","v":{"$error":"#REF!"}},{"$f":"IF(#REF!=0,\"\",#REF!)","v":{"$error":"#REF!"}},{"$f":"IF(#REF!=0,\"\",#REF!)","v":{"$error":"#REF!"}},{"$f":"IF(#REF!=0,\"\",#REF!)","v":{"$error":"#REF!"}},{"$f":"IF(#REF!=0,\"\",#REF!)","v":{"$error":"#REF!"}},{"$f":"IF(#REF!=0,\"\",#REF!)","v":{"$error":"#REF!"}},{"$f":"IF(#REF!=0,\"\",#REF!)","v":{"$error":"#REF!"}},{"$f":"IF(#REF!=0,\"\",#REF!)","v":{"$error":"#REF!"}},{"$f":"IF(#REF!=0,\"\",#REF!)","v":{"$error":"#REF!"}},{"$f":"IF(#REF!=0,\"\",#REF!)","v":{"$error":"#REF!"}},{"$f":"IF(#REF!=0,\"\",#REF!)","v":{"$error":"#REF!"}},{"$f":"IF(#REF!=0,\"\",#REF!)","v":{"$error":"#REF!"}},{"$f":"IF(#REF!=0,\"\",#REF!)","v":{"$error":"#REF!"}},{"$f":"IF(#REF!=0,\"\",#REF!)","v":{"$error":"#REF!"}},{"$f":"IF(#REF!=0,\"\",#REF!)","v":{"$error":"#REF!"}},{"$f":"IF(#REF!=0,\"\",#REF!)","v":{"$error":"#REF!"}},{"$f":"IF(#REF!=0,\"\",#REF!)","v":{"$error":"#REF!"}},{"$f":"IF(#REF!=0,\"\",#REF!)","v":{"$error":"#REF!"}}]
[{"$f":"#REF!","v":{"$error":"#REF!"}},{"$f":"#REF!","v":{"$error":"#REF!"}},{"$f":"#REF!","v":{"$error":"#REF!"}},{"$f":"#REF!","v":{"$error":"#REF!"}},{"$f":"#REF!","v":{"$error":"#REF!"}},{"$f":"#REF!","v":{"$error":"#REF!"}},{"$f":"#REF!","v":{"$error":"#REF!"}},{"$f":"#REF!","v":{"$error":"#REF!"}}]
[{"$f":"#REF!","v":{"$error":"#REF!"}},{"$f":"#REF!","v":{"$error":"#REF!"}},{"$f":"#REF!","v":{"$error":"#REF!"}},{"$f":"#REF!","v":{"$error":"#REF!"}},{"$f":"#REF!","v":{"$error":"#REF!"}},{"$f":"IF(#REF!=0,\"\",#REF!)","v":{"$error":"#REF!"}},{"$f":"IF(#REF!=0,\"\",#REF!)","v":{"$error":"#REF!"}},{"$f":"IF(#REF!=0,\"\",#REF!)","v":{"$error":"#REF!"}}]
[]
[]
[]
{"$rows_left_out":61}
{"sheet":"MEW nonplant","index":5,"n_rows":84,"n_cols":53,"rows_kept":84,"cut":false,"hidden":false,"merged":[[3,4,7,4],[9,2,9,4],[11,2,13,2],[11,7,13,7],[14,2,16,2],[14,7,16,7],[17,2,19,2],[17,7,19,7],[20,2,21,2],[20,7,21,7],[22,2,24,2],[22,7,24,7],[25,2,27,2],[25,7,27,7],[28,2,30,2],[28,7,30,7],[31,2,33,2],[31,7,33,7],[34,2,36,2],[34,7,36,7],[37,2,39,2],[37,7,39,7],[40,2,42,2],[40,7,42,7],[43,2,45,2],[43,7,45,7],[46,2,48,2],[46,7,48,7],[49,2,51,2],[49,7,51,7],[68,2,71,2],[68,7,71,7],[56,7,58,7],[65,7,67,7],[52,2,54,2],[52,7,54,7],[59,7,61,7],[65,2,67,2],[62,2,64,2],[62,7,64,7]]}
[null,1,"Fill in the blank cells below, based on information provided in the paper being assessed. You can either pick an option from the dropdown list or add the appropriate detail using the 'Add to list' button. ",null,null,{"$f":"IF(BA3=\"\",0,1)","v":1},null,null,null,null,null,null,null,null,"* All the text in RED are used for drop down list ,make changes with caution."]
[null,null,"Category",{"$f":"IF(AF3=\"\",0,1)","v":1},"MEW_nonplant",{"$f":"IF(E3=\"\",0,1)","v":1},"Citation No.",{"$f":"IF(ISERROR(FIND(\"-\",E3)),E3,LEFT(E3,FIND(\"-\",E3)-1))","v":"1429"},null,"Taxonomic group",null,null,null,null,"Species",null,null,"Lifestage",null,null,"Exposure duration",null,null,"Measure of toxicity",null,null,"Toxicity endpoint",null,null,"Taxonomic group",null,null,"Phylum",null,null,"Class",null,null,"Media",null,null,"Temperature ",null,null,"Acute Or Chronic",null,null,"PH",null,null,"Salinity/Comdictivity"]
[null,null,"Paper and data unique identifier(eg. 1-1,10-150)",{"$f":"IF(AI3=\"\",0,1)","v":1},"1429-1",{"$f":"IF(E4=\"\",0,1)","v":1},"Species (Scientific name)",null,null,"Phylum",null,null,null,null,"Acanthopagrus schlegelii schlegelii",28,{"$f":"IF(P3=0,\"\",INDEX(O3:O105,P3))","v":"Diadema savignyi "},"1 month",4,{"$f":"IF(S3=0,\"\",INDEX(R3:R105,S3))","v":"embryo"},"11 hour",14,{"$f":"IF(V3=0,\"\",INDEX(U3:U105,V3))","v":"48 h"},"2 d",7,{"$f":"IF(Y3=0,\"\",INDEX(X3:X105,Y3))","v":"NOEC"},"cell-specific growth",6,{"$f":"IF(AB3=0,\"\",INDEX(AA3:AA105,AB3))","v":"Normal development"},"Annelids",5,{"$f":"IF(AE3=0,\"\",INDEX(AD3:AD105,AE3))","v":"Echinoderms"},"Annelida",6,{"$f":"IF(AH3=0,\"\",INDEX(AG3:AG105,AH3))","v":"Echinodermata"},"Actinopterygii",6,{"$f":"IF(AK3=0,\"\",INDEX(AJ3:AJ105,AK3))","v":"Echinoidea"},"Artificial seawater",5,{"$f":"IF(AN3=0,\"\",INDEX(AM3:AM105,AN3))","v":"Marinewater"},14,16,{"$f":"IF(AQ3=0,\"\",INDEX(AP3:AP105,AQ3))","v":"25°C"},"Acute",2,{"$f":"IF(AT3=0,\"\",INDEX(AS3:AS105,AT3))","v":"Chronic"},7.71,4,{"$f":"IF(AW3=0,\"\",INDEX(AV3:AV105,AW3))","v":8.10},25,10,{"$f":"IF(AZ3=0,\"\",INDEX(AY3:AY105,AZ3))","v":"34 ppt"}]
[null,null,"Citation",{"$f":"IF(AL3=\"\",0,1)","v":1},"Rosen G, Rivera-Duarte I, Colvin MA, Dolecal RE, Raymundo LJ, Earley PJ. (2015). Nickel and copper toxicity to embryos of the long-spined sea urchin, Diadema savignyi. Bulletin of Environmental Contamination and Toxicology 95, ",{"$f":"IF(H8=\"\",0,1)","v":1},"Lifestage",null,null,"Class",null,null,null,null,"Aedes albopictus",null,null,"1 year old",null,null,"12 d",null,null,"EC10",null,null,"Fertilisation",null,null,"Bryozoa",null,null,"Chlorophyta",null,null,"Anthozoa",null,null,"cell culture media for marine alga",null,null,16,null,null,"Chronic",null,null,7.80,null,null,27.50]
[null,null,null,{"$f":"IF(AO3=\"\",0,1)","v":1},null,{"$f":"IF(AX3=\"\",0,1)","v":1},"Exposure duration",null,null,"Media",null,null,null,null,"Aiptasia pulchella",null,null,"Adult",null,null,"13 days",null,null,"EC15",null,null,"Growth",null,null,"Cnidaria",null,null,"Chordata",null,null,"Bivalve",null,null,"Filtered natural seawater",null,null,18,null,null,"N.A.",null,null,8,null,null,28]
[null,null,null,{"$f":"IF(AR3=\"\",0,1)","v":1},null,{"$f":"IF(Q3=\"\",0,1)","v":1},"Measure of toxicity",null,null,"Temperature ",null,null,null,null,"Amphiblanus amphitrite",null,null,"embryo",null,null,"14 d",null,null,"EC20",null,null,"Mortality",null,null,"cyanobacteria",null,null,"Cnidaria",null,null,"Branchiopoda",null,null,"Freshwater",null,null,19,null,null,null,null,null,8.10,null,null,32]
[null,null,null,{"$f":"IF(AU3=\"\",0,1)","v":1},null,{"$f":"IF(T3=\"\",0,1)","v":1},"Toxicity endpoint",null,null,"Acute Or Chronic ",null,null,null,null,"Atherinops affinis",null,null,"Gametes",null,null,"18 d",null,null,"LC50",null,null,"N.A.",null,null,"Echinoderms",null,null,"Cyanobacteria",null,null,"Chlorophyceae",null,null,"Marinewater",null,null,20,null,null,null,null,null,8.1999999999999993,null,null,"150 uS/cm"]
[null,null,null,null,null,{"$f":"IF(W3=\"\",0,1)","v":1},"Toxicity value",10,null,"PH",null,null,null,null,"Australian Bass",null,null,"Juvenile",null,null,"20 d",null,null,"N.A.",null,null,"Normal development",null,null,"Fish ",null,null,"Echinodermata",null,null,"Echinoidea",null,null,"N.A.",null,null,21,null,null,null,null,null,"8.15-8.48",null,null,"23-37"]
[null,2,"Select the appropriate answer option to each question. Comments can be added to the cells in column H.",null,null,{"$f":"IF(Z3=\"\",0,1)","v":1},null,null,null,"Salinity/Conductivity",null,null,null,null,"Bugula neritina",null,null,"Larvae",null,null,"21 d",null,null,"NOEC",null,null,"Population",null,null,"Macroinvertebrate",null,null,"Ectoprocta",null,null,"Gastropoda",null,null,"Natural estuarine water, artificial seawater and DI water",null,null,21,null,null,null,null,null,"N.A.",null,null,"25-35"]
[null,"*","If the selected answer option does not work try clicking on any other cell first and then click back on the answer option again.",null,null,{"$f":"IF(AC3=\"\",0,1)","v":1},null,null,null,null,null,null,null,null,"Celleporaria nodulosa",null,null,"N.A.",null,null,"24 h",null,null,null,null,null,"Reproduction",null,null,"Microalga",null,null,"Mollusca",null,null,"Gymnolaemata",null,null,"Oceanic seawater, estuarine seawater, brine",null,null,22,null,null,null,null,null,"NR",null,null,"30 ppt"]
{"$rows_left_out":75}
{"sheet":"MEW nonplant_WS","index":6,"n_rows":77,"n_cols":24,"rows_kept":77,"cut":false,"hidden":false,"merged":[]}
[]
["Question No.",1,2,3,4,5,6,7,8,9,10,11,12,13,14,15,16.10,16.20,16.30,17,18,"Total Score","Quality Score"]
["Short Questions","Duration of the exposure ","Biological endpoint","Biological effect stated or not","Biological effect quantified or not","Appropriate controls","Control & contaminant concentration","Test acceptability criteria","Characteristics of the test organism"," Type of test media","Type of exposure","Contaminant concentrations","Parallel reference toxicant toxicity tests","Concentration–response relationship","Determine the toxicity","NOEC/LOEC or LC/EC/BEC","Conductivity/Salinity","Dissolved Oxygen","PH","Temperature","Grade or purity"]
["Marks Awarded ","10 or 0","10,5 or 0","5 or 0 ","5 or 0 ","5 or 0 ","5 or 0 ","5 or 0 ","5 or 0 ","5 or 0 ","4 or 0","4 or 2 or 0","4 or 2","4 or 2","4 or 2","4 or 2","3 or 1 or 0","3 or 1 or 0","3 or 1 or 0","3 or 0","3 or 0 "]
["Max. Possible Score",10,10,5,5,5,5,5,5,5,4,4,4,4,4,4,3,3,3,3,3,{"$f":"SUM(B5:U5)","v":94}]
["Category","MEW_nonplant","Paper and data unique identifier(eg. 1-1,10-150)","1435-2"]
["Scores",10,10,5,5,5,5,2,5,5,4,0,0,4,4,4,3,0,3,1,3,78,0.82978723404255317,"The highest possible grade for this datum is acceptable."]
["Answers","72 h","Developmental categories described ","EC10, EC50, NOEC","","FSW control","Three replicates","Acceptability criteria inferred by reference to USEPA. Controls normal development stated (80-92%)","No longer than 1 hr post fertilisation","FSW","Static (assay conducted in glass jars)","Stock solutions  measured only","","Stated and observable","Probit regression","95% CI provided","","","","","Stock solutions measured "]
["Category","MEW_nonplant","Paper and data unique identifier(eg. 1-1,10-150)","1435-2"]
["Scores",10,10,5,5,5,5,2,5,5,4,0,0,4,4,4,3,0,3,1,3,78,0.82978723404255317,"The highest possible grade for this datum is acceptable."]
{"$rows_left_out":68}
{"sheet":"MEW plant","index":7,"n_rows":81,"n_cols":53,"rows_kept":81,"cut":false,"hidden":false,"merged":[[3,4,7,4],[9,2,9,4],[11,2,13,2],[11,7,13,7],[14,2,16,2],[14,7,16,7],[17,2,19,2],[17,7,19,7],[20,2,21,2],[20,7,21,7],[22,2,24,2],[25,2,27,2],[28,2,30,2],[31,2,33,2],[34,2,36,2],[37,2,39,2],[37,7,39,7],[40,2,42,2],[40,7,42,7],[43,2,45,2],[43,7,45,7],[46,2,48,2],[46,7,48,7],[49,2,51,2],[49,7,51,7],[56,1,58,1],[56,2,58,2],[56,7,58,7],[65,2,68,2],[65,7,68,7],[52,2,54,2],[52,7,54,7],[59,7,61,7],[62,2,64,2],[62,7,64,7]]}
[null,1,"Fill in the blank cells below, based on information provided in the paper being assessed. You can either pick an option from the dropdown list or add the appropriate detail using the 'Add to list' button. ",null,null,{"$f":"IF(BA3=\"\",0,1)","v":1},null,null,null,null,null,null,null,null,"* All the text in RED are used for drop down list ,make changes with caution."]
[null,null,"Category",{"$f":"IF(AF3=\"\",0,1)","v":1},"MEW_plant",{"$f":"IF(E3=\"\",0,1)","v":1},"Citation No.",{"$f":"IF(ISERROR(FIND(\"-\",E3)),E3,LEFT(E3,FIND(\"-\",E3)-1))","v":"638"},null,"Taxonomic group",null,null,null,null,"Species",null,null,"Lifestage",null,null,"Exposure duration",null,null,"Measure of toxicity",null,null,"Toxicity endpoint",null,null,"Taxonomic group",null,null,"Phylum",null,null,"Class",null,null,"Media",null,null,"Temperature ",null,null,"Acute Or Chronic",null,null,"PH",null,null,"Salinity/Comdictivity"]
[null,null,"Paper and data unique identifier(eg. 1-1,10-150)",{"$f":"IF(AI3=\"\",0,1)","v":1},"638-3",{"$f":"IF(E4=\"\",0,1)","v":1},"Species (Scientific name)",null,null,"Phylum",null,null,null,null,"Aedes albopictus",17,{"$f":"IF(P3=0,\"\",INDEX(O3:O102,P3))","v":"Ulva fasciata"},"1 month",4,{"$f":"IF(S3=0,\"\",INDEX(R3:R102,S3))","v":"Germlings"},"11 hour",7,{"$f":"IF(V3=0,\"\",INDEX(U3:U102,V3))","v":"96 h"},"EC10",8,{"$f":"IF(Y3=0,\"\",INDEX(X3:X102,Y3))","v":"NOEC"},"Attached biomass",10,{"$f":"IF(AB3=0,\"\",INDEX(AA3:AA102,AB3))","v":"Reproduction"},"Blue-green algae",5,{"$f":"IF(AE3=0,\"\",INDEX(AD3:AD102,AE3))","v":"Green algae"},"Bacillariophyta",2,{"$f":"IF(AH3=0,\"\",INDEX(AG3:AG102,AH3))","v":"Chlorophyta"},"Bacillariophyceae",10,{"$f":"IF(AK3=0,\"\",INDEX(AJ3:AJ102,AK3))","v":"Ulvophyceae"},"0.2 um-filtered autoclaved natural seawater",6,{"$f":"IF(AN3=0,\"\",INDEX(AM3:AM102,AN3))","v":"Filtered seawater"},19,2,{"$f":"IF(AQ3=0,\"\",INDEX(AP3:AP102,AQ3))","v":20},"Acute",2,{"$f":"IF(AT3=0,\"\",INDEX(AS3:AS102,AT3))","v":"Chronic"},8,9,{"$f":"IF(AW3=0,\"\",INDEX(AV3:AV102,AW3))","v":"NR"},31,13,{"$f":"IF(AZ3=0,\"\",INDEX(AY3:AY102,AZ3))","v":"NR"}]
[null,null,"Citation",{"$f":"IF(AL3=\"\",0,1)","v":1},"Hooten RL, Carr RS. (1998). Development and application of a marine sediment pore-water toxicity test using Ulva fasciata zoospores. Environmental Toxicology and Chemistry 17, 932-940.",{"$f":"IF(H8=\"\",0,1)","v":1},"Lifestage",null,null,"Class",null,null,null,null,"Australian Bass",null,null,"1 year old",null,null,"13 days",null,null,"IC10",null,null,"Development",null,null,"Brown algae",null,null,"Chlorophyta",null,null,"Branchiopoda",null,null,"1um filtered, UV-irradiated seawater",null,null,20,null,null,"Chronic",null,null,8.10,null,null,32]
[null,null,null,{"$f":"IF(AO3=\"\",0,1)","v":1},null,{"$f":"IF(AX3=\"\",0,1)","v":1},"Exposure duration",null,null,"Media",null,null,null,null,"Ceratoneis closterium",null,null,"Exponentially-growing",null,null,"14 d",null,null,"IC15",null,null,"Fish ",null,null,"Diatom",null,null,"Cyanobacteria",null,null,"Chlorodendrophyceae",null,null,"Artificial seawater",null,null,21,null,null,"N.A.",null,null,8.1999999999999993,null,null,33]
[null,null,null,{"$f":"IF(AR3=\"\",0,1)","v":1},null,{"$f":"IF(Q3=\"\",0,1)","v":1},"Measure of toxicity",null,null,"Temperature ",null,null,null,null,"Chlorella sp.",null,null,"Germlings",null,null,"16 d",null,null,"IC20",null,null,"Growth",null,null,"Fish ",null,null,"Cyanophycota",null,null,"Chlorophyceae",null,null,"cell culture media for marine algae",null,null,22,null,null,null,null,null,"7.75-7.9",null,null,35]
[null,null,null,{"$f":"IF(AU3=\"\",0,1)","v":1},null,{"$f":"IF(T3=\"\",0,1)","v":1},"Toxicity endpoint",null,null,"Acute Or Chronic ",null,null,null,null,"Cyanobium sp.",null,null,"N.A.",null,null,"2 d",null,null,"LC50",null,null,"Growth",null,null,"Green algae",null,null,"Haptophyta",null,null,"Cyanophyceae",null,null,"Filtered natural seawater",null,null,27,null,null,null,null,null,"7.8-8.3",null,null,36]
[null,null,null,null,null,{"$f":"IF(W3=\"\",0,1)","v":1},"Toxicity value",27.30,null,"PH",null,null,null,null,"Dunaliella",null,null,"Spores",null,null,"72 h",null,null,"N.A.",null,null,"Microalga",null,null,"Microalga",null,null,"N.A.",null,null,"N.A.",null,null,"Filtered seawater",null,null,"11.5-17",null,null,null,null,null,"7.9-8.2",null,null,"150 uS/cm"]
[null,2,"Select the appropriate answer option to each question. Comments can be added to the cells in column H.",null,null,{"$f":"IF(Z3=\"\",0,1)","v":1},null,null,null,"Salinity/Conductivity",null,null,null,null,"Dunaliella teriolecta",null,null,"Zoospores",null,null,"96 h",null,null,"NEC",null,null,"N.A.",null,null,"N.A.",null,null,"Ochrophyta",null,null,"Phaeophyceae",null,null,"Freshwater",null,null,"13-15",null,null,null,null,null,"8-8.6",null,null,"30 ppt"]
[null,"*","If the selected answer option does not work try clicking on any other cell first and then click back on the answer option again.",null,null,{"$f":"IF(AC3=\"\",0,1)","v":1},null,null,null,null,null,null,null,null,"Entomoneis c.f. punctulata",null,null,null,null,null,"N.A.",null,null,"NOEC",null,null,"Population abundance",null,null,null,null,null,"Tracheophyta",null,null,"Prasinophyceae",null,null,"Marinewater",null,null,"15°C",null,null,null,null,null,"N.A.",null,null,"32-39"]
{"$rows_left_out":72}
{"sheet":"MEW plant_WS","index":8,"n_rows":59,"n_cols":23,"rows_kept":59,"cut":false,"hidden":false,"merged":[]}
[]
["Question No.",1,2,3,4,5,6,7,8,9,10,11,12,13,14,15,16.10,16.30,17,18,"Total Score","Quality Score","Comment "]
["Short Questions","Duration of the exposure ","Biological endpoint","Biological effect stated or not","Biological effect quantified or not","Appropriate controls","Control & contaminant concentration","Test acceptability criteria","Characteristics of the test organism"," Type of test media","Type of exposure","Contaminant concentrations","Parallel reference toxicant toxicity tests","Concentration–response relationship","Determine the toxicity","NOEC/LOEC or LC/EC/BEC","Conductivity/Salinity","PH","Temperature","Grade or purity"]
["Marks Awarded ","10 or 0","10,5 or 0","5 or 0 ","5 or 0 ","5 or 0 ","5 or 0 ","5 or 0 ","5 or 0 ","5 or 0 ","4 or 0","4 or 2 or 0","4 or 2","4 or 2","4 or 2","4 or 2","3 or 1 or 0","3 or 1 or 0","3 or 0","3 or 0 "]
["Max. Possible Score",10,10,5,5,5,5,5,5,5,4,4,4,4,4,4,3,3,3,3,{"$f":"SUM(B5:T5)","v":91}]
["Category","MEW_plant","Paper and data unique identifier(eg. 1-1,10-150)","1281-2"]
["Scores",10,10,5,5,5,5,5,5,5,0,2,0,0,4,0,1,0,0,0,66,0.72527472527472525,""]
["Answers","72 h","Algal growth rates, cell division rate per hour","NOEC","NOEC, also IC50","But not stated what it was","Three replicates; 2-4 tests","Growth rates >1.2 doublings/day, <20% variability","Exponentially-growing algal cells; source specified","Filtered (0.45um) seawater, supplemented with nitrate and phosphate","Static with renewal","Start of test","No","Not shown or stated","Dunnett's","Not stated","At beginning and end of tests","At beginning and end of tests, stated as <0.8 pH change, from 8.0","At beginning and end of tests","Not stated"]
["Category","MEW_plant","Paper and data unique identifier(eg. 1-1,10-150)","1181-2 & 1181-"]
["Scores",10,5,5,5,5,5,5,5,5,0,4,0,4,4,4,1,0,0,0,72,0.79120879120879117,""]
{"$rows_left_out":49}