{"text_format":"1","workbook":"xlsx","n_sheets":9,"sheets":["Copyright","Cover","Instruction","All Result","Sheet1","FW metal nonplant","FW metal nonplant_WS","FW metal plant","FW metal plant_WS"],"not_rendered":{"charts":0,"images":0,"macros":1,"external_links":0,"defined_names":3,"comments":3,"pivot_tables":0},"unopened":[],"bounds":{"document_bytes":16777216,"sheet_cells":100000,"rows_first":2000,"rows_last":500,"rows_between":2000,"halvings":0,"cell_chars":16384,"cell_head_chars":4096},"cells_cut":0,"cells_raw":0,"read":"whole","date_system":"1900"}

{"sheet":"Copyright","index":0,"n_rows":0,"n_cols":0,"rows_kept":0,"cut":false,"hidden":false,"merged":[]}

{"sheet":"Cover","index":1,"n_rows":20,"n_cols":7,"rows_kept":20,"cut":false,"hidden":false,"merged":[[18,6,18,8],[14,6,14,8],[13,6,13,8],[4,4,4,10],[9,6,9,8],[12,6,12,8],[5,5,6,9]]}
[]
[]
[]
[]
[null,null,null,null,"Ecotoxicity Data Quality Assessment Method V2"]
[null,null,null,null,null,"To be used to assess the quality of data used for the Australian and New Zealand Guidelines for Fresh and Marine Water Quality (including sediment) and the Australian National Environment Protection (Assessment of Site Contamination) Measure"]
[]
[]
[]
[null,null,null,null,null,null,"Developed by "]
{"$rows_left_out":11}
{"sheet":"Instruction","index":2,"n_rows":21,"n_cols":10,"rows_kept":21,"cut":false,"hidden":false,"merged":[[27,6,27,16],[14,6,14,7],[5,4,5,7]]}
[]
[]
[null,"Click here to see \"All Result\" -->","All Result"]
[]
[]
[null,null,null,null,"Freshwater "]
[]
[null,"Tabs contain questionaries -->           ","Freshwater/metal/nonplant",null,"Freshwater/non-metal/non-plant ",null,null,"Freshwater/metal/plant",null,"Freshwater/non-metal/plant"]
[]
[]
{"$rows_left_out":12}
{"sheet":"All Result","index":3,"n_rows":48,"n_cols":21,"rows_kept":48,"cut":false,"hidden":false,"merged":[]}
["Chemical:","Copper"]
["Medium:","Freshwater"]
[]
["Category","Paper and data unique identier","Total score","Quality score","Comment ","Species name","Life stage","Exposure duration","Measure of toxicity","Toxicity endpoint","Toxicity value","Taxonomic group","Phylum","Class","Medium","Temperature","Acute or Chronic","pH",{"$f":"'FW metal plant'!J9","v":"Salinity/Conductivity"},{"$f":"'FW metal plant'!C4","v":"Citation"},{"$f":"'FW metal plant'!G2","v":"Citation No."}]
["Freshwater/metal/non- plant","169274-1",65,0.65,"","Ambystoma opacum","Egg to larvae","10 d","NOEC","Mortality",108.8,"Amphibia","Chordata","Amphibia","USEPA standard synthetic water","18-27","Chronic",7.3,"N.A.","Soteropoulos, D.L.; Lance, S.L.; Flynn, R.W.; Scott, D.E. (2014). Effects of copper exposure on hatching success and early larval survival in marbled salamanders, Ambystoma opacum. Environmental Toxicology and Chemistry 33(7): 1631-1637.","169274"]
["Freshwater/metal/non- plant","167561-1",80,0.8,"","Daphnia longspina","Neonate","21-d","NOEC","Population",42.3,"Crustacea","Arthropoda","Cladocera","Synthetic water",20,"Chronic",7.6,"N.A.","Agra, A.R.; Soares, A.M.V.M.; Barata, C. (2011). Life-history consequences of adaptation to pollution. Daphnia longispina clones historically exposed to copper. Ecotoxicology 20(3): 552-562.","167561"]
["Freshwater/metal/non- plant","167561-1",80,0.8,"","Daphnia longspina","Neonate","21-d","NOEC","Population",5.5,"Crustacea","Arthropoda","Cladocera","Synthetic water",20,"Chronic",7.6,"N.A.","Agra, A.R.; Soares, A.M.V.M.; Barata, C. (2011). Life-history consequences of adaptation to pollution. Daphnia longispina clones historically exposed to copper. Ecotoxicology 20(3): 552-562.","167561"]
["Freshwater/metal/non- plant","115600-1",83,0.83,"","Cirrhinus mrigala","Juvenile","60 d","NOEC","Growth",100,"Fish","Chordata","Actinopterygii","Dechlorinated tap water",20,"Chronic",7.3,"N.A.","Mohanty, M.; Adhikari, S.; Mohanty, P.; Sarangi, N. (2009). Role of waterborne copper on survival, growth and feed intake of Indian major carp, Cirrhinus mrigala Hamilton. Bulletin of Environmental Contamination and Toxicology 82(5): 559-563.","115600"]
["Freshwater/metal/non- plant","100037-1",93,0.93,"","Cottus bairdi","Juvenile","21-d","NOEC","Growth",2.9,"Fish","Chordata","Actinopterygii","well water",12,"Chronic",8.1999999999999993,"N.A.","Besser, J.M.; Mebane, C.A.; Mount, D.R.; Ivey, C.D.; Kunz, J.L.; Greer, I.E.; May, T.W.; Ingersoll, C.G. (2007). Sensitivity of mottled sculpins (Cottus bairdi) and rainbow trout (Oncorhynchus mykiss) to acute and chronic toxicity of cadmium, copper, and zinc. Environmental Toxicology and Chemistry 26(8): 1657-1665.","100037"]
["Freshwater/metal/non- plant","100037-2",93,0.93,"","Cottus bairdi","Juvenile","21-d","NOEC","Mortality",2.9,"Fish","Chordata","Actinopterygii","well water",12,"Chronic",8.1999999999999993,"N.A.","Besser, J.M.; Mebane, C.A.; Mount, D.R.; Ivey, C.D.; Kunz, J.L.; Greer, I.E.; May, T.W.; Ingersoll, C.G. (2007). Sensitivity of mottled sculpins (Cottus bairdi) and rainbow trout (Oncorhynchus mykiss) to acute and chronic toxicity of cadmium, copper, and zinc. Environmental Toxicology and Chemistry 26(8): 1657-1665.","100037"]
{"$rows_left_out":39}
{"sheet":"Sheet1","index":4,"n_rows":70,"n_cols":29,"rows_kept":70,"cut":false,"hidden":true,"merged":[]}
[]
[{"$f":"#REF!","v":{"$error":"#REF!"}},{"$f":"#REF!","v":{"$error":"#REF!"}},{"$f":"#REF!","v":{"$error":"#REF!"}},{"$f":"#REF!","v":{"$error":"#REF!"}},{"$f":"#REF!","v":{"$error":"#REF!"}},{"$f":"#REF!","v":{"$error":"#REF!"}},{"$f":"#REF!","v":{"$error":"#REF!"}},{"$f":"#REF!","v":{"$error":"#REF!"}},{"$f":"#REF!","v":{"$error":"#REF!"}},{"$f":"#REF!","v":{"$error":"#REF!"}},{"$f":"#REF!","v":{"$error":"#REF!"}},{"$f":"#REF!","v":{"$error":"#REF!"}},{"$f":"#REF!","v":{"$error":"#REF!"}},{"$f":"#REF!","v":{"$error":"#REF!"}},{"$f":"#REF!","v":{"$error":"#REF!"}},{"$f":"#REF!","v":{"$error":"#REF!"}},{"$f":"#REF!","v":{"$error":"#REF!"}},{"$f":"#REF!","v":{"$error":"#REF!"}},{"$f":"#REF!","v":{"$error":"#REF!"}},{"$f":"#REF!","v":{"$error":"#REF!"}},{"$f":"#REF!","v":{"$error":"#REF!"}},{"$f":"#REF!","v":{"$error":"#REF!"}},{"$f":"#REF!","v":{"$error":"#REF!"}},{"$f":"#REF!","v":{"$error":"#REF!"}},{"$f":"#REF!","v":{"$error":"#REF!"}},{"$f":"#REF!","v":{"$error":"#REF!"}}]
[{"$f":"#REF!","v":{"$error":"#REF!"}},{"$f":"#REF!","v":{"$error":"#REF!"}},{"$f":"#REF!","v":{"$error":"#REF!"}},{"$f":"#REF!","v":{"$error":"#REF!"}}]
[{"$f":"#REF!","v":{"$error":"#REF!"}},{"$f":"#REF!","v":{"$error":"#REF!"}},{"$f":"#REF!","v":{"$error":"#REF!"}},{"$f":"#REF!","v":{"$error":"#REF!"}},{"$f":"#REF!","v":{"$error":"#REF!"}},{"$f":"#REF!","v":{"$error":"#REF!"}},{"$f":"#REF!","v":{"$error":"#REF!"}},{"$f":"#REF!","v":{"$error":"#REF!"}},{"$f":"#REF!","v":{"$error":"#REF!"}},{"$f":"#REF!","v":{"$error":"#REF!"}},{"$f":"#REF!","v":{"$error":"#REF!"}},{"$f":"#REF!","v":{"$error":"#REF!"}},{"$f":"#REF!","v":{"$error":"#REF!"}},{"$f":"#REF!","v":{"$error":"#REF!"}},{"$f":"#REF!","v":{"$error":"#REF!"}},{"$f":"#REF!","v":{"$error":"#REF!"}},{"$f":"#REF!","v":{"$error":"#REF!"}},{"$f":"#REF!","v":{"$error":"#REF!"}},{"$f":"#REF!","v":{"$error":"#REF!"}},{"$f":"#REF!","v":{"$error":"#REF!"}},{"$f":"#REF!","v":{"$error":"#REF!"}},{"$f":"#REF!","v":{"$error":"#REF!"}},{"$f":"#REF!","v":{"$error":"#REF!"}},{"$f":"#REF!","v":{"$error":"#REF!"}},{"$f":"#REF!","v":{"$error":"#REF!"}},{"$f":"#REF!","v":{"$error":"#REF!"}}]
["Answers",{"$f":"IF(#REF!=0,\"\",#REF!)","v":{"$error":"#REF!"}},{"$f":"IF(#REF!=0,\"\",#REF!)","v":{"$error":"#REF!"}},{"$f":"IF(#REF!=0,\"\",#REF!)","v":{"$error":"#REF!"}},{"$f":"IF(#REF!=0,\"\",#REF!)","v":{"$error":"#REF!"}},{"$f":"IF(#REF!=0,\"\",#REF!)","v":{"$error":"#REF!"}},{"$f":"IF(#REF!=0,\"\",#REF!)","v":{"$error":"#REF!"}},{"$f":"IF(#REF!=0,\"\",#REF!)","v":{"$error":"#REF!"}},{"$f":"IF(#REF!=0,\"\",#REF!)","v":{"$error":"#REF!"}},{"$f":"IF(#REF!=0,\"\",#REF!)","v":{"$error":"#REF!"}},{"$f":"IF(#REF!=0,\"\",#REF!)","v":{"$error":"#REF!"}},{"$f":"IF(#REF!=0,\"\",#REF!)","v":{"$error":"#REF!"}},{"$f":"IF(#REF!=0,\"\",#REF!)","v":{"$error":"#REF!"}},{"$f":"IF(#REF!=0,\"\",#REF!)","v":{"$error":"#REF!"}},{"$f":"IF(#REF!=0,\"\",#REF!)","v":{"$error":"#REF!"}},{"$f":"IF(#REF!=0,\"\",#REF!)","v":{"$error":"#REF!"}},{"$f":"IF(#REF!=0,\"\",#REF!)","v":{"$error":"#REF!"}},{"$f":"IF(#REF!=0,\"\",#REF!)","v":{"$error":"#REF!"}},{"$f":"IF(#REF!=0,\"\",#REF!)","v":{"$error":"#REF!"}},{"$f":"IF(#REF!=0,\"\",#REF!)","v":{"$error":"#REF!"}},{"$f":"IF(#REF!=0,\"\",#REF!)","v":{"$error":"#REF!"}},{"$f":"IF(#REF!=0,\"\",#REF!)","v":{"$error":"#REF!"}},{"$f":"IF(#REF!=0,\"\",#REF!)","v":{"$error":"#REF!"}},{"$f":"IF(#REF!=0,\"\",#REF!)","v":{"$error":"#REF!"}}]
[{"$f":"#REF!","v":{"$error":"#REF!"}},{"$f":"#REF!","v":{"$error":"#REF!"}},{"$f":"#REF!","v":{"$error":"#REF!"}},{"$f":"#REF!","v":{"$error":"#REF!"}},{"$f":"#REF!","v":{"$error":"#REF!"}},{"$f":"#REF!","v":{"$error":"#REF!"}},{"$f":"#REF!","v":{"$error":"#REF!"}},{"$f":"#REF!","v":{"$error":"#REF!"}}]
[{"$f":"#REF!","v":{"$error":"#REF!"}},{"$f":"#REF!","v":{"$error":"#REF!"}},{"$f":"#REF!","v":{"$error":"#REF!"}},{"$f":"#REF!","v":{"$error":"#REF!"}},{"$f":"#REF!","v":{"$error":"#REF!"}},{"$f":"IF(#REF!=0,\"\",#REF!)","v":{"$error":"#REF!"}},{"$f":"IF(#REF!=0,\"\",#REF!)","v":{"$error":"#REF!"}},{"$f":"IF(#REF!=0,\"\",#REF!)","v":{"$error":"#REF!"}}]
[]
[]
[]
{"$rows_left_out":61}
{"sheet":"FW metal nonplant","index":5,"n_rows":90,"n_cols":54,"rows_kept":90,"cut":false,"hidden":false,"merged":[[3,4,7,4],[9,2,9,4],[11,2,13,2],[11,7,13,7],[14,2,16,2],[14,7,16,7],[17,2,19,2],[17,7,19,7],[20,2,21,2],[20,7,21,7],[22,2,24,2],[22,7,24,7],[25,2,27,2],[25,7,27,7],[28,2,30,2],[28,7,30,7],[31,2,33,2],[31,7,33,7],[34,2,36,2],[34,7,36,7],[37,2,39,2],[37,7,39,7],[40,2,42,2],[40,7,42,7],[43,2,45,2],[43,7,45,7],[46,2,48,2],[46,7,48,7],[49,2,51,2],[49,7,51,7],[62,7,64,7],[74,2,77,2],[74,7,77,7],[52,2,54,2],[52,7,54,7],[56,7,58,7],[65,7,67,7],[68,7,70,7],[71,2,73,2],[71,7,73,7],[59,7,61,7]]}
[null,1,"Fill in the blank cells below, based on information provided in the paper being assessed. You can either pick an option from the dropdown list or add the appropriate detail using the 'Add to list' button. ",null,null,null,null,null,null,null,null,null,null,null,"* All the text in RED are used for drop down list ,make changes with caution."]
[null,null,"Category",{"$f":"IF(AF3=\"\",0,1)","v":1},"Freshwater/metal/non- plant",{"$f":"IF(E3=\"\",0,1)","v":1},"Citation No.",{"$f":"IF(ISERROR(FIND(\"-\",E3)),E3,LEFT(E3,FIND(\"-\",E3)-1))","v":"ANZG3335"},null,"Taxonomic group",null,null,null,null,"Species",null,null,"Lifestage",null,null,"Exposure duration",null,null,"Measure of toxicity",null,null,"Toxicity endpoint",null,null,"Taxonomic group",null,null,"Phylum",null,null,"Class",null,null,"Media",null,null,"Temperature ",null,null,"Acute Or Chronic",null,null,"PH",null,null,"Salinity/Comdictivity"]
[null,null,"Paper and data unique identifier(eg. 1-1,10-150)",{"$f":"IF(AI3=\"\",0,1)","v":1},"ANZG3335-2",{"$f":"IF(E4=\"\",0,1)","v":1},"Species (Scientific name)",null,null,"Phylum",null,null,null,null,"Aedes albopictus",29,{"$f":"IF(P3=0,\"\",INDEX(O3:O111,P3))","v":"Monoraphidium arcuatum"},"1 month",6,{"$f":"IF(S3=0,\"\",INDEX(R3:R111,S3))","v":"Exponential growth phase"},"10 d",10,{"$f":"IF(V3=0,\"\",INDEX(U3:U111,V3))","v":"3-d"},"EC10",1,{"$f":"IF(Y3=0,\"\",INDEX(X3:X111,Y3))","v":"EC10"},"Biomass",3,{"$f":"IF(AB3=0,\"\",INDEX(AA3:AA111,AB3))","v":"Growth"},"Amphibia",6,{"$f":"IF(AE3=0,\"\",INDEX(AD3:AD111,AE3))","v":"Microalga"},"Arthropoda",3,{"$f":"IF(AH3=0,\"\",INDEX(AG3:AG111,AH3))","v":"Chlorophyta"},"Actinopterygii",5,{"$f":"IF(AK3=0,\"\",INDEX(AJ3:AJ111,AK3))","v":"Chlorophyceae"},"Dechlorinated tap water",6,{"$f":"IF(AN3=0,\"\",INDEX(AM3:AM111,AN3))","v":"Synthetic water"},10,8,{"$f":"IF(AQ3=0,\"\",INDEX(AP3:AP111,AQ3))","v":27},"Acute ",2,{"$f":"IF(AT3=0,\"\",INDEX(AS3:AS111,AT3))","v":"Chronic"},6.3,13,{"$f":"IF(AW3=0,\"\",INDEX(AV3:AV111,AW3))","v":"N.A."},null,null,"N.A.",1]
[null,null,"Citation",{"$f":"IF(AL3=\"\",0,1)","v":1},"Adams M.S., McKnight K.S., Gissi F.F, Stone S., and Stauber, J.L. (2017) Copper toxicity to marine and freshwater microalgae. CSIRO Land and Water, Technical Report EP18554. Lucas Heights, NSW, Australia. 10pp",{"$f":"IF(H8=\"\",0,1)","v":1},"Lifestage",null,null,"Class",null,null,null,null,"Alathyria profuga",null,null,"1 year old",null,null,"11 hour",null,null,"EC20",null,null,"Condition",null,null,"Cnidaria",null,null,"Ascomycota",null,null,"Amphibia",null,null,"Freshwater",null,null,12,null,null,"Chronic",null,null,6.6]
[null,null,null,{"$f":"IF(AO3=\"\",0,1)","v":1},null,{"$f":"IF(AX3=\"\",0,1)","v":1},"Exposure duration",null,null,"Media",null,null,null,null,"Ambystoma opacum",null,null,"Adult",null,null,"13 days",null,null,"Growth",null,null,"Growth",null,null,"Crustacea",null,null,"Chlorophyta",null,null,"Bivalvia",null,null,"Marinewater",null,null,20,null,null,"N.A.",null,null,6.7]
[null,null,null,{"$f":"IF(AR3=\"\",0,1)","v":1},null,{"$f":"IF(Q3=\"\",0,1)","v":1},"Measure of toxicity",null,null,"Temperature ",null,null,null,null,"Amerianna cumingi",null,null,"Budding",null,null,"2 d",null,null,"IC-10",null,null,"LOEC",null,null,"Fish",null,null,"Chordata",null,null,"Branchiopoda",null,null,"N.A.",null,null,20.5,null,null,null,null,null,6.8]
[null,null,null,{"$f":"IF(AU3=\"\",0,1)","v":1},null,{"$f":"IF(T3=\"\",0,1)","v":1},"Toxicity endpoint",null,null,"Acute Or Chronic ",null,null,null,null,"Australian Bass",null,null,"Egg to larvae",null,null,"215-d",null,null,"LC50",null,null,"Mortality",null,null,"Fungi",null,null,"Cnidaria",null,null,"Chlorophyceae",null,null,"reconstituted water",null,null,22,null,null,null,null,null,7]
[null,null,null,null,null,{"$f":"IF(W3=\"\",0,1)","v":1},"Toxicity value",0.45,null,"PH",null,null,null,null,"Chlorella sp",null,null,"Exponential growth phase",null,null,"21-d",null,null,"LOEC",null,null,"Mortality",null,null,"Microalga",null,null,"Mollusca",null,null,"Cladocera",null,null,"Synthetic water",null,null,23,null,null,null,null,null,7.3]
[null,2,"Select the appropriate answer option to each question. Comments can be added to the cells in column H.",null,null,{"$f":"IF(Z3=\"\",0,1)","v":1},null,null,null,"Salinity/Conductivity","N.A.",null,null,null,"Cirrhinus mrigala",null,null,"hyphal",null,null,"28-d",null,null,"N.A.",null,null,"N.A.",null,null,"Mollusc",null,null,"N.A.",null,null,"Eurotiomycetes",null,null,"USEPA standard synthetic water",null,null,26.5,null,null,null,null,null,7.6]
[null,"*","If the selected answer option does not work try clicking on any other cell first and then click back on the answer option again.",null,null,{"$f":"IF(AC3=\"\",0,1)","v":1},null,null,null,null,null,null,null,null,"Cottus bairdi",null,null,"Juvenile",null,null,"2-d",null,null,"NEC",null,null,"Population",null,null,"N.A.",null,null,"Tracheophyta",null,null,"Gastropoda",null,null,"well water",null,null,27,null,null,null,null,null,7.8]
{"$rows_left_out":81}
{"sheet":"FW metal nonplant_WS","index":6,"n_rows":125,"n_cols":26,"rows_kept":125,"cut":false,"hidden":false,"merged":[]}
[]
["Question No.",1,2,3,4,5,6,7,8,9,10,11,12,13,14,15,16.100000000000001,16.2,16.3,16.399999999999999,16.600000000000001,17,18,"Total Score","Quality Score"]
["Short Questions","Duration of the exposure ","Biological endpoint","Biological effect stated or not","Biological effect quantified or not","Appropriate controls","Control & contaminant concentration","Test acceptability criteria","Characteristics of the test organism"," Type of test media","Type of exposure","Contaminant concentrations","Parallel reference toxicant toxicity tests","Concentration–response relationship","Determine the toxicity","NOEC/LOEC or LC/EC/BEC","pH","Hardness","Alkalinity","Organic carbon concentration","Dissolved Oxygen","Temperature","Grade or purity"]
["Marks Awarded ","10 or 0","10,5 or 0","5 or 0 ","5 or 0 ","5 or 0 ","5 or 0 ","5 or 0 ","5 or 0 ","5 or 0 ","4 or 0","4 or 2 or 0","4 or 2","4 or 2","4 or 2","4 or 2","3 or 1 or 0","3 or 1 or 0","3 or 1 or 0","3 or 1 or 0","3 or 1 or 0","3 or 0","3 or 0 "]
["Max. Possible Score",10,10,5,5,5,5,5,5,5,4,4,4,4,4,4,3,3,3,3,3,3,3,{"$f":"SUM(B5:W5)","v":100}]
["Category","Freshwater/metal/non- plant","Paper and data unique identifier(eg. 1-1,10-150)","169274-1"]
["Scores",10,5,0,5,5,5,0,5,5,4,2,0,4,4,4,1,1,1,0,0,1,3,65,0.65,""]
["Answers","10-days after hatching","Embryo survival, early larval survival","","In plot but not explicitly stated","0 Cu control","4x clutches with 10 reps (10 eggs) per concentration","","Laboratory reared embryos","Synthetic water","Daily static renewal","Measured 3x per concentration, but not stated whether at start or end","","","","","","","","","","",""]
["Category","Freshwater/metal/non- plant","Paper and data unique identifier(eg. 1-1,10-150)","167561-1"]
["Scores",10,10,5,5,5,5,2,5,5,4,2,0,4,4,4,3,0,0,0,3,1,3,80,0.8,""]
{"$rows_left_out":116}
{"sheet":"FW metal plant","index":7,"n_rows":87,"n_cols":53,"rows_kept":87,"cut":false,"hidden":false,"merged":[[3,4,7,4],[9,2,9,4],[11,2,13,2],[11,7,13,7],[14,2,16,2],[14,7,16,7],[17,2,19,2],[17,7,19,7],[20,2,21,2],[20,7,21,7],[22,2,24,2],[22,7,24,7],[25,2,27,2],[25,7,27,7],[28,2,30,2],[28,7,30,7],[31,2,33,2],[31,7,33,7],[34,2,36,2],[34,7,36,7],[37,2,39,2],[37,7,39,7],[40,2,42,2],[40,7,42,7],[43,2,45,2],[43,7,45,7],[46,2,48,2],[46,7,48,7],[49,2,51,2],[49,7,51,7],[71,2,74,2],[71,7,74,7],[52,2,54,2],[52,7,54,7],[68,2,70,2],[68,7,70,7],[65,7,67,7],[56,7,58,7],[59,7,61,7],[62,7,64,7]]}
[null,1,"Fill in the blank cells below, based on information provided in the paper being assessed. You can either pick an option from the dropdown list or add the appropriate detail using the 'Add to list' button. ",null,null,null,null,null,null,null,null,null,null,null,"* All the text in RED are used for drop down list ,make changes with caution."]
[null,null,"Category",{"$f":"IF(AF3=\"\",0,1)","v":1},"Freshwater/metal/plant",{"$f":"IF(E3=\"\",0,1)","v":1},"Citation No.",{"$f":"IF(ISERROR(FIND(\"-\",E3)),E3,LEFT(E3,FIND(\"-\",E3)-1))","v":"ANZG3334"},null,"Taxonomic group",null,null,null,null,"Species",null,null,"Lifestage",null,null,"Exposure duration",null,null,"Measure of toxicity",null,null,"Toxicity endpoint",null,null,"Taxonomic group",null,null,"Phylum",null,null,"Class",null,null,"Media",null,null,"Temperature ",null,null,"Acute Or Chronic",null,null,"PH",null,null,"Salinity/Comdictivity"]
[null,null,"Paper and data unique identifier(eg. 1-1,10-150)",{"$f":"IF(AI3=\"\",0,1)","v":1},"ANZG3334-3",{"$f":"IF(E4=\"\",0,1)","v":1},"Species (Scientific name)",null,null,"Phylum",null,null,null,null,"Aedes albopictus",5,{"$f":"IF(P3=0,\"\",INDEX(O3:O108,P3))","v":"Lemna aequinoctialis"},"1 month",5,{"$f":"IF(S3=0,\"\",INDEX(R3:R108,S3))","v":"3 frond stage"},"11 hour",5,{"$f":"IF(V3=0,\"\",INDEX(U3:U108,V3))","v":"4-d"},"LC50",4,{"$f":"IF(Y3=0,\"\",INDEX(X3:X108,Y3))","v":"EC10"},"Mortality",4,{"$f":"IF(AB3=0,\"\",INDEX(AA3:AA108,AB3))","v":"Growth"},"Fish ",4,{"$f":"IF(AE3=0,\"\",INDEX(AD3:AD108,AE3))","v":"Macrophyte"},"Chlorophyta",5,{"$f":"IF(AH3=0,\"\",INDEX(AG3:AG108,AH3))","v":"Spermatophyta"},"Branchiopoda",5,{"$f":"IF(AK3=0,\"\",INDEX(AJ3:AJ108,AK3))","v":"Monocotyledonae"},"Freshwater",5,{"$f":"IF(AN3=0,\"\",INDEX(AM3:AM108,AN3))","v":"Natural water"},"15°C",5,{"$f":"IF(AQ3=0,\"\",INDEX(AP3:AP108,AQ3))","v":29},"Acute ",1,{"$f":"IF(AT3=0,\"\",INDEX(AS3:AS108,AT3))","v":"Acute "},"N.A.",5,{"$f":"IF(AW3=0,\"\",INDEX(AV3:AV108,AW3))","v":6.8},"Salinity1",null,"N.A."]
[null,null,"Citation",{"$f":"IF(AL3=\"\",0,1)","v":1},"Melanie A Trenfield*, Ceiwen J Pease, Samantha L Walker, Tom Mooney, Linda Tybell, Chris Humphrey, Rick A van Dam and Andrew J Harford (2020). Standardised chronic toxicity test protocols\nand culturing methods for a suite of\ntropical freshwater spec ies. Australasian Bulletin of Ecotoxicology and Environmental Chemistry Vol6. 82p",{"$f":"IF(H8=\"\",0,1)","v":1},"Lifestage",null,null,"Class",null,null,null,null,"Australian Bass",null,null,"1 year old",null,null,"13 days",null,null,"N.A.",null,null,"N.A.",null,null,"Microalga",null,null,"N.A.",null,null,"Chlorophyceae",null,null,"Marinewater",null,null,"25°C",null,null,"Chronic",null,null,"PH11",null,null,"Salinity2"]
[null,null,null,{"$f":"IF(AO3=\"\",0,1)","v":1},null,{"$f":"IF(AX3=\"\",0,1)","v":1},"Exposure duration",null,null,"Media",null,null,null,null,"N.A.",null,null,"N.A.",null,null,"N.A.",null,null,"NOEC",null,null,"Reproduction",null,null,"N.A.",null,null,"Tracheophyta",null,null,"N.A.",null,null,"N.A.",null,null,"N.A.",null,null,"N.A.",null,null,"PH7.0 "]
[null,null,null,{"$f":"IF(AR3=\"\",0,1)","v":1},null,{"$f":"IF(Q3=\"\",0,1)","v":1},"Measure of toxicity",null,null,"Temperature ",null,null,null,null,"Zizania palustris",null,null,"Seedling",null,null,"14-d",null,null,"EC10",null,null,"Growth",null,null,"Macrophyte",null,null,"Angiosperm",null,null,"Monocot",null,null,"Synthetic water",null,null,16,null,null,null,null,null,7.1]
[null,null,null,{"$f":"IF(AU3=\"\",0,1)","v":1},null,{"$f":"IF(T3=\"\",0,1)","v":1},"Toxicity endpoint",null,null,"Acute Or Chronic ",null,null,null,null,"Lemna aequinoctialis",null,null,"3 frond stage",null,null,"4-d",null,null,null,null,null,null,null,null,null,null,null,"Spermatophyta",null,null,"Monocotyledonae",null,null,"Natural water",null,null,29,null,null,null,null,null,6.8]
[null,null,null,null,null,{"$f":"IF(W3=\"\",0,1)","v":1},"Toxicity value",6.8,null,"PH",null,null,null,null,null,null,null,null,null,null,null,null,null,null,null,null,null,null,null,null,null,null,null,null,null,null,null,null,"Synthetic water",null,null,null,null,null,null,null,null,7.3]
[null,2,"Select the appropriate answer option to each question. Comments can be added to the cells in column H.",null,null,{"$f":"IF(Z3=\"\",0,1)","v":1},null,null,null,"Salinity/Conductivity","N.A."]
[null,"*","If the selected answer option does not work try clicking on any other cell first and then click back on the answer option again.",null,null,{"$f":"IF(AC3=\"\",0,1)","v":1}]
{"$rows_left_out":78}
{"sheet":"FW metal plant_WS","index":8,"n_rows":17,"n_cols":25,"rows_kept":17,"cut":false,"hidden":false,"merged":[]}
[]
["Question No.",1,2,3,4,5,6,7,8,9,10,11,12,13,14,15,16.100000000000001,16.2,16.3,16.399999999999999,17,18,"Total Score","Quality Score"]
["Short Questions","Duration of the exposure ","Biological endpoint","Biological effect stated or not","Biological effect quantified or not","Appropriate controls","Control & contaminant concentration","Test acceptability criteria","Characteristics of the test organism"," Type of test media","Type of exposure","Contaminant concentrations","Parallel reference toxicant toxicity tests","Concentration–response relationship","Determine the toxicity","NOEC/LOEC or LC/EC/BEC","pH","Hardness","Alkalinity ","Organic carbon concentration","Temperature","Grade or purity"]
["Marks Awarded ","10 or 0","10,5 or 0","5 or 0 ","5 or 0 ","5 or 0 ","5 or 0 ","5 or 0 ","5 or 0 ","5 or 0 ","4 or 0","4 or 2 or 0","4 or 2","4 or 2","4 or 2","4 or 2","3 or 1 or 0","3 or 1 or 0","3 or 1 or 0","3 or 1 or 0","3 or 0","3 or 0 "]
["Max. Possible Score",10,10,5,5,5,5,5,5,5,4,4,4,4,4,4,3,3,3,3,3,3,{"$f":"SUM(B5:V5)","v":97}]
["Category","Freshwater/metal/plant","Paper and data unique identifier(eg. 1-1,10-150)","86269-1"]
["Scores",10,10,5,5,5,5,0,5,5,0,2,0,4,4,4,3,3,3,3,1,3,80,0.82474226804123707,""]
["Answers","14-d","Growth, average seedling net weight gain","NOEC","Percentage of control shown","","8 reps (of individual seedlings)","","Seeds","Swamp Creek water","Static as in dishes","Composite from start, mid and end measured","No","Observable","ToxStat used"," p < 0.05","","","","","incubator temp 12 C.","Cu measured in controls"]
["Category","Freshwater/metal/plant","Paper and data unique identifier(eg. 1-1,10-150)","86269-2"]
["Scores",10,10,5,5,5,5,0,5,5,0,2,0,4,4,4,3,3,3,3,1,3,80,0.82474226804123707,""]
{"$rows_left_out":7}