{"text_format":"1","workbook":"xlsx","n_sheets":9,"sheets":["Copyright","Cover","Instruction","Sheet1","All Result","FW metal nonplant_WS","FW metal nonplant","FW metal plant","FW metal plant_WS"],"not_rendered":{"charts":0,"images":0,"macros":1,"external_links":1,"defined_names":3,"comments":3,"pivot_tables":0},"unopened":[],"bounds":{"document_bytes":16777216,"sheet_cells":100000,"rows_first":2000,"rows_last":500,"rows_between":2000,"halvings":0,"cell_chars":16384,"cell_head_chars":4096},"cells_cut":0,"cells_raw":0,"read":"whole","date_system":"1900"}

{"sheet":"Copyright","index":0,"n_rows":0,"n_cols":0,"rows_kept":0,"cut":false,"hidden":false,"merged":[]}

{"sheet":"Cover","index":1,"n_rows":20,"n_cols":7,"rows_kept":20,"cut":false,"hidden":false,"merged":[[18,6,18,8],[14,6,14,8],[13,6,13,8],[4,4,4,10],[9,6,9,8],[12,6,12,8],[5,5,6,9]]}
[]
[]
[]
[]
[null,null,null,null,"Ecotoxicity Data Quality Assessment Method V2"]
[null,null,null,null,null,"To be used to assess the quality of data used for the Australian and New Zealand Guidelines for Fresh and Marine Water Quality (including sediment) and the Australian National Environment Protection (Assessment of Site Contamination) Measure"]
[]
[]
[]
[null,null,null,null,null,null,"Developed by "]
{"$rows_left_out":11}
{"sheet":"Instruction","index":2,"n_rows":21,"n_cols":10,"rows_kept":21,"cut":false,"hidden":false,"merged":[[27,6,27,16],[14,6,14,7],[5,4,5,7]]}
[]
[]
[null,"Click here to see \"All Result\" -->","All Result"]
[]
[]
[null,null,null,null,"Freshwater "]
[]
[null,"Tabs contain questionaries -->           ","Freshwater/metal/nonplant",null,"Freshwater/non-metal/non-plant ",null,null,"Freshwater/metal/plant",null,"Freshwater/non-metal/plant"]
[]
[]
{"$rows_left_out":12}
{"sheet":"Sheet1","index":3,"n_rows":70,"n_cols":29,"rows_kept":70,"cut":false,"hidden":true,"merged":[]}
[]
[{"$f":"#REF!","v":{"$error":"#REF!"}},{"$f":"#REF!","v":{"$error":"#REF!"}},{"$f":"#REF!","v":{"$error":"#REF!"}},{"$f":"#REF!","v":{"$error":"#REF!"}},{"$f":"#REF!","v":{"$error":"#REF!"}},{"$f":"#REF!","v":{"$error":"#REF!"}},{"$f":"#REF!","v":{"$error":"#REF!"}},{"$f":"#REF!","v":{"$error":"#REF!"}},{"$f":"#REF!","v":{"$error":"#REF!"}},{"$f":"#REF!","v":{"$error":"#REF!"}},{"$f":"#REF!","v":{"$error":"#REF!"}},{"$f":"#REF!","v":{"$error":"#REF!"}},{"$f":"#REF!","v":{"$error":"#REF!"}},{"$f":"#REF!","v":{"$error":"#REF!"}},{"$f":"#REF!","v":{"$error":"#REF!"}},{"$f":"#REF!","v":{"$error":"#REF!"}},{"$f":"#REF!","v":{"$error":"#REF!"}},{"$f":"#REF!","v":{"$error":"#REF!"}},{"$f":"#REF!","v":{"$error":"#REF!"}},{"$f":"#REF!","v":{"$error":"#REF!"}},{"$f":"#REF!","v":{"$error":"#REF!"}},{"$f":"#REF!","v":{"$error":"#REF!"}},{"$f":"#REF!","v":{"$error":"#REF!"}},{"$f":"#REF!","v":{"$error":"#REF!"}},{"$f":"#REF!","v":{"$error":"#REF!"}},{"$f":"#REF!","v":{"$error":"#REF!"}}]
[{"$f":"#REF!","v":{"$error":"#REF!"}},{"$f":"#REF!","v":{"$error":"#REF!"}},{"$f":"#REF!","v":{"$error":"#REF!"}},{"$f":"#REF!","v":{"$error":"#REF!"}}]
[{"$f":"#REF!","v":{"$error":"#REF!"}},{"$f":"#REF!","v":{"$error":"#REF!"}},{"$f":"#REF!","v":{"$error":"#REF!"}},{"$f":"#REF!","v":{"$error":"#REF!"}},{"$f":"#REF!","v":{"$error":"#REF!"}},{"$f":"#REF!","v":{"$error":"#REF!"}},{"$f":"#REF!","v":{"$error":"#REF!"}},{"$f":"#REF!","v":{"$error":"#REF!"}},{"$f":"#REF!","v":{"$error":"#REF!"}},{"$f":"#REF!","v":{"$error":"#REF!"}},{"$f":"#REF!","v":{"$error":"#REF!"}},{"$f":"#REF!","v":{"$error":"#REF!"}},{"$f":"#REF!","v":{"$error":"#REF!"}},{"$f":"#REF!","v":{"$error":"#REF!"}},{"$f":"#REF!","v":{"$error":"#REF!"}},{"$f":"#REF!","v":{"$error":"#REF!"}},{"$f":"#REF!","v":{"$error":"#REF!"}},{"$f":"#REF!","v":{"$error":"#REF!"}},{"$f":"#REF!","v":{"$error":"#REF!"}},{"$f":"#REF!","v":{"$error":"#REF!"}},{"$f":"#REF!","v":{"$error":"#REF!"}},{"$f":"#REF!","v":{"$error":"#REF!"}},{"$f":"#REF!","v":{"$error":"#REF!"}},{"$f":"#REF!","v":{"$error":"#REF!"}},{"$f":"#REF!","v":{"$error":"#REF!"}},{"$f":"#REF!","v":{"$error":"#REF!"}}]
["Answers",{"$f":"IF(#REF!=0,\"\",#REF!)","v":{"$error":"#REF!"}},{"$f":"IF(#REF!=0,\"\",#REF!)","v":{"$error":"#REF!"}},{"$f":"IF(#REF!=0,\"\",#REF!)","v":{"$error":"#REF!"}},{"$f":"IF(#REF!=0,\"\",#REF!)","v":{"$error":"#REF!"}},{"$f":"IF(#REF!=0,\"\",#REF!)","v":{"$error":"#REF!"}},{"$f":"IF(#REF!=0,\"\",#REF!)","v":{"$error":"#REF!"}},{"$f":"IF(#REF!=0,\"\",#REF!)","v":{"$error":"#REF!"}},{"$f":"IF(#REF!=0,\"\",#REF!)","v":{"$error":"#REF!"}},{"$f":"IF(#REF!=0,\"\",#REF!)","v":{"$error":"#REF!"}},{"$f":"IF(#REF!=0,\"\",#REF!)","v":{"$error":"#REF!"}},{"$f":"IF(#REF!=0,\"\",#REF!)","v":{"$error":"#REF!"}},{"$f":"IF(#REF!=0,\"\",#REF!)","v":{"$error":"#REF!"}},{"$f":"IF(#REF!=0,\"\",#REF!)","v":{"$error":"#REF!"}},{"$f":"IF(#REF!=0,\"\",#REF!)","v":{"$error":"#REF!"}},{"$f":"IF(#REF!=0,\"\",#REF!)","v":{"$error":"#REF!"}},{"$f":"IF(#REF!=0,\"\",#REF!)","v":{"$error":"#REF!"}},{"$f":"IF(#REF!=0,\"\",#REF!)","v":{"$error":"#REF!"}},{"$f":"IF(#REF!=0,\"\",#REF!)","v":{"$error":"#REF!"}},{"$f":"IF(#REF!=0,\"\",#REF!)","v":{"$error":"#REF!"}},{"$f":"IF(#REF!=0,\"\",#REF!)","v":{"$error":"#REF!"}},{"$f":"IF(#REF!=0,\"\",#REF!)","v":{"$error":"#REF!"}},{"$f":"IF(#REF!=0,\"\",#REF!)","v":{"$error":"#REF!"}},{"$f":"IF(#REF!=0,\"\",#REF!)","v":{"$error":"#REF!"}}]
[{"$f":"#REF!","v":{"$error":"#REF!"}},{"$f":"#REF!","v":{"$error":"#REF!"}},{"$f":"#REF!","v":{"$error":"#REF!"}},{"$f":"#REF!","v":{"$error":"#REF!"}},{"$f":"#REF!","v":{"$error":"#REF!"}},{"$f":"#REF!","v":{"$error":"#REF!"}},{"$f":"#REF!","v":{"$error":"#REF!"}},{"$f":"#REF!","v":{"$error":"#REF!"}}]
[{"$f":"#REF!","v":{"$error":"#REF!"}},{"$f":"#REF!","v":{"$error":"#REF!"}},{"$f":"#REF!","v":{"$error":"#REF!"}},{"$f":"#REF!","v":{"$error":"#REF!"}},{"$f":"#REF!","v":{"$error":"#REF!"}},{"$f":"IF(#REF!=0,\"\",#REF!)","v":{"$error":"#REF!"}},{"$f":"IF(#REF!=0,\"\",#REF!)","v":{"$error":"#REF!"}},{"$f":"IF(#REF!=0,\"\",#REF!)","v":{"$error":"#REF!"}}]
[]
[]
[]
{"$rows_left_out":61}
{"sheet":"All Result","index":4,"n_rows":135,"n_cols":26,"rows_kept":135,"cut":false,"hidden":false,"merged":[[131,25,134,36],[59,25,59,36],[78,25,87,36],[88,25,103,36],[2,25,2,36],[10,25,10,36],[73,25,76,36],[11,25,26,36],[31,25,32,36],[40,25,44,36],[45,25,52,36],[53,25,54,36],[39,25,39,36],[33,25,35,36],[36,25,38,36],[123,25,128,36],[27,25,27,36],[28,25,28,36],[29,25,29,36],[30,25,30,36],[116,25,121,36],[68,25,68,36],[77,25,77,36],[115,25,115,36],[122,25,122,36],[69,25,72,36],[107,25,114,36],[60,25,63,36],[55,25,56,36],[57,25,57,36],[58,25,58,36]]}
["Chemical:","Boron"]
[]
[{"$f":"'[1]FW nonmetal plant'!C2","v":"Category"},{"$f":"'[1]FW nonmetal plant'!C3","v":"Paper and data unique identifier(eg. 1-1,10-150)"},{"$f":"'[1]FW nonmetal plant'!C70","v":"Total score"},{"$f":"'[1]FW nonmetal plant'!C72","v":"Quality Score"},"Comment ",{"$f":"'[1]FW nonmetal plant'!G3","v":"Species (Scientific name)"},{"$f":"'[1]FW nonmetal plant'!G4","v":"Lifestage"},{"$f":"'[1]FW nonmetal plant'!G5","v":"Exposure duration"},{"$f":"'[1]FW nonmetal plant'!G6","v":"Measure of toxicity"},{"$f":"'[1]FW nonmetal plant'!G7","v":"Toxicity endpoint"},"Toxicity value (mg/L)",{"$f":"'[1]FW nonmetal plant'!J2","v":"Taxonomic group"},{"$f":"'[1]FW nonmetal plant'!J3","v":"Phylum"},{"$f":"'[1]FW nonmetal plant'!J4","v":"Class"},{"$f":"'[1]FW nonmetal plant'!J5","v":"Media"},"Temp",{"$f":"'[1]FW nonmetal plant'!J7","v":"Acute Or Chronic "},{"$f":"'[1]FW nonmetal plant'!J8","v":"PH"},{"$f":"'[1]FW metal plant'!J9","v":"Salinity/Conductivity"},{"$f":"'[1]FW metal plant'!C4","v":"Citation"},{"$f":"'[1]FW metal plant'!G2","v":"Citation No."},"Hardness","B compound","Data use","Boron conc","Additional Comments/Justification"]
["Freshwater/metal/plant","1-1",79,0.81443298969072164,"","Potamogeton ochreatus","apical stem cutting","30 d","NOEC","Shoot growth",5,"Macrophyte","Angiosperm","Monocot","Freshwater","22°C","Chronic","6.8-7.7","N.A.","Golder Associates (NZ) Limited (2010).  Effects of boron the growth and condition of Potamogeton ochreatus.  Report to Solid Energy New Zealand Ltd, 45 pp. ","1","NR","BA","Accept","Measured"]
["Freshwater/metal/plant","1-2",79,0.81443298969072164,"","Potamogeton ochreatus","apical stem cutting","30 d","NOEC","Shoot weight",7.5,"Macrophyte","Angiosperm","Monocot","Freshwater","22°C","Chronic","6.8-7.7","N.A.","Golder Associates (NZ) Limited (2010).  Effects of boron the growth and condition of Potamogeton ochreatus.  Report to Solid Energy New Zealand Ltd, 45 pp. ","1","NR","BA","Accept","Measured"]
["Freshwater/metal/plant","1-3",79,0.81443298969072164,"","Potamogeton ochreatus","apical stem cutting","30 d","NOEC","Node number",20,"Macrophyte","Angiosperm","Monocot","Freshwater","22°C","Chronic","6.8-7.7","N.A.","Golder Associates (NZ) Limited (2010).  Effects of boron the growth and condition of Potamogeton ochreatus.  Report to Solid Energy New Zealand Ltd, 45 pp. ","1","NR","BA","Accept","Measured"]
["Freshwater/metal/plant","1-4",84,0.865979381443299,"","Potamogeton ochreatus","apical stem cutting","30 d","NOEC","Plant condition",5,"Macrophyte","Angiosperm","Monocot","Freshwater","22°C","Chronic","6.8-7.7","N.A.","Golder Associates (NZ) Limited (2010).  Effects of boron the growth and condition of Potamogeton ochreatus.  Report to Solid Energy New Zealand Ltd, 45 pp. ","1","NR","BA","Reject","Measured","Non-ecological endpoint, assessed visually for abnormal plant condition. Subjective."]
["Freshwater/metal/plant","1-5",79,0.81443298969072164,"","Potamogeton ochreatus","apical stem cutting","30 d","IC10","Shoot growth",4.9000000000000004,"Macrophyte","Angiosperm","Monocot","Freshwater","22°C","Chronic","6.8-7.7","N.A.","Golder Associates (NZ) Limited (2010).  Effects of boron the growth and condition of Potamogeton ochreatus.  Report to Solid Energy New Zealand Ltd, 45 pp. ","1","NR","BA","Accept","Measured"]
["Freshwater/metal/plant","2-1",74,0.76288659793814428,"","Spirodella polyrrhiza","frond","10 d","NOEC","Growth",6.1,"Macrophyte","Angiosperm","Monocot","Freshwater","25°C","Chronic","5.2-5.8","N.A.","Davis SMD, K. D. Maier K.J. (2002). Toxicity of boron to the duckweed, Spirodella polyrrhiza. Chemosphere, 48, 615-620. ","2","NR","BA","Accept","Measured"]
["Freshwater/metal/plant","2-2",74,0.76288659793814428,"","Spirodella polyrrhiza","frond","10 d","NOEC","Abnormality",18.899999999999999,"Macrophyte","Angiosperm","Monocot","Freshwater","25°C","Chronic","5.2-5.8","N.A.","Davis SMD, K. D. Maier K.J. (2002). Toxicity of boron to the duckweed, Spirodella polyrrhiza. Chemosphere, 48, 615-620. ","2","NR","BA","Accept","Measured"]
{"$rows_left_out":126}
{"sheet":"FW metal nonplant_WS","index":5,"n_rows":203,"n_cols":26,"rows_kept":203,"cut":false,"hidden":false,"merged":[]}
[]
["Question No.",1,2,3,4,5,6,7,8,9,10,11,12,13,14,15,16.100000000000001,16.2,16.3,16.399999999999999,16.600000000000001,17,18,"Total Score","Quality Score"]
["Short Questions","Duration of the exposure ","Biological endpoint","Biological effect stated or not","Biological effect quantified or not","Appropriate controls","Control & contaminant concentration","Test acceptability criteria","Characteristics of the test organism"," Type of test media","Type of exposure","Contaminant concentrations","Parallel reference toxicant toxicity tests","Concentration–response relationship","Determine the toxicity","NOEC/LOEC or LC/EC/BEC","pH","Hardness","Alkalinity","Organic carbon concentration","Dissolved Oxygen","Temperature","Grade or purity"]
["Marks Awarded ","10 or 0","10,5 or 0","5 or 0 ","5 or 0 ","5 or 0 ","5 or 0 ","5 or 0 ","5 or 0 ","5 or 0 ","4 or 0","4 or 2 or 0","4 or 2","4 or 2","4 or 2","4 or 2","3 or 1 or 0","3 or 1 or 0","3 or 1 or 0","3 or 1 or 0","3 or 1 or 0","3 or 0","3 or 0 "]
["Max. Possible Score",10,10,5,5,5,5,5,5,5,4,4,4,4,4,4,3,3,3,3,3,3,3,{"$f":"SUM(B5:W5)","v":100}]
["Category","Freshwater/metal/non- plant","Paper and data unique identifier(eg. 1-1,10-150)","3-1"]
["Scores",10,5,5,5,5,5,2,5,5,4,4,0,4,4,0,3,3,0,0,3,3,3,78,0.78,""]
["Answers","8d post hatch + average 3d to hatch = 11 d","Mortality","LC",10,"Non toxicant controls","2-4 replicates","95% survival in controls","Embryo - immediately after fertilisation to 8d post hatch","Reconstituted water hardness 200 mg/L CaCO3, described in Birge and Cassidy 1983","Flow through","Measured at 1-2 d intervals","","Yes","Modified method in Dyer et al.","",7.5,"204 mg/L CaCO3","Measured but not stated","","8.4 mg/L","20°C","Controls had no Boron detected"]
["Category","Freshwater/metal/non- plant","Paper and data unique identifier(eg. 1-1,10-150)","3-2"]
["Scores",10,5,5,5,5,5,2,5,5,4,4,0,4,4,0,3,3,0,0,3,3,3,78,0.78,""]
{"$rows_left_out":194}
{"sheet":"FW metal nonplant","index":6,"n_rows":90,"n_cols":54,"rows_kept":90,"cut":false,"hidden":false,"merged":[[62,7,64,7],[74,2,77,2],[74,7,77,7],[52,2,54,2],[52,7,54,7],[56,7,58,7],[65,7,67,7],[68,7,70,7],[71,2,73,2],[71,7,73,7],[59,7,61,7],[43,2,45,2],[43,7,45,7],[46,2,48,2],[46,7,48,7],[49,2,51,2],[49,7,51,7],[34,2,36,2],[34,7,36,7],[37,2,39,2],[37,7,39,7],[40,2,42,2],[40,7,42,7],[25,2,27,2],[25,7,27,7],[28,2,30,2],[28,7,30,7],[31,2,33,2],[31,7,33,7],[17,2,19,2],[17,7,19,7],[20,2,21,2],[20,7,21,7],[22,2,24,2],[22,7,24,7],[3,4,7,4],[9,2,9,4],[11,2,13,2],[11,7,13,7],[14,2,16,2],[14,7,16,7]]}
[null,1,"Fill in the blank cells below, based on information provided in the paper being assessed. You can either pick an option from the dropdown list or add the appropriate detail using the 'Add to list' button. ",null,null,null,null,null,null,null,null,null,null,null,"* All the text in RED are used for drop down list ,make changes with caution."]
[null,null,"Category",{"$f":"IF(AF3=\"\",0,1)","v":0},"Freshwater/metal/non- plant",{"$f":"IF(E3=\"\",0,1)","v":1},"Citation No.",{"$f":"IF(ISERROR(FIND(\"-\",E3)),E3,LEFT(E3,FIND(\"-\",E3)-1))","v":"34"},null,"Taxonomic group",null,null,null,null,"Species",null,null,"Lifestage",null,null,"Exposure duration",null,null,"Measure of toxicity",null,null,"Toxicity endpoint",null,null,"Taxonomic group",null,null,"Phylum",null,null,"Class",null,null,"Media",null,null,"Temperature ",null,null,"Acute Or Chronic",null,null,"PH",null,null,"Salinity/Comdictivity"]
[null,null,"Paper and data unique identifier(eg. 1-1,10-150)",{"$f":"IF(AI3=\"\",0,1)","v":0},"34-1",{"$f":"IF(E4=\"\",0,1)","v":1},"Species (Scientific name)",null,null,"Phylum",null,null,null,null,"Aedes albopictus",22,{"$f":"IF(P3=0,\"\",INDEX(O3:O111,P3))","v":"Oncorhynchus kisutch"},"1 month",0,{"$f":"IF(S3=0,\"\",INDEX(R3:R111,S3))","v":""},23,0,{"$f":"IF(V3=0,\"\",INDEX(U3:U111,V3))","v":""},"42 d",0,{"$f":"IF(Y3=0,\"\",INDEX(X3:X111,Y3))","v":""},"Biomass (dry weight)",0,{"$f":"IF(AB3=0,\"\",INDEX(AA3:AA111,AB3))","v":""},"Amphibian",0,{"$f":"IF(AE3=0,\"\",INDEX(AD3:AD111,AE3))","v":""},"Arthropoda",0,{"$f":"IF(AH3=0,\"\",INDEX(AG3:AG111,AH3))","v":""},"Actinopterygii",0,{"$f":"IF(AK3=0,\"\",INDEX(AJ3:AJ111,AK3))","v":""},"Freshwater",0,{"$f":"IF(AN3=0,\"\",INDEX(AM3:AM111,AN3))","v":""},13.7,0,{"$f":"IF(AQ3=0,\"\",INDEX(AP3:AP111,AQ3))","v":""},"Acute ",0,{"$f":"IF(AT3=0,\"\",INDEX(AS3:AS111,AT3))","v":""},6.5,0,{"$f":"IF(AW3=0,\"\",INDEX(AV3:AV111,AW3))","v":""},null,null,"N.A.",1]
[null,null,"Citation",{"$f":"IF(AL3=\"\",0,1)","v":0},"Thompson, J.A., Davis, J.C and Drew, R.E. 1976. Toxicity, uptake and survey studies of boron in the marine environment. Water Research 10, 869-875.",{"$f":"IF(H8=\"\",0,1)","v":0},"Lifestage",null,null,"Class",null,null,null,null,"Ambystoma jeffersonian",null,null,"1 year old",null,null,23,null,null,"EC10",null,null,"Biomass (length)",null,null,"Bivalve",null,null,"Chlorophyta",null,null,"Amphibia",null,null,"Marinewater",null,null,"10°C",null,null,"Chronic",null,null,7.5]
[null,null,null,{"$f":"IF(AO3=\"\",0,1)","v":0},null,{"$f":"IF(AX3=\"\",0,1)","v":0},"Exposure duration",null,null,"Media",null,null,null,null,"Ambystoma jeffersonianum",null,null,"Advanced fry",null,null,25,null,null,"IC25",null,null,"Hatching success",null,null,"Cladoceran",null,null,"Chordata",null,null,"Bivalve",null,null,"N.A.",null,null,"11 ± 0.5°C",null,null,"N.A.",null,null,7.6]
[null,null,null,{"$f":"IF(AR3=\"\",0,1)","v":0},null,{"$f":"IF(Q3=\"\",0,1)","v":1},"Measure of toxicity",null,null,"Temperature ",null,null,null,null,"Ambystonium maculatum",null,null,"alevin",null,null,44,null,null,"LC10",null,null,"Mortality",null,null,"Fish",null,null,"Mollusca",null,null,"Branchiopoda",null,null,null,null,null,"12.5°C",null,null,null,null,null,7.7]
[null,null,null,{"$f":"IF(AU3=\"\",0,1)","v":0},null,{"$f":"IF(T3=\"\",0,1)","v":0},"Toxicity endpoint",null,null,"Acute Or Chronic ",null,null,null,null,"Anaxyrus fowleri",null,null,"embryo",null,null,"10 d",null,null,"LC20",null,null,"Mortality and teratogenesis",null,null,"Macro-invertebrate",null,null,"N.A.",null,null,"Chlorophyceae",null,null,null,null,null,"13.3°C",null,null,null,null,null,7.7]
[null,null,null,null,null,{"$f":"IF(W3=\"\",0,1)","v":0},"Toxicity value",null,null,"PH",null,null,null,null,"Australian Bass",null,null,"Embryo (blastula)",null,null,"11 d",null,null,"LC50",null,null,"N.A.",null,null,"Microalga",null,null,"Tracheophyta",null,null,"Malacostraca",null,null,null,null,null,"13.7°C",null,null,null,null,null,7.8]
[null,2,"Select the appropriate answer option to each question. Comments can be added to the cells in column H.",null,null,{"$f":"IF(Z3=\"\",0,1)","v":0},null,null,null,"Salinity/Conductivity","N.A.",null,null,null,"Bufo americanus",null,null,"juvenile",null,null,"11 hour",null,null,"LOEC",null,null,"Nomral larval development",null,null,"Micro-invertebrate",null,null,null,null,null,"N.A.",null,null,null,null,null,"13°C",null,null,null,null,null,7.9]
[null,"*","If the selected answer option does not work try clicking on any other cell first and then click back on the answer option again.",null,null,{"$f":"IF(AC3=\"\",0,1)","v":0},null,null,null,null,null,null,null,null,"Bufo fowleri",null,null,"juvenile",null,null,"11.8 d",null,null,"MATC",null,null,"Normal larval development",null,null,"N.A.",null,null,null,null,null,null,null,null,null,null,null,"14°C",null,null,null,null,null,8]
{"$rows_left_out":81}
{"sheet":"FW metal plant","index":7,"n_rows":87,"n_cols":53,"rows_kept":87,"cut":false,"hidden":false,"merged":[[71,2,74,2],[71,7,74,7],[52,2,54,2],[52,7,54,7],[68,2,70,2],[68,7,70,7],[65,7,67,7],[56,7,58,7],[59,7,61,7],[62,7,64,7],[43,2,45,2],[43,7,45,7],[46,2,48,2],[46,7,48,7],[49,2,51,2],[49,7,51,7],[34,2,36,2],[34,7,36,7],[37,2,39,2],[37,7,39,7],[40,2,42,2],[40,7,42,7],[25,2,27,2],[25,7,27,7],[28,2,30,2],[28,7,30,7],[31,2,33,2],[31,7,33,7],[17,2,19,2],[17,7,19,7],[20,2,21,2],[20,7,21,7],[22,2,24,2],[22,7,24,7],[3,4,7,4],[9,2,9,4],[11,2,13,2],[11,7,13,7],[14,2,16,2],[14,7,16,7]]}
[null,1,"Fill in the blank cells below, based on information provided in the paper being assessed. You can either pick an option from the dropdown list or add the appropriate detail using the 'Add to list' button. ",null,null,null,null,null,null,null,null,null,null,null,"* All the text in RED are used for drop down list ,make changes with caution."]
[null,null,"Category",{"$f":"IF(AF3=\"\",0,1)","v":1},"Freshwater/metal/plant",{"$f":"IF(E3=\"\",0,1)","v":1},"Citation No.",{"$f":"IF(ISERROR(FIND(\"-\",E3)),E3,LEFT(E3,FIND(\"-\",E3)-1))","v":"26"},null,"Taxonomic group",null,null,null,null,"Species",null,null,"Lifestage",null,null,"Exposure duration",null,null,"Measure of toxicity",null,null,"Toxicity endpoint",null,null,"Taxonomic group",null,null,"Phylum",null,null,"Class",null,null,"Media",null,null,"Temperature ",null,null,"Acute Or Chronic",null,null,"PH",null,null,"Salinity/Comdictivity"]
[null,null,"Paper and data unique identifier(eg. 1-1,10-150)",{"$f":"IF(AI3=\"\",0,1)","v":1},"26-29",{"$f":"IF(E4=\"\",0,1)","v":1},"Species (Scientific name)",null,null,"Phylum",null,null,null,null,"Aedes albopictus",26,{"$f":"IF(P3=0,\"\",INDEX(O3:O108,P3))","v":"Nostoc punctiforme 2"},"1 month",9,{"$f":"IF(S3=0,\"\",INDEX(R3:R108,S3))","v":"N.R."},"10 d",31,{"$f":"IF(V3=0,\"\",INDEX(U3:U108,V3))","v":"6-26d"},"EC10",9,{"$f":"IF(Y3=0,\"\",INDEX(X3:X108,Y3))","v":"LOEC"},"Abnormality",9,{"$f":"IF(AB3=0,\"\",INDEX(AA3:AA108,AB3))","v":"Growth rate (Chl a)"},"Bacteria",3,{"$f":"IF(AE3=0,\"\",INDEX(AD3:AD108,AE3))","v":"Blue-green algae (Eubacteria)"},"Angiosperm",5,{"$f":"IF(AH3=0,\"\",INDEX(AG3:AG108,AH3))","v":"Cyanobacteria"},"Bacillariophyceae ",5,{"$f":"IF(AK3=0,\"\",INDEX(AJ3:AJ108,AK3))","v":"Cyanophyceae"},"Freshwater",1,{"$f":"IF(AN3=0,\"\",INDEX(AM3:AM108,AN3))","v":"Freshwater"},"13h 35°C, 11h 10°C",4,{"$f":"IF(AQ3=0,\"\",INDEX(AP3:AP108,AQ3))","v":"20°C"},"Acute ",2,{"$f":"IF(AT3=0,\"\",INDEX(AS3:AS108,AT3))","v":"Chronic"},6,12,{"$f":"IF(AW3=0,\"\",INDEX(AV3:AV108,AW3))","v":"N.R."},"Salinity1",null,"N.A."]
[null,null,"Citation",{"$f":"IF(AL3=\"\",0,1)","v":1},"V W (1985). Boron tolerance by freshwater phytoplankton. Division of Marine and Freshwater Science, Taupo Research Laboratory.",{"$f":"IF(H8=\"\",0,1)","v":1},"Lifestage",null,null,"Class",null,null,null,null,"Anabaena flos-aquae",null,null,"1 year old",null,null,"11 d",null,null,"EC50",null,null,"biomass (dry weight)",null,null,"Blue-green algae",null,null,"Bacillariophyta",null,null,"Branchiopoda",null,null,"Marinewater",null,null,"15°C",null,null,"Chronic",null,null,6.8,null,null,"Salinity2"]
[null,null,null,{"$f":"IF(AO3=\"\",0,1)","v":1},null,{"$f":"IF(AX3=\"\",0,1)","v":1},"Exposure duration",null,null,"Media",null,null,null,null,"Anabaena oscillarioides",null,null,"3-frond clones",null,null,"11 d",null,null,"IC10",null,null,"biomass (particle volume)",null,null,"Blue-green algae (Eubacteria)",null,null,"Charophyta",null,null,"Charophyceae",null,null,"N.A.",null,null,"18.5-21.4°C",null,null,"N.A.",null,null,"5.2-5.8"]
[null,null,null,{"$f":"IF(AR3=\"\",0,1)","v":1},null,{"$f":"IF(Q3=\"\",0,1)","v":1},"Measure of toxicity",null,null,"Temperature ",null,null,null,null,"Anabaena oscillarioides 1",null,null,"apical stem cutting",null,null,"11 hour",null,null,"LC50",null,null,"frond production",null,null,"Fish ",null,null,"Chlorophyta",null,null,"Chlorophyceae",null,null,null,null,null,"20°C",null,null,null,null,null,"6.2-6.4"]
[null,null,null,{"$f":"IF(AU3=\"\",0,1)","v":1},null,{"$f":"IF(T3=\"\",0,1)","v":1},"Toxicity endpoint",null,null,"Acute Or Chronic ",null,null,null,null,"Anabaena oscillarioides 2",null,null,"exponentially growing cells",null,null,"12 d",null,null,"MATC",null,null,"Germination",null,null,"Macrophyte",null,null,"Cyanobacteria",null,null,"Cyanophyceae",null,null,null,null,null,"22°C",null,null,null,null,null,"6.8-7.7"]
[null,null,null,null,null,{"$f":"IF(W3=\"\",0,1)","v":1},"Toxicity value",1,null,"PH",null,null,null,null,"Anacystis nidulans",null,null,"frond",null,null,"13 days",null,null,"N.A.",null,null,"Growth",null,null,"Microalga",null,null,"N.A.",null,null,"Mediophyceae",null,null,null,null,null,"23°C",null,null,null,null,null,"7.0-7.2"]
[null,2,"Select the appropriate answer option to each question. Comments can be added to the cells in column H.",null,null,{"$f":"IF(Z3=\"\",0,1)","v":1},null,null,null,"Salinity/Conductivity","N.A.",null,null,null,"Australian Bass",null,null,"late log phase",null,null,"14 d",null,null,"NEC",null,null,"Growth (rate)",null,null,"N.A.",null,null,"Ochrophyta",null,null,"Monocot",null,null,null,null,null,"24°C",null,null,null,null,null,"7.5-8.3"]
[null,"*","If the selected answer option does not work try clicking on any other cell first and then click back on the answer option again.",null,null,{"$f":"IF(AC3=\"\",0,1)","v":1},null,null,null,null,null,null,null,null,"Chara corallina",null,null,"N.A.",null,null,"16 d",null,null,"NOEC",null,null,"Growth (yield)",null,null,null,null,null,"Tracheophyta",null,null,"N.A.",null,null,null,null,null,"25°C",null,null,null,null,null,"7.5-8.5"]
{"$rows_left_out":78}
{"sheet":"FW metal plant_WS","index":8,"n_rows":203,"n_cols":25,"rows_kept":203,"cut":false,"hidden":false,"merged":[]}
[]
["Question No.",1,2,3,4,5,6,7,8,9,10,11,12,13,14,15,16.100000000000001,16.2,16.3,16.399999999999999,17,18,"Total Score","Quality Score"]
["Short Questions","Duration of the exposure ","Biological endpoint","Biological effect stated or not","Biological effect quantified or not","Appropriate controls","Replication","Test acceptability criteria","Characteristics of the test organism"," Type of test media","Type of exposure","Contaminant concentrations","Parallel reference toxicant toxicity tests","Concentration–response relationship","Determine the toxicity","NOEC/LOEC or LC/EC/BEC","pH","Hardness","Alkalinity ","Organic carbon concentration","Temperature","Grade or purity"]
["Marks Awarded ","10 or 0","10,5 or 0","5 or 0 ","5 or 0 ","5 or 0 ","5 or 0 ","5 or 0 ","5 or 0 ","5 or 0 ","4 or 0","4 or 2 or 0","4 or 2","4 or 2","4 or 0","4 or 2","3 or 1 or 0","3 or 1 or 0","3 or 1 or 0","3 or 1 or 0","3 or 0","3 or 0 "]
["Max. Possible Score",10,10,5,5,5,5,5,5,5,4,4,4,4,4,4,3,3,3,3,3,3,{"$f":"SUM(B5:V5)","v":97}]
["Category","Freshwater/metal/plant","Paper and data unique identifier(eg. 1-1,10-150)","1-1"]
["Scores",10,5,5,5,5,5,5,5,5,4,4,0,4,4,4,3,0,0,0,3,3,79,0.81443298969072164,""]
["Answers","30 days","Shoot growth","NOEC","p 0.05 from stats section in Appendix","Non-toxicant controls","5 replicates","Control CV <20%","5 cm apical stem cutting","Dechlorinated tap water","Static renewal 72h rewals","Measured throughout","","Observable and stated","Yes",0.05,"Initial pH was 6.79-7.69. boric acid reduced pH. At test termination, pH was 7.11-7.58","","","","19.39-24.14, overall mean = 21.67","AR Grade"]
["Category","Freshwater/metal/plant","Paper and data unique identifier(eg. 1-1,10-150)","1-2"]
["Scores",10,5,5,5,5,5,5,5,5,4,4,0,4,4,4,3,0,0,0,3,3,79,0.81443298969072164,""]
{"$rows_left_out":193}