{"text_format":"1","workbook":"xlsx","n_sheets":9,"sheets":["Copyright","Cover","Instruction","All Result","Sheet1","MEW nonplant","MEW nonplant_WS","MEW plant","MEW plant_WS"],"not_rendered":{"charts":0,"images":0,"macros":1,"external_links":0,"defined_names":2,"comments":3,"pivot_tables":0},"unopened":[],"bounds":{"document_bytes":16777216,"sheet_cells":100000,"rows_first":2000,"rows_last":500,"rows_between":2000,"halvings":0,"cell_chars":16384,"cell_head_chars":4096},"cells_cut":0,"cells_raw":0,"read":"whole","date_system":"1900"}

{"sheet":"Copyright","index":0,"n_rows":0,"n_cols":0,"rows_kept":0,"cut":false,"hidden":false,"merged":[]}

{"sheet":"Cover","index":1,"n_rows":20,"n_cols":7,"rows_kept":20,"cut":false,"hidden":false,"merged":[[18,6,18,8],[14,6,14,8],[13,6,13,8],[4,4,4,10],[9,6,9,8],[12,6,12,8],[5,5,6,9]]}
[]
[]
[]
[]
[null,null,null,null,"Ecotoxicity Data Quality Assessment Method V2.4"]
[null,null,null,null,null,"To be used to assess the quality of data used for the Australian and New Zealand Guidelines for Fresh and Marine Water Quality (including sediment) and the Australian National Environment Protection (Assessment of Site Contamination) Measure"]
[]
[]
[]
[null,null,null,null,null,null,"Developed by "]
{"$rows_left_out":11}
{"sheet":"Instruction","index":2,"n_rows":21,"n_cols":10,"rows_kept":21,"cut":false,"hidden":false,"merged":[[27,6,27,16],[14,6,14,7],[5,4,5,7]]}
[]
[]
[null,"Click here to see \"All Result\" -->","All Result"]
[]
[]
[null,null,null,null,"Freshwater "]
[]
[null,"Tabs contain questionaries -->           ","Freshwater/metal/nonplant",null,"Freshwater/non-metal/non-plant ",null,null,"Freshwater/metal/plant",null,"Freshwater/non-metal/plant"]
[]
[]
{"$rows_left_out":12}
{"sheet":"All Result","index":3,"n_rows":45,"n_cols":21,"rows_kept":45,"cut":false,"hidden":false,"merged":[]}
["Chemical:","Bisphenol A"]
["Medium:","Marine"]
[]
["Category","Paper and data unique identier","Total score","Quality score","Comment ","Species name","Life stage","Exposure duration","Measure of toxicity","Toxicity endpoint","Toxicity value","Taxonomic group","Phylum","Class","Medium","Temperature","Acute or Chronic","pH","Salinity","Citation","Citation No."]
["MEW_nonplant","268-1",80,0.85106382978723405,"","Psammechinus miliaris","Embryo","7 days","NOEC","Reproduction","1500 nM (0.342 mg/L)","Sea urchin","Echinodermata","\tEchinoidea","fresh or artificial seawater","18-20","Chronic","Not stated","30-32 PSU","Anselmo, H.M.R., L. Koerting, S. Devito, J.H.J. van den Berg, M. Dubbeldam, C. Kwadijk and A.J. Murk. 2011. Early life developmental effects of marine persistent organic pollutants on the sea urchin Psammechinus miliaris. Ecotoxicology and Environmental Safety 74: 2182-2192","268"]
["MEW_nonplant","268-2",84,0.8936170212765957,"","Psammechinus miliaris","Larvae","7 days","NOEC","larval development","1500 nM","Sea urchin","Echinodermata","\tEchinoidea","Artificial seawater",19,"Chronic",8,31,"Anselmo, H.M.R., L. Koerting, S. Devito, J.H.J. van den Berg, M. Dubbeldam, C. Kwadijk and A.J. Murk. 2011. Early life developmental effects of marine persistent organic pollutants on the sea urchin Psammechinus miliaris. Ecotoxicology and Environmental Safety 74: 2182-2192","268"]
["MEW_nonplant","268-3",84,0.8936170212765957,"","Psammechinus miliaris","Larvae","14 days","NOEC","larval development","1500 nM","Sea urchin","Echinodermata","\tEchinoidea","Artificial seawater",19,"Chronic",8,31,"Anselmo, H.M.R., L. Koerting, S. Devito, J.H.J. van den Berg, M. Dubbeldam, C. Kwadijk and A.J. Murk. 2011. Early life developmental effects of marine persistent organic pollutants on the sea urchin Psammechinus miliaris. Ecotoxicology and Environmental Safety 74: 2182-2192","268"]
["MEW_nonplant","269-1",68,0.72340425531914898,"The highest possible grade for this datum is acceptable.","Hemicentrotus pulcherrimus","juvenile","80 days","LOEC","Growth","0.5 uM (0.114 mg/L)","Sea urchin","Echinodermata","\tEchinoidea","seawater",18,"Chronic","Not stated","Not stated","Kiyomoto, M., A. Kikuchi, T. Unuma and Y. Yokota. 2006. Effects of ethynlyestradiol and bisphenol A on the development of sea urchin embryos and juveniles. Marine Biology 149: 57-63.","269"]
["MEW_nonplant","270-1",71,0.75531914893617025,"The highest possible grade for this datum is acceptable.","Acartia tonsa","adult","2 days","LC10","Mortality","800 µg/L","Copepoda","Arthropoda","Maxillopoda","Artificial seawater",20,"Acute","not stated",0.18,"Andersen, H.R., L. Wollenberger, B. Halling-Sorensen and K.O. Kusk. 2001. Development of copepod nauplii to copepodites - a parameter for chronic toxicity including endocrine disruption. Environmental Toxicology and Chemistry 20: 2821-2829.","270"]
["MEW_nonplant","270-2",71,0.75531914893617025,"The highest possible grade for this datum is acceptable.","Acartia tonsa","adult","2 days","LC50","Mortality","4200 µg/L","Copepoda","Arthropoda","Maxillopoda","Artificial seawater",20,"Acute","not stated",0.18,"Andersen, H.R., L. Wollenberger, B. Halling-Sorensen and K.O. Kusk. 2001. Development of copepod nauplii to copepodites - a parameter for chronic toxicity including endocrine disruption. Environmental Toxicology and Chemistry 20: 2821-2829.","270"]
{"$rows_left_out":36}
{"sheet":"Sheet1","index":4,"n_rows":70,"n_cols":29,"rows_kept":70,"cut":false,"hidden":true,"merged":[]}
[]
[{"$f":"#REF!","v":{"$error":"#REF!"}},{"$f":"#REF!","v":{"$error":"#REF!"}},{"$f":"#REF!","v":{"$error":"#REF!"}},{"$f":"#REF!","v":{"$error":"#REF!"}},{"$f":"#REF!","v":{"$error":"#REF!"}},{"$f":"#REF!","v":{"$error":"#REF!"}},{"$f":"#REF!","v":{"$error":"#REF!"}},{"$f":"#REF!","v":{"$error":"#REF!"}},{"$f":"#REF!","v":{"$error":"#REF!"}},{"$f":"#REF!","v":{"$error":"#REF!"}},{"$f":"#REF!","v":{"$error":"#REF!"}},{"$f":"#REF!","v":{"$error":"#REF!"}},{"$f":"#REF!","v":{"$error":"#REF!"}},{"$f":"#REF!","v":{"$error":"#REF!"}},{"$f":"#REF!","v":{"$error":"#REF!"}},{"$f":"#REF!","v":{"$error":"#REF!"}},{"$f":"#REF!","v":{"$error":"#REF!"}},{"$f":"#REF!","v":{"$error":"#REF!"}},{"$f":"#REF!","v":{"$error":"#REF!"}},{"$f":"#REF!","v":{"$error":"#REF!"}},{"$f":"#REF!","v":{"$error":"#REF!"}},{"$f":"#REF!","v":{"$error":"#REF!"}},{"$f":"#REF!","v":{"$error":"#REF!"}},{"$f":"#REF!","v":{"$error":"#REF!"}},{"$f":"#REF!","v":{"$error":"#REF!"}},{"$f":"#REF!","v":{"$error":"#REF!"}}]
[{"$f":"#REF!","v":{"$error":"#REF!"}},{"$f":"#REF!","v":{"$error":"#REF!"}},{"$f":"#REF!","v":{"$error":"#REF!"}},{"$f":"#REF!","v":{"$error":"#REF!"}}]
[{"$f":"#REF!","v":{"$error":"#REF!"}},{"$f":"#REF!","v":{"$error":"#REF!"}},{"$f":"#REF!","v":{"$error":"#REF!"}},{"$f":"#REF!","v":{"$error":"#REF!"}},{"$f":"#REF!","v":{"$error":"#REF!"}},{"$f":"#REF!","v":{"$error":"#REF!"}},{"$f":"#REF!","v":{"$error":"#REF!"}},{"$f":"#REF!","v":{"$error":"#REF!"}},{"$f":"#REF!","v":{"$error":"#REF!"}},{"$f":"#REF!","v":{"$error":"#REF!"}},{"$f":"#REF!","v":{"$error":"#REF!"}},{"$f":"#REF!","v":{"$error":"#REF!"}},{"$f":"#REF!","v":{"$error":"#REF!"}},{"$f":"#REF!","v":{"$error":"#REF!"}},{"$f":"#REF!","v":{"$error":"#REF!"}},{"$f":"#REF!","v":{"$error":"#REF!"}},{"$f":"#REF!","v":{"$error":"#REF!"}},{"$f":"#REF!","v":{"$error":"#REF!"}},{"$f":"#REF!","v":{"$error":"#REF!"}},{"$f":"#REF!","v":{"$error":"#REF!"}},{"$f":"#REF!","v":{"$error":"#REF!"}},{"$f":"#REF!","v":{"$error":"#REF!"}},{"$f":"#REF!","v":{"$error":"#REF!"}},{"$f":"#REF!","v":{"$error":"#REF!"}},{"$f":"#REF!","v":{"$error":"#REF!"}},{"$f":"#REF!","v":{"$error":"#REF!"}}]
["Answers",{"$f":"IF(#REF!=0,\"\",#REF!)","v":{"$error":"#REF!"}},{"$f":"IF(#REF!=0,\"\",#REF!)","v":{"$error":"#REF!"}},{"$f":"IF(#REF!=0,\"\",#REF!)","v":{"$error":"#REF!"}},{"$f":"IF(#REF!=0,\"\",#REF!)","v":{"$error":"#REF!"}},{"$f":"IF(#REF!=0,\"\",#REF!)","v":{"$error":"#REF!"}},{"$f":"IF(#REF!=0,\"\",#REF!)","v":{"$error":"#REF!"}},{"$f":"IF(#REF!=0,\"\",#REF!)","v":{"$error":"#REF!"}},{"$f":"IF(#REF!=0,\"\",#REF!)","v":{"$error":"#REF!"}},{"$f":"IF(#REF!=0,\"\",#REF!)","v":{"$error":"#REF!"}},{"$f":"IF(#REF!=0,\"\",#REF!)","v":{"$error":"#REF!"}},{"$f":"IF(#REF!=0,\"\",#REF!)","v":{"$error":"#REF!"}},{"$f":"IF(#REF!=0,\"\",#REF!)","v":{"$error":"#REF!"}},{"$f":"IF(#REF!=0,\"\",#REF!)","v":{"$error":"#REF!"}},{"$f":"IF(#REF!=0,\"\",#REF!)","v":{"$error":"#REF!"}},{"$f":"IF(#REF!=0,\"\",#REF!)","v":{"$error":"#REF!"}},{"$f":"IF(#REF!=0,\"\",#REF!)","v":{"$error":"#REF!"}},{"$f":"IF(#REF!=0,\"\",#REF!)","v":{"$error":"#REF!"}},{"$f":"IF(#REF!=0,\"\",#REF!)","v":{"$error":"#REF!"}},{"$f":"IF(#REF!=0,\"\",#REF!)","v":{"$error":"#REF!"}},{"$f":"IF(#REF!=0,\"\",#REF!)","v":{"$error":"#REF!"}},{"$f":"IF(#REF!=0,\"\",#REF!)","v":{"$error":"#REF!"}},{"$f":"IF(#REF!=0,\"\",#REF!)","v":{"$error":"#REF!"}},{"$f":"IF(#REF!=0,\"\",#REF!)","v":{"$error":"#REF!"}}]
[{"$f":"#REF!","v":{"$error":"#REF!"}},{"$f":"#REF!","v":{"$error":"#REF!"}},{"$f":"#REF!","v":{"$error":"#REF!"}},{"$f":"#REF!","v":{"$error":"#REF!"}},{"$f":"#REF!","v":{"$error":"#REF!"}},{"$f":"#REF!","v":{"$error":"#REF!"}},{"$f":"#REF!","v":{"$error":"#REF!"}},{"$f":"#REF!","v":{"$error":"#REF!"}}]
[{"$f":"#REF!","v":{"$error":"#REF!"}},{"$f":"#REF!","v":{"$error":"#REF!"}},{"$f":"#REF!","v":{"$error":"#REF!"}},{"$f":"#REF!","v":{"$error":"#REF!"}},{"$f":"#REF!","v":{"$error":"#REF!"}},{"$f":"IF(#REF!=0,\"\",#REF!)","v":{"$error":"#REF!"}},{"$f":"IF(#REF!=0,\"\",#REF!)","v":{"$error":"#REF!"}},{"$f":"IF(#REF!=0,\"\",#REF!)","v":{"$error":"#REF!"}}]
[]
[]
[]
{"$rows_left_out":61}
{"sheet":"MEW nonplant","index":5,"n_rows":84,"n_cols":53,"rows_kept":84,"cut":false,"hidden":false,"merged":[[3,4,7,4],[9,2,9,4],[11,2,13,2],[11,7,13,7],[14,2,16,2],[14,7,16,7],[17,2,19,2],[17,7,19,7],[20,2,21,2],[20,7,21,7],[22,2,24,2],[22,7,24,7],[25,2,27,2],[25,7,27,7],[28,2,30,2],[28,7,30,7],[31,2,33,2],[31,7,33,7],[34,2,36,2],[34,7,36,7],[37,2,39,2],[37,7,39,7],[40,2,42,2],[40,7,42,7],[43,2,45,2],[43,7,45,7],[46,2,48,2],[46,7,48,7],[49,2,51,2],[49,7,51,7],[68,2,71,2],[68,7,71,7],[56,7,58,7],[65,7,67,7],[52,2,54,2],[52,7,54,7],[59,7,61,7],[65,2,67,2],[62,2,64,2],[62,7,64,7]]}
[null,1,"Fill in the blank cells below, based on information provided in the paper being assessed. You can either pick an option from the dropdown list or add the appropriate detail using the 'Add to list' button. ",null,null,{"$f":"IF(BA3=\"\",0,1)","v":1},null,null,null,null,null,null,null,null,"* All the text in RED are used for drop down list ,make changes with caution."]
[null,null,"Category",{"$f":"IF(AF3=\"\",0,1)","v":1},"MEW_nonplant",{"$f":"IF(E3=\"\",0,1)","v":1},"Citation No.",{"$f":"IF(ISERROR(FIND(\"-\",E3)),E3,LEFT(E3,FIND(\"-\",E3)-1))","v":"742"},null,"Taxonomic group",null,null,null,null,"Species",null,null,"Lifestage",null,null,"Exposure duration",null,null,"Measure of toxicity",null,null,"Toxicity endpoint",null,null,"Taxonomic group",null,null,"Phylum",null,null,"Class",null,null,"Media",null,null,"Temperature ",null,null,"Acute Or Chronic",null,null,"PH",null,null,"Salinity/Comdictivity"]
[null,null,"Paper and data unique identifier(eg. 1-1,10-150)",{"$f":"IF(AI3=\"\",0,1)","v":1},"742-1",{"$f":"IF(E4=\"\",0,1)","v":1},"Species (Scientific name)",null,null,"Phylum",null,null,null,null,"Acartia tonsa",11,{"$f":"IF(P3=0,\"\",INDEX(O3:O105,P3))","v":"Cochlodinium polykrikoides"},"1 month",49,{"$f":"IF(S3=0,\"\",INDEX(R3:R105,S3))","v":"Exponential growth phase"},"1 day",21,{"$f":"IF(V3=0,\"\",INDEX(U3:U105,V3))","v":"3 days"},"80 days",6,{"$f":"IF(Y3=0,\"\",INDEX(X3:X105,Y3))","v":"EC50"},"ability to settle",5,{"$f":"IF(AB3=0,\"\",INDEX(AA3:AA105,AB3))","v":"Cell counts"},"Abalone",18,{"$f":"IF(AE3=0,\"\",INDEX(AD3:AD105,AE3))","v":"Dinoflagellate"},"Annelida",19,{"$f":"IF(AH3=0,\"\",INDEX(AG3:AG105,AH3))","v":"Miozoa"},"\tActinopterygii",25,{"$f":"IF(AK3=0,\"\",INDEX(AJ3:AJ105,AK3))","v":"Dinophyceae"},"20um filtered seawater",6,{"$f":"IF(AN3=0,\"\",INDEX(AM3:AM105,AN3))","v":"filtered sea water"},4,46,{"$f":"IF(AQ3=0,\"\",INDEX(AP3:AP105,AQ3))","v":"Not stated"},8,4,{"$f":"IF(AT3=0,\"\",INDEX(AS3:AS105,AT3))","v":"Chronic"},7.50,21,{"$f":"IF(AW3=0,\"\",INDEX(AV3:AV105,AW3))","v":"Not stated"},0.18,31,{"$f":"IF(AZ3=0,\"\",INDEX(AY3:AY105,AZ3))","v":"not stated"}]
[null,null,"Citation",{"$f":"IF(AL3=\"\",0,1)","v":1},"Ebenezer V. and J.S. Ki. 2012. Evaluation of the sub-lethal toxicity of Cu, Pb, bisphenol A and polychlorinated biphenyl to the marine dinoflagellate Cochlodinium polykrikoides. Algae 27: 63-70",{"$f":"IF(H8=\"\",0,1)","v":1},"Lifestage",null,null,"Class",null,null,null,null,"Aedes albopictus",null,null,"1 year old",null,null,"10 day",null,null,"EC10",null,null,"Adult survival",null,null,"Algae",null,null,"Arthropoda",null,null,"\tAscidiacea",null,null,"Artificial seawater",null,null,10,null,null,"25 ± 1",null,null,7.90,null,null,20]
[null,null,null,{"$f":"IF(AO3=\"\",0,1)","v":1},null,{"$f":"IF(AX3=\"\",0,1)","v":1},"Exposure duration",null,null,"Media",null,null,null,null,"Americamysis bahia",null,null,"1-2day old larvae",null,null,"11 hour",null,null,"EC10\\",null,null,"avoidance",null,null,"Bacteria",null,null,"Arthropoda",null,null,"\tEchinoidea",null,null,"dechlorinated water",null,null,10.80,null,null,"Acute",null,null,8,null,null,20]
[null,null,null,{"$f":"IF(AR3=\"\",0,1)","v":1},null,{"$f":"IF(Q3=\"\",0,1)","v":1},"Measure of toxicity",null,null,"Temperature ",null,null,null,null,"Amphiascus tenuiremis",null,null,"4 d into the cyprid larval stage",null,null,"12 days",null,null,"EC50",null,null,"Bioluminescence reduction",null,null,"Bacteria",null,null,"Bacillariophyta",null,null,"\tPolychaeta",null,null,"DOM-free seawater",null,null,15,null,null,"Chronic",null,null,8.10,null,null,20.10]
[null,null,null,{"$f":"IF(AU3=\"\",0,1)","v":1},null,{"$f":"IF(T3=\"\",0,1)","v":1},"Toxicity endpoint",null,null,"Acute Or Chronic ",null,null,null,null,"Amphiascus tenuiremis ",null,null,"6 month adult",null,null,"13 days",null,null,"EC50",null,null,"Cell counts",null,null,"Copepoda",null,null,"Chlorophyta",null,null,"\tSessilia",null,null,"filtered artificial seawater",null,null,17,null,null,"N.A.",null,null,8.3000000000000007,null,null,20.30]
[null,null,null,null,null,{"$f":"IF(W3=\"\",0,1)","v":1},"Toxicity value","68150 ug/L",null,"PH",null,null,null,null,"Artemia salina",null,null,"6 months old",null,null,"14 days",null,null,"EC50",null,null,"Chlorophyll a",null,null,"Crustacean",null,null,"Chordata",null,null,"Artemiidae",null,null,"filtered sea water",null,null,18,null,null,null,null,null,"7.5 - 8.3",null,null,20.70]
[null,2,"Select the appropriate answer option to each question. Comments can be added to the cells in column H.",null,null,{"$f":"IF(Z3=\"\",0,1)","v":1},null,null,null,"Salinity/Conductivity",null,null,null,null,"Australian Bass",null,null,"adult",null,null,"15 day",null,null,"LC10",null,null,"Development",null,null,"Fish ",null,null,"Cyanobacteria",null,null,"Bacillariophyceae",null,null,"filtered seawater",null,null,18,null,null,null,null,null,"7.5-8.1",null,null,20.70]
[null,"*","If the selected answer option does not work try clicking on any other cell first and then click back on the answer option again.",null,null,{"$f":"IF(AC3=\"\",0,1)","v":1},null,null,null,null,null,null,null,null,"Chlorella sp.",null,null,"adult",null,null,"15 mins",null,null,"LC50",null,null,"Development",null,null,"Lobster",null,null,"Dinoflagellata",null,null,"Bivalvia",null,null,"Filtered synthetic seawater",null,null,19,null,null,null,null,null,"7.6-8.0",null,null,26]
{"$rows_left_out":75}
{"sheet":"MEW nonplant_WS","index":6,"n_rows":128,"n_cols":24,"rows_kept":128,"cut":false,"hidden":false,"merged":[]}
[]
["Question No.",1,2,3,4,5,6,7,8,9,10,11,12,13,14,15,16.10,16.20,16.30,17,18,"Total Score","Quality Score"]
["Short Questions","Duration of the exposure ","Biological endpoint","Biological effect stated or not","Biological effect quantified or not","Appropriate controls","Control & contaminant concentration","Test acceptability criteria","Characteristics of the test organism"," Type of test media","Type of exposure","Contaminant concentrations","Parallel reference toxicant toxicity tests","Concentration–response relationship","Determine the toxicity","NOEC/LOEC or LC/EC/BEC","Conductivity/Salinity","Dissolved Oxygen","PH","Temperature","Grade or purity"]
["Marks Awarded ","10 or 0","10,5 or 0","5 or 0 ","5 or 0 ","5 or 0 ","5 or 0 ","5 or 0 ","5 or 0 ","5 or 0 ","4 or 0","4 or 2 or 0","4 or 2","4 or 2","4 or 2","4 or 2","3 or 1 or 0","3 or 1 or 0","3 or 1 or 0","3 or 0","3 or 0 "]
["Max. Possible Score",10,10,5,5,5,5,5,5,5,4,4,4,4,4,4,3,3,3,3,3,{"$f":"SUM(B5:U5)","v":94}]
["Category","MEW_nonplant","Paper and data unique identifier(eg. 1-1,10-150)","269-1"]
["Scores",10,10,5,5,5,5,0,5,5,4,0,0,0,4,4,0,0,0,3,3,68,0.72340425531914898,"The highest possible grade for this datum is acceptable."]
["Answers","80 days","growth - diameter","LOEC","NOEC","Yes - seawater + DMSO","Yes","","Yes - juveniles immediately after metamorphosis","Yes - seawater","static renewal","No - Not stated","No - Not stated","Only one concentration tested","Yes","Yes","","","","18oC","BPA"]
["Category","MEW_nonplant","Paper and data unique identifier(eg. 1-1,10-150)","270-3"]
["Scores",10,10,5,5,5,5,0,5,5,4,0,0,0,4,4,3,0,0,3,3,71,0.75531914893617025,"The highest possible grade for this datum is acceptable."]
{"$rows_left_out":119}
{"sheet":"MEW plant","index":7,"n_rows":81,"n_cols":53,"rows_kept":81,"cut":false,"hidden":false,"merged":[[3,4,7,4],[9,2,9,4],[11,2,13,2],[11,7,13,7],[14,2,16,2],[14,7,16,7],[17,2,19,2],[17,7,19,7],[20,2,21,2],[20,7,21,7],[22,2,24,2],[22,7,24,7],[25,2,27,2],[25,7,27,7],[28,2,30,2],[28,7,30,7],[31,2,33,2],[31,7,33,7],[34,2,36,2],[34,7,36,7],[37,2,39,2],[37,7,39,7],[40,2,42,2],[40,7,42,7],[43,2,45,2],[43,7,45,7],[46,2,48,2],[46,7,48,7],[49,2,51,2],[49,7,51,7],[56,1,58,1],[56,2,58,2],[59,7,61,7],[65,2,68,2],[65,7,68,7],[52,2,54,2],[52,7,54,7],[62,2,64,2],[62,7,64,7],[56,7,58,7]]}
[null,1,"Fill in the blank cells below, based on information provided in the paper being assessed. You can either pick an option from the dropdown list or add the appropriate detail using the 'Add to list' button. ",null,null,{"$f":"IF(BA3=\"\",0,1)","v":1},null,null,null,null,null,null,null,null,"* All the text in RED are used for drop down list ,make changes with caution."]
[null,null,"Category",{"$f":"IF(AF3=\"\",0,1)","v":1},"MEW_plant",{"$f":"IF(E3=\"\",0,1)","v":1},"Citation No.",{"$f":"IF(ISERROR(FIND(\"-\",E3)),E3,LEFT(E3,FIND(\"-\",E3)-1))","v":"291"},null,"Taxonomic group",null,null,null,null,"Species",null,null,"Lifestage",null,null,"Exposure duration",null,null,"Measure of toxicity",null,null,"Toxicity endpoint",null,null,"Taxonomic group",null,null,"Phylum",null,null,"Class",null,null,"Media",null,null,"Temperature ",null,null,"Acute Or Chronic",null,null,"PH",null,null,"Salinity/Comdictivity"]
[null,null,"Paper and data unique identifier(eg. 1-1,10-150)",{"$f":"IF(AI3=\"\",0,1)","v":1},"291-2",{"$f":"IF(E4=\"\",0,1)","v":1},"Species (Scientific name)",null,null,"Phylum",null,null,null,null,"Aedes albopictus",12,{"$f":"IF(P3=0,\"\",INDEX(O3:O102,P3))","v":"Chlorella sp."},"1 month",5,{"$f":"IF(S3=0,\"\",INDEX(R3:R102,S3))","v":"N.A."},"11 hour",8,{"$f":"IF(V3=0,\"\",INDEX(U3:U102,V3))","v":"3 days"},"EC50",1,{"$f":"IF(Y3=0,\"\",INDEX(X3:X102,Y3))","v":"EC50"},"average pop growth rate: cell density",13,{"$f":"IF(AB3=0,\"\",INDEX(AA3:AA102,AB3))","v":"Growth"},"Diatom",5,{"$f":"IF(AE3=0,\"\",INDEX(AD3:AD102,AE3))","v":"N.A."},"Bacillariophyta",3,{"$f":"IF(AH3=0,\"\",INDEX(AG3:AG102,AH3))","v":"Chlorophyta"},"Branchiopoda",10,{"$f":"IF(AK3=0,\"\",INDEX(AJ3:AJ102,AK3))","v":"Trebouxiophyceae"},"F/2 marine media",10,{"$f":"IF(AN3=0,\"\",INDEX(AM3:AM102,AN3))","v":"Natural and artificial seawater"},15,8,{"$f":"IF(AQ3=0,\"\",INDEX(AP3:AP102,AQ3))","v":"N.A."},"Acute",3,{"$f":"IF(AT3=0,\"\",INDEX(AS3:AS102,AT3))","v":"N.A."},"7.5 - 8.3",3,{"$f":"IF(AW3=0,\"\",INDEX(AV3:AV102,AW3))","v":"N.A."},20,5,{"$f":"IF(AZ3=0,\"\",INDEX(AY3:AY102,AZ3))","v":"30 ppt"}]
[null,null,"Citation",{"$f":"IF(AL3=\"\",0,1)","v":1},"Walsh, G.E., M.J. Yoder, L.L. McLaughlin and E.M. Lores. 1987. Response of marine unicellular algae to brominated organic compounds in six growth media. Ecotoxicology and Environmental Safety 14: 215-222",{"$f":"IF(H8=\"\",0,1)","v":1},"Lifestage",null,null,"Class",null,null,null,null,"Australian Bass",null,null,"1 year old",null,null,"13 days",null,null,"EC50",null,null,"Average population growth rate",null,null,"Fish ",null,null,"Bacillariophyta",null,null,"Chlorophyceae",null,null,"filtered artificial seawater",null,null,20,null,null,"Chronic",null,null,"8.1–8.4",null,null,30]
[null,null,null,{"$f":"IF(AO3=\"\",0,1)","v":1},null,{"$f":"IF(AX3=\"\",0,1)","v":1},"Exposure duration",null,null,"Media",null,null,null,null,"Dunaliella tertiolecta",null,null,"Fresh culture < 7d",null,null,"24hr",null,null,"LC50",null,null,"Bioluminescence",null,null,"Macroalgae",null,null,"Chlorophyta",null,null,"Cyanophyceae",null,null,"Freshwater",null,null,25,null,null,"N.A.",null,null,"N.A.",null,null,"150 uS/cm"]
[null,null,null,{"$f":"IF(AR3=\"\",0,1)","v":1},null,{"$f":"IF(Q3=\"\",0,1)","v":1},"Measure of toxicity",null,null,"Temperature ",null,null,null,null,"Dunaliella tertiolecta",null,null,"log phase growth",null,null,"5 hours",null,null,"LOEC",null,null,"Cell density, biovolume",null,null,"Microalga",null,null,"Cyanobacteria",null,null,"Dinophyceae",null,null,"Marinewater",null,null,"15°C",null,null,null,null,null,"Not stated",null,null,"213 uS/cm"]
[null,null,null,{"$f":"IF(AU3=\"\",0,1)","v":1},null,{"$f":"IF(T3=\"\",0,1)","v":1},"Toxicity endpoint",null,null,"Acute Or Chronic ",null,null,null,null,"N.A.",null,null,"N.A.",null,null,"96 hrs",null,null,"N.A.",null,null,"Fish ",null,null,"N.A.",null,null,"Miozoa",null,null,"Mediophyceae",null,null,"N.A.",null,null,"20 ± 1°C",null,null,null,null,null,"pH 8.1–8.4",null,null,"30 ppt"]
[null,null,null,null,null,{"$f":"IF(W3=\"\",0,1)","v":1},"Toxicity value","0.83 mg/L",null,"PH",null,null,null,null,"Photobacterium phosphoreum",null,null,"N/A",null,null,"N.A.",null,null,"NOEC",null,null,"Growth inhibition",null,null,null,null,null,"N.A.",null,null,"Mediophyceae",null,null,"natural seawater",null,null,"25 ± 1",null,null,null,null,null,"PH11",null,null,"33 ± 0.5"]
[null,2,"Select the appropriate answer option to each question. Comments can be added to the cells in column H.",null,null,{"$f":"IF(Z3=\"\",0,1)","v":1},null,null,null,"Salinity/Conductivity",null,null,null,null,"Pyrocystis lunula",null,null,"not stated",null,null,"4 days",null,null,null,null,null,"Inhibition of carbon incorporation",null,null,null,null,null,"Ochrophyta",null,null,"N.A.",null,null,"Saltwater algal assay medium",null,null,"25°C",null,null,null,null,null,"PH7.0",null,null,"N.A."]
[null,"*","If the selected answer option does not work try clicking on any other cell first and then click back on the answer option again.",null,null,{"$f":"IF(AC3=\"\",0,1)","v":1},null,null,null,null,null,null,null,null,"Saccharina latissima",null,null,"Not stated",null,null,"3 days",null,null,null,null,null,"Microalga",null,null,null,null,null,"Tracheophyta",null,null,"Phaeophyceae",null,null,"Sterilised and filtered offshore marine water",null,null,"N.A.",null,null,null,null,null,null,null,null,"Not stated"]
{"$rows_left_out":72}
{"sheet":"MEW plant_WS","index":8,"n_rows":17,"n_cols":23,"rows_kept":17,"cut":false,"hidden":false,"merged":[]}
[]
["Question No.",1,2,3,4,5,6,7,8,9,10,11,12,13,14,15,16.10,16.30,17,18,"Total Score","Quality Score","Comment "]
["Short Questions","Duration of the exposure ","Biological endpoint","Biological effect stated or not","Biological effect quantified or not","Appropriate controls","Control & contaminant concentration","Test acceptability criteria","Characteristics of the test organism"," Type of test media","Type of exposure","Contaminant concentrations","Parallel reference toxicant toxicity tests","Concentration–response relationship","Determine the toxicity","NOEC/LOEC or LC/EC/BEC","Conductivity/Salinity","PH","Temperature","Grade or purity"]
["Marks Awarded ","10 or 0","10,5 or 0","5 or 0 ","5 or 0 ","5 or 0 ","5 or 0 ","5 or 0 ","5 or 0 ","5 or 0 ","4 or 0","4 or 2 or 0","4 or 2","4 or 2","4 or 2","4 or 2","3 or 1 or 0","3 or 1 or 0","3 or 0","3 or 0 "]
["Max. Possible Score",10,10,5,5,5,5,5,5,5,4,4,4,4,4,4,3,3,3,3,{"$f":"SUM(B5:T5)","v":91}]
["Category","MEW_plant","Paper and data unique identifier(eg. 1-1,10-150)","287-2"]
["Scores",10,10,5,5,5,5,2,5,5,4,2,0,4,4,4,1,0,0,0,77,0.84615384615384615,""]
["Answers","96 h","Chlorophyll a","EC50","50%","EPA procedures and Table 3 shows control results","EPA procedures so assume yes","EPA procedures so inferred","EPA procedures so assumed. Does state lab culture. ","Saltwater algal assay medum","Static","","","Table 3","","95% CIs provided ","","Not stated","20±2oC","Polycarbonate-grade bisphenol A, obtained from the DOW Chemical Company, Texas Division, (Freeport, TX) and identified as lot no TB 84071221. Molar purity was 99.93%"]
["Category","MEW_plant","Paper and data unique identifier(eg. 1-1,10-150)","287-1"]
["Scores",10,10,5,5,5,5,2,5,5,4,0,0,4,4,4,3,0,0,0,77,0.84615384615384615,"The highest possible grade for this datum is acceptable."]
{"$rows_left_out":7}