{"text_format":"1","workbook":"xlsx","n_sheets":9,"sheets":["Copyright","Cover","Instruction","All Result","Sheet1","FW nonmetal nonplant","FW nonmetal nonplant_WS","FW nonmetal plant","FW nonmetal plant_WS"],"not_rendered":{"charts":0,"images":0,"macros":1,"external_links":0,"defined_names":2,"comments":3,"pivot_tables":0},"unopened":[],"bounds":{"document_bytes":16777216,"sheet_cells":100000,"rows_first":2000,"rows_last":500,"rows_between":2000,"halvings":0,"cell_chars":16384,"cell_head_chars":4096},"cells_cut":0,"cells_raw":0,"read":"whole","date_system":"1900"}

{"sheet":"Copyright","index":0,"n_rows":0,"n_cols":0,"rows_kept":0,"cut":false,"hidden":false,"merged":[]}

{"sheet":"Cover","index":1,"n_rows":20,"n_cols":7,"rows_kept":20,"cut":false,"hidden":false,"merged":[[18,6,18,8],[14,6,14,8],[13,6,13,8],[4,4,4,10],[9,6,9,8],[12,6,12,8],[5,5,6,9]]}
[]
[]
[]
[]
[null,null,null,null,"Ecotoxicity Data Quality Assessment Method V2.4"]
[null,null,null,null,null,"To be used to assess the quality of data used for the Australian and New Zealand Guidelines for Fresh and Marine Water Quality (including sediment) and the Australian National Environment Protection (Assessment of Site Contamination) Measure"]
[]
[]
[]
[null,null,null,null,null,null,"Developed by "]
{"$rows_left_out":11}
{"sheet":"Instruction","index":2,"n_rows":21,"n_cols":10,"rows_kept":21,"cut":false,"hidden":false,"merged":[[27,6,27,16],[14,6,14,7],[5,4,5,7]]}
[]
[]
[null,"Click here to see \"All Result\" -->","All Result"]
[]
[]
[null,null,null,null,"Freshwater "]
[]
[null,"Tabs contain questionaries -->           ","Freshwater/metal/nonplant",null,"Freshwater/non-metal/non-plant ",null,null,"Freshwater/metal/plant",null,"Freshwater/non-metal/plant"]
[]
[]
{"$rows_left_out":12}
{"sheet":"All Result","index":3,"n_rows":66,"n_cols":32,"rows_kept":66,"cut":false,"hidden":false,"merged":[]}
["Chemical:","Bisphenol A"]
["Medium:","Freshwater"]
[]
[{"$f":"'FW nonmetal plant'!C2","v":"Category"},{"$f":"'FW nonmetal plant'!C3","v":"Paper and data unique identifier(eg. 1-1,10-150)"},{"$f":"'FW nonmetal plant'!C70","v":"Total score"},{"$f":"'FW nonmetal plant'!C72","v":"Quality Score"},"Comment ","Species (Scientific name)","Lifestage","Exposure duration","Measure of toxicity","Toxicity endpoint","Toxicity value","Taxonomic group","Phylum","Class","Media","Temperature ","Acute Or Chronic ","PH","Salinity/Conductivity","Citation","Citation No.",null,null,null,null,null,null,null,null,null,null,"Olivia Formulation Check"]
["Freshwater/non-metal/non-plant","722-1",92,0.89320388349514568,null,"Brachionus calyciflorus","Newly hatched (<2 h old)","2 d","NOEC","Reproduction","1.8 mg/L","Rotifer","Rotifer","Eurotatoria","Yes - fortified well water","23+/- 1oC ","Chronic",8,"290 uS/cm","Mihaich, E.M., U. Friederich, N. Caspers, A. Tilghman Hall, G.M. Klecka, S.S. Dimond, C.A. Staples, L.S. Ortego and S.G. Hentges. 2009. Acute and chronic testing of bisphenol A with aquatic invertebrates and plants. Ecotoxicology and Environmental Safety 72: 1392-1399.","722"]
["Freshwater/non-metal/non-plant","722-2",92,0.89320388349514568,null,"Brachionus calyciflorus","Newly hatched (<2 h old)","2 d","LOEC","Reproduction","3.6 mg/L","Rotifer","Rotifer","Eurotatoria","Yes - fortified well water","25+/- 1oC","Chronic",8,"290 uS/cm","Mihaich, E.M., U. Friederich, N. Caspers, A. Tilghman Hall, G.M. Klecka, S.S. Dimond, C.A. Staples, L.S. Ortego and S.G. Hentges. 2009. Acute and chronic testing of bisphenol A with aquatic invertebrates and plants. Ecotoxicology and Environmental Safety 72: 1392-1399.","722"]
["Freshwater/non-metal/plant","733-1",67,0.65048543689320393,null,"Bruguiera gymnorhiza",null,"28 d","LC50","Mortality","39.97 mg/L","Plant","Tracheophyta","Magnoliopsida","Distilled water","","Chronic","Initial pH 6.3-6.5","","Saiyood, S., D. Inthorn, A.S. Vangnai and P. Thiravetyan. 2013. Phytoremediation of bisphenol A and total dissolved solids by the mangrove plant, Bruguiera gymnorhiza. International Journal of Phytoremediation 15: 427-438.","733"]
["Freshwater/non-metal/non-plant","728-1",68,0.66019417475728159,"The highest possible grade for this datum is acceptable.","Carassius auratus","Adults","90 d","NOEC","Growth","0.02 mg/L","Vertebrate","Chordata","Teleostei ","The solvent control was dimethyl sulfoxide and this was used for the analysis","18-22oC","Chronic","7.3-7.8","","Hatef, A., A. Zare, S.M.H. Alavi, H.R. Habibi and O. Linhart. 2012. Modulations in androgen and estrogen mediating genes and testicular response in male goldfish exposed to bisphenol A. Environmental Toxicology and Chemistry 31: 2069-2077.","728"]
["Freshwater/non-metal/non-plant","729-1",70,0.67961165048543692,null,"Chironomus riparius","Eggs","> 10 d","NOEC","Growth","0.1 mg/L","Invertebrate","Arthropoda","Insecta ","dechlorinated tap water","20+/-1oC","Chronic","6.9-7.3","221-236 uS/cm","Watts, M.M., D. Pascoe and K. Carroll. 2003. Exposure to 17a-ethyinylestradiol and bisphenol A - effects on larval moulting and mouthpart structure of chironomus riparius. Ecotoxicology and Environmental Safety 54: 207-215.","729"]
["Freshwater/non-metal/non-plant","729-2",70,0.67961165048543692,null,"Chironomus riparius","Eggs","> 10 d","LOEC","Growth","1 mg/L","Invertebrate","Arthropoda","Insecta ","Solvent - ethanol and dechlorinated tap water","20+/-1oC","Chronic","6.9-7.6","221-236 uS/cm","Watts, M.M., D. Pascoe and K. Carroll. Exposure to 17a-ethyinylestradiol and bisphenol A - effects on larval moulting and mouthpart structure of chironomus riparius. Ecotoxicology and Environmental Safety 54: 207-215.","729"]
{"$rows_left_out":57}
{"sheet":"Sheet1","index":4,"n_rows":70,"n_cols":29,"rows_kept":70,"cut":false,"hidden":true,"merged":[]}
[]
[{"$f":"#REF!","v":{"$error":"#REF!"}},{"$f":"#REF!","v":{"$error":"#REF!"}},{"$f":"#REF!","v":{"$error":"#REF!"}},{"$f":"#REF!","v":{"$error":"#REF!"}},{"$f":"#REF!","v":{"$error":"#REF!"}},{"$f":"#REF!","v":{"$error":"#REF!"}},{"$f":"#REF!","v":{"$error":"#REF!"}},{"$f":"#REF!","v":{"$error":"#REF!"}},{"$f":"#REF!","v":{"$error":"#REF!"}},{"$f":"#REF!","v":{"$error":"#REF!"}},{"$f":"#REF!","v":{"$error":"#REF!"}},{"$f":"#REF!","v":{"$error":"#REF!"}},{"$f":"#REF!","v":{"$error":"#REF!"}},{"$f":"#REF!","v":{"$error":"#REF!"}},{"$f":"#REF!","v":{"$error":"#REF!"}},{"$f":"#REF!","v":{"$error":"#REF!"}},{"$f":"#REF!","v":{"$error":"#REF!"}},{"$f":"#REF!","v":{"$error":"#REF!"}},{"$f":"#REF!","v":{"$error":"#REF!"}},{"$f":"#REF!","v":{"$error":"#REF!"}},{"$f":"#REF!","v":{"$error":"#REF!"}},{"$f":"#REF!","v":{"$error":"#REF!"}},{"$f":"#REF!","v":{"$error":"#REF!"}},{"$f":"#REF!","v":{"$error":"#REF!"}},{"$f":"#REF!","v":{"$error":"#REF!"}},{"$f":"#REF!","v":{"$error":"#REF!"}}]
[{"$f":"#REF!","v":{"$error":"#REF!"}},{"$f":"#REF!","v":{"$error":"#REF!"}},{"$f":"#REF!","v":{"$error":"#REF!"}},{"$f":"#REF!","v":{"$error":"#REF!"}}]
[{"$f":"#REF!","v":{"$error":"#REF!"}},{"$f":"#REF!","v":{"$error":"#REF!"}},{"$f":"#REF!","v":{"$error":"#REF!"}},{"$f":"#REF!","v":{"$error":"#REF!"}},{"$f":"#REF!","v":{"$error":"#REF!"}},{"$f":"#REF!","v":{"$error":"#REF!"}},{"$f":"#REF!","v":{"$error":"#REF!"}},{"$f":"#REF!","v":{"$error":"#REF!"}},{"$f":"#REF!","v":{"$error":"#REF!"}},{"$f":"#REF!","v":{"$error":"#REF!"}},{"$f":"#REF!","v":{"$error":"#REF!"}},{"$f":"#REF!","v":{"$error":"#REF!"}},{"$f":"#REF!","v":{"$error":"#REF!"}},{"$f":"#REF!","v":{"$error":"#REF!"}},{"$f":"#REF!","v":{"$error":"#REF!"}},{"$f":"#REF!","v":{"$error":"#REF!"}},{"$f":"#REF!","v":{"$error":"#REF!"}},{"$f":"#REF!","v":{"$error":"#REF!"}},{"$f":"#REF!","v":{"$error":"#REF!"}},{"$f":"#REF!","v":{"$error":"#REF!"}},{"$f":"#REF!","v":{"$error":"#REF!"}},{"$f":"#REF!","v":{"$error":"#REF!"}},{"$f":"#REF!","v":{"$error":"#REF!"}},{"$f":"#REF!","v":{"$error":"#REF!"}},{"$f":"#REF!","v":{"$error":"#REF!"}},{"$f":"#REF!","v":{"$error":"#REF!"}}]
["Answers",{"$f":"IF(#REF!=0,\"\",#REF!)","v":{"$error":"#REF!"}},{"$f":"IF(#REF!=0,\"\",#REF!)","v":{"$error":"#REF!"}},{"$f":"IF(#REF!=0,\"\",#REF!)","v":{"$error":"#REF!"}},{"$f":"IF(#REF!=0,\"\",#REF!)","v":{"$error":"#REF!"}},{"$f":"IF(#REF!=0,\"\",#REF!)","v":{"$error":"#REF!"}},{"$f":"IF(#REF!=0,\"\",#REF!)","v":{"$error":"#REF!"}},{"$f":"IF(#REF!=0,\"\",#REF!)","v":{"$error":"#REF!"}},{"$f":"IF(#REF!=0,\"\",#REF!)","v":{"$error":"#REF!"}},{"$f":"IF(#REF!=0,\"\",#REF!)","v":{"$error":"#REF!"}},{"$f":"IF(#REF!=0,\"\",#REF!)","v":{"$error":"#REF!"}},{"$f":"IF(#REF!=0,\"\",#REF!)","v":{"$error":"#REF!"}},{"$f":"IF(#REF!=0,\"\",#REF!)","v":{"$error":"#REF!"}},{"$f":"IF(#REF!=0,\"\",#REF!)","v":{"$error":"#REF!"}},{"$f":"IF(#REF!=0,\"\",#REF!)","v":{"$error":"#REF!"}},{"$f":"IF(#REF!=0,\"\",#REF!)","v":{"$error":"#REF!"}},{"$f":"IF(#REF!=0,\"\",#REF!)","v":{"$error":"#REF!"}},{"$f":"IF(#REF!=0,\"\",#REF!)","v":{"$error":"#REF!"}},{"$f":"IF(#REF!=0,\"\",#REF!)","v":{"$error":"#REF!"}},{"$f":"IF(#REF!=0,\"\",#REF!)","v":{"$error":"#REF!"}},{"$f":"IF(#REF!=0,\"\",#REF!)","v":{"$error":"#REF!"}},{"$f":"IF(#REF!=0,\"\",#REF!)","v":{"$error":"#REF!"}},{"$f":"IF(#REF!=0,\"\",#REF!)","v":{"$error":"#REF!"}},{"$f":"IF(#REF!=0,\"\",#REF!)","v":{"$error":"#REF!"}}]
[{"$f":"#REF!","v":{"$error":"#REF!"}},{"$f":"#REF!","v":{"$error":"#REF!"}},{"$f":"#REF!","v":{"$error":"#REF!"}},{"$f":"#REF!","v":{"$error":"#REF!"}},{"$f":"#REF!","v":{"$error":"#REF!"}},{"$f":"#REF!","v":{"$error":"#REF!"}},{"$f":"#REF!","v":{"$error":"#REF!"}},{"$f":"#REF!","v":{"$error":"#REF!"}}]
[{"$f":"#REF!","v":{"$error":"#REF!"}},{"$f":"#REF!","v":{"$error":"#REF!"}},{"$f":"#REF!","v":{"$error":"#REF!"}},{"$f":"#REF!","v":{"$error":"#REF!"}},{"$f":"#REF!","v":{"$error":"#REF!"}},{"$f":"IF(#REF!=0,\"\",#REF!)","v":{"$error":"#REF!"}},{"$f":"IF(#REF!=0,\"\",#REF!)","v":{"$error":"#REF!"}},{"$f":"IF(#REF!=0,\"\",#REF!)","v":{"$error":"#REF!"}}]
[]
[]
[]
{"$rows_left_out":61}
{"sheet":"FW nonmetal nonplant","index":5,"n_rows":108,"n_cols":53,"rows_kept":108,"cut":false,"hidden":false,"merged":[[65,2,68,2],[65,7,68,7],[59,7,61,7],[52,2,54,2],[52,7,54,7],[56,7,58,7],[62,2,64,2],[62,7,64,7],[43,2,45,2],[43,7,45,7],[46,2,48,2],[46,7,48,7],[49,2,51,2],[49,7,51,7],[34,2,36,2],[34,7,36,7],[37,2,39,2],[37,7,39,7],[40,2,42,2],[40,7,42,7],[25,2,27,2],[25,7,27,7],[28,2,30,2],[28,7,30,7],[31,2,33,2],[31,7,33,7],[17,2,19,2],[17,7,19,7],[20,2,21,2],[20,7,21,7],[22,2,24,2],[22,7,24,7],[3,4,7,4],[9,2,9,4],[11,2,13,2],[11,7,13,7],[14,2,16,2],[14,7,16,7]]}
[null,1,"Fill in the blank cells below, based on information provided in the paper being assessed. You can either pick an option from the dropdown list or add the appropriate detail using the 'Add to list' button. ",null,null,null,null,null,null,null,null,null,null,null,"* All the text in RED are used for drop down list ,make changes with caution."]
[null,null,"Category",{"$f":"IF(AF3=\"\",0,1)","v":1},"Freshwater/non-metal/non- plant",{"$f":"IF(E3=\"\",0,1)","v":1},"Citation No.",{"$f":"IF(ISERROR(FIND(\"-\",E3)),E3,LEFT(E3,FIND(\"-\",E3)-1))","v":"735"},null,"Taxonomic group",null,null,null,null,"Species",null,null,"Lifestage",null,null,"Exposure duration",null,null,"Measure of toxicity",null,null,"Toxicity endpoint",null,null,"Taxonomic group",null,null,"Phylum",null,null,"Class",null,null,"Media",null,null,"Temperature ",null,null,"Acute Or Chronic",null,null,"PH",null,null,"Salinity/Comdictivity"]
[null,null,"Paper and data unique identifier(eg. 1-1,10-150)",{"$f":"IF(AI3=\"\",0,1)","v":1},"735-2",{"$f":"IF(E4=\"\",0,1)","v":1},"Species (Scientific name)",null,null,"Phylum",null,null,null,null,"Acanthocyclops robustus",106,{"$f":"IF(P3=0,\"\",INDEX(O3:O102,P3))","v":{"$error":"#REF!"}},"<120 days post h atch",23,{"$f":"IF(S3=0,\"\",INDEX(R3:R102,S3))","v":"Eggs"},"10 day",9,{"$f":"IF(V3=0,\"\",INDEX(U3:U102,V3))","v":"21 day"},"EC10",15,{"$f":"IF(Y3=0,\"\",INDEX(X3:X102,Y3))","v":"LOEC"},"ability to cling",36,{"$f":"IF(AB3=0,\"\",INDEX(AA3:AA102,AB3))","v":"Mortality"},"Amphibian",11,{"$f":"IF(AE3=0,\"\",INDEX(AD3:AD102,AE3))","v":"Macroinvertebrate"},"\tChytridiomycota",13,{"$f":"IF(AH3=0,\"\",INDEX(AG3:AG102,AH3))","v":"Mollusca"},"\tOstracoda",14,{"$f":"IF(AK3=0,\"\",INDEX(AJ3:AJ102,AK3))","v":"Gastropoda"},"Aged tap water",42,{"$f":"IF(AN3=0,\"\",INDEX(AM3:AM102,AN3))","v":"reconstituted water"},8,76,{"$f":"IF(AQ3=0,\"\",INDEX(AP3:AP102,AQ3))","v":"20oC"},"7.378-8.33",4,{"$f":"IF(AT3=0,\"\",INDEX(AS3:AS102,AT3))","v":"Chronic"},7,33,{"$f":"IF(AW3=0,\"\",INDEX(AV3:AV102,AW3))","v":"Not stated"},null,null,"N.A."]
[null,null,"Citation",{"$f":"IF(AL3=\"\",0,1)","v":1},"Sanchez-Arguello, P., N. Aparicio and C. Fernandez. 2012. Linking embryo toxicity with genotoxic responses in the freshwater snail Physa acuta: Single exposure to benzo(a)pyrene, fluoxetine, bisphenol A, vinclozolin and exposure to binary mixtures with benzo(a)pyrene. Ecotoxicology and Environmental Safety 80: 152-160",{"$f":"IF(H8=\"\",0,1)","v":1},"Lifestage",null,null,"Class",null,null,null,null,"Achnanthidium minutissimum",null,null,"<24h neonate f2 ",null,null,"11 hour",null,null,"EC50",null,null,"ability to swim",null,null,"Bacteria",null,null,"\tOomycota",null,null,"\tSordariomycetes",null,null,"Algal assay medium",null,null,10,null,null,"7.78-8.33",null,null,7.50]
[null,null,null,{"$f":"IF(AO3=\"\",0,1)","v":1},null,{"$f":"IF(W3=\"\",0,1)","v":1},"Exposure duration",null,null,"Media",null,null,null,null,"Aedes aegypti",null,null,"<24hr neonate",null,null,"1-2 weeks",null,null,"EC50",null,null,"ability to thrash when prodded",null,null,"Chordata",null,null,"\tRotifera",null,null,"Actinopterygii",null,null,"algaltoxkit",null,null,12,null,null,"Acute ",null,null,7.50]
[null,null,null,{"$f":"IF(AR3=\"\",0,1)","v":1},null,{"$f":"IF(Q3=\"\",0,1)","v":{"$error":"#REF!"}},"Measure of toxicity",null,null,"Temperature ",null,null,null,null,"Aedes albopictus",null,null,">23 days",null,null,"120hpf",null,null,"hatchability",null,null,"ability to walk/crawl",null,null,"Chromista",null,null,"Actinopterygii",null,null,"Amphibia",null,null,"Aquaria water (tap water)",null,null,12,null,null,"Chronic",null,null,7.66]
[null,null,null,{"$f":"IF(AU3=\"\",0,1)","v":1},null,{"$f":"IF(T3=\"\",0,1)","v":1},"Toxicity endpoint",null,null,"Acute Or Chronic ",null,null,null,null,"Aedes albopictus",null,null,">6 month ",null,null,"13 days",null,null,"IC25",null,null,"activity",null,null,"Diatom",null,null,"Arthropoda",null,null,"Bacillariophyceae",null,null,"artificial system water",null,null,12,null,null,"N.A.",null,null,7.67]
[null,null,null,null,null,{"$f":"IF(W3=\"\",0,1)","v":1},"Toxicity value","500 ug/L",null,"PH",null,null,null,null,"Aedes albopictus HAmAal strain",null,null,"1 month",null,null,"14 days",null,null,"LC10",null,null,"Body length",null,null,"Fish",null,null,"Ascomycota",null,null,"Bivalvia",null,null,"ATSM hardwater",null,null,13,null,null,null,null,null,7.80]
[null,2,"Select the appropriate answer option to each question. Comments can be added to the cells in column H.",null,null,{"$f":"IF(Z3=\"\",0,1)","v":1},null,null,null,"Salinity/Conductivity","N.A.",null,null,null,"Aedes albopictus Ikaken strain",null,null,"1 year old",null,null,"164 days",null,null,"LC100",null,null,"Body weight",null,null,"Fish",null,null,"Basidiomycota",null,null,"Branchiopoda",null,null,"Bore water",null,null,13,null,null,null,null,null,8.10]
[null,"*","If the selected answer option does not work try clicking on any other cell first and then click back on the answer option again.",null,null,{"$f":"IF(AC3=\"\",0,1)","v":1},null,null,null,null,null,null,null,null,"Aedes albopictus MAmAal strain",null,null,"1st instar larvae",null,null,"19 days",null,null,"LC50",null,null,"Brood size",null,null,"Flagellate",null,null,"Chlorophyta",null,null,"Chlorophyceae",null,null,"CBS culture collection",null,null,13,null,null,null,null,null,"6.5-7"]
{"$rows_left_out":99}
{"sheet":"FW nonmetal nonplant_WS","index":6,"n_rows":150,"n_cols":24,"rows_kept":150,"cut":false,"hidden":false,"merged":[]}
[]
["Question No.",1,2,3,4,5,6,7,8,9,10,11,12,13,14,15,16.10,16.60,17,18,"Total Score","Quality Score",null,"Comment "]
["Short Questions","Duration of the exposure ","Biological endpoint","Biological effect stated or not","Biological effect quantified or not","Appropriate controls","Control & contaminant concentration","Test acceptability criteria","Characteristics of the test organism"," Type of test media","Type of exposure","Contaminant concentrations","Parallel reference toxicant toxicity tests","Concentration–response relationship","Determine the toxicity","NOEC/LOEC or LC/EC/BEC","pH","Dissolved oxygen","Temperature","Grade or purity"]
["Category","Freshwater/non-metal/non- plant","Paper and data unique identifier(eg. 1-1,10-150)","296-1"]
["Scores",10,10,5,5,5,5,5,5,5,4,4,0,4,4,0,3,3,3,0,86,0.83495145631067957]
["Answers","10 days","Survival (failure to respond to mechanical stimulus; AM)","LC50","LC50","Yes both water control (dechlorinated mains water) and ethanol positive control","Yes - ten animals per treatment","Yes - all animals in the control and positive control survived","Yes - length","Dechlorinated tap water + ethanol","Semi-static","Yes","Not stated","Yes figure 1 ","","Not stated","6.9-7.3","72-85%","16 +/- 1oC","No"]
["Category","Freshwater/non-metal/non- plant","Paper and data unique identifier(eg. 1-1,10-150)","738-1"]
["Scores",10,10,5,0,5,5,0,5,5,4,0,4,4,4,4,0,0,3,0,68,0.66019417475728159]
["Answers","14 d","Reproduction - hatching","NOEC","","Aquaria water (tap water)","Yes - 9 reps","","Embryos","Tap water ","Static renewal","","Cadmium","Figure 4","Yes","Yes","","","26+/-0.5oC",""]
["Category","Freshwater/non-metal/non- plant","Paper and data unique identifier(eg. 1-1,10-150)","737-1"]
{"$rows_left_out":141}
{"sheet":"FW nonmetal plant","index":7,"n_rows":79,"n_cols":53,"rows_kept":79,"cut":false,"hidden":false,"merged":[[60,2,62,2],[60,7,62,7],[63,2,66,2],[63,7,66,7],[52,2,54,2],[52,7,54,7],[56,2,59,2],[56,7,59,7],[43,2,45,2],[43,7,45,7],[46,2,48,2],[46,7,48,7],[49,2,51,2],[49,7,51,7],[34,2,36,2],[34,7,36,7],[37,2,39,2],[37,7,39,7],[40,2,42,2],[40,7,42,7],[25,2,27,2],[25,7,27,7],[28,2,30,2],[28,7,30,7],[31,2,33,2],[31,7,33,7],[17,2,19,2],[17,7,19,7],[20,2,21,2],[20,7,21,7],[22,2,24,2],[22,7,24,7],[3,4,7,4],[9,2,9,4],[11,2,13,2],[11,7,13,7],[14,2,16,2],[14,7,16,7]]}
[null,1,"Fill in the blank cells below, based on information provided in the paper being assessed. You can either pick an option from the dropdown list or add the appropriate detail using the 'Add to list' button. ",null,null,null,null,null,null,null,null,null,null,null,"* All the text in RED are used for drop down list ,make changes with caution."]
[null,null,"Category",{"$f":"IF(AF3=\"\",0,1)","v":1},"Freshwater/non-metal/plant",{"$f":"IF(E3=\"\",0,1)","v":1},"Citation No.",{"$f":"IF(ISERROR(FIND(\"-\",E3)),E3,LEFT(E3,FIND(\"-\",E3)-1))","v":"745"},null,"Taxonomic group",null,null,null,null,"Species",null,null,"Lifestage",null,null,"Exposure duration",null,null,"Measure of toxicity",null,null,"Toxicity endpoint",null,null,"Taxonomic group",null,null,"Phylum",null,null,"Class",null,null,"Media",null,null,"Temperature ",null,null,"Acute Or Chronic",null,null,"PH",null,null,"Salinity/Conductivity"]
[null,null,"Paper and data unique identifier(eg. 1-1,10-150)",{"$f":"IF(AI3=\"\",0,1)","v":1},"745-5",{"$f":"IF(E4=\"\",0,1)","v":1},"Species (Scientific name)",null,null,"Phylum",null,null,null,null,"Aedes albopictus",26,{"$f":"IF(P3=0,\"\",INDEX(O3:O100,P3))","v":"Monoraphidium braunii"},"1 month",6,{"$f":"IF(S3=0,\"\",INDEX(R3:R100,S3))","v":"N.A."},"11 hours",8,{"$f":"IF(V3=0,\"\",INDEX(U3:U100,V3))","v":"96 hrs"},"EC1",6,{"$f":"IF(Y3=0,\"\",INDEX(X3:X100,Y3))","v":"LOEC"},"cartenoid conc. ",15,{"$f":"IF(AB3=0,\"\",INDEX(AA3:AA100,AB3))","v":"Growth"},"Cyano",4,{"$f":"IF(AE3=0,\"\",INDEX(AD3:AD100,AE3))","v":"Microalga"},"Chlorophyta",1,{"$f":"IF(AH3=0,\"\",INDEX(AG3:AG100,AH3))","v":"Chlorophyta"},"Branchiopoda",2,{"$f":"IF(AK3=0,\"\",INDEX(AJ3:AJ102,AK3))","v":"Chlorophyceae"},"AAP",21,{"$f":"IF(AN3=0,\"\",INDEX(AM3:AM100,AN3))","v":"FW04 growth media"},20,19,{"$f":"IF(AQ3=0,\"\",INDEX(AP3:AP100,AQ3))","v":"22oC"},"Acute ",2,{"$f":"IF(AT3=0,\"\",INDEX(AS3:AS100,AT3))","v":"Chronic"},5.50,18,{"$f":"IF(AW3=0,\"\",INDEX(AV3:AV100,AW3))","v":8.3000000000000007},"30 ppt",null,"N.A."]
[null,null,"Citation",{"$f":"IF(AL3=\"\",0,1)","v":1},"Gattullo, C.E., H. Bahrs, C.E.W. Steinberg and E. Loffredo. 2012. Removal of bipshenol A by the freshwater green alga Monoraphidium braunii and the role of natural organic matter. Science of the Total Environment 416:501-506",{"$f":"IF(AX3=\"\",0,1)","v":1},"Lifestage",null,null,"Class",null,null,null,null,"Anabaena flos-aquae",null,null,"1 year old",null,null,"13 days ",null,null,"EC20",null,null,"Chlorophyll a conc. ",null,null,"Fish",null,null,"Cyanobacteria",null,null,"Chlorophyceae",null,null,"algaltoxkit",null,null,21,null,null,"Chronic",null,null,6.70,null,null,"150 uS/cm"]
[null,null,null,{"$f":"IF(AO3=\"\",0,1)","v":1},null,{"$f":"IF(H8=\"\",0,1)","v":1},"Exposure duration",null,null,"Media",null,null,null,null,"Australian Bass",null,null,"Exponential growth phase",null,null,"24 hr",null,null,"EC50",null,null,"Chlorophyll b conc. ",null,null,"Macrophyte",null,null,"N.A.",null,null,"Chlorophyceae",null,null,"Freshwater",null,null,22,null,null,"Chronic",null,null,6.90,null,null,"N.A."]
[null,null,null,{"$f":"IF(AR3=\"\",0,1)","v":1},null,{"$f":"IF(Q3=\"\",0,1)","v":1},"Measure of toxicity",null,null,"Temperature ",null,null,null,null,"Chlorella pyrenoidosa",null,null,"Exponential growth phase",null,null,"3 days",null,null,"EC80",null,null,"Growth inhibition",null,null,"Microalga",null,null,"Tracheophyta",null,null,"Liliopsida",null,null,"HB4",null,null,28,null,null,"N.A.",null,null,7.50]
[null,null,null,{"$f":"IF(AU3=\"\",0,1)","v":1},null,{"$f":"IF(T3=\"\",0,1)","v":1},"Toxicity endpoint",null,null,"Acute Or Chronic ",null,null,null,null,"Chlorella pyrenoidosa",null,null,"logarithmic growth phase",null,null,"6 days",null,null,"LC50",null,null,"Growth Inhibition: Algal Biomass (cell counts)",null,null,"N.A.",null,null,"Tracheophyta",null,null,"N.A.",null,null,"HGZ media",null,null,"15°C",null,null,null,null,null,7.70]
[null,null,null,null,null,{"$f":"IF(W3=\"\",0,1)","v":1},"Toxicity value","2000 ug/L",null,"PH",null,null,null,null,"Chlorella vulgaris",null,null,"N.A.",null,null,"7 days",null,null,"LOEC",null,null,"Growth inhibition: AUC",null,null,"plantae",null,null,null,null,null,"Trebouxiophyceae",null,null,"Marinewater",null,null,"18-22",null,null,null,null,null,7.80]
[null,2,"Select the appropriate answer option to each question. Comments can be added to the cells in column H.",null,null,{"$f":"IF(Z3=\"\",0,1)","v":1},null,null,null,"Salinity/Conductivity","N.A.",null,null,null,"Chlorella vulgaris",null,null,"not stated",null,null,"72 hour",null,null,"N.A.",null,null,"Growth inhibition: cell count",null,null,null,null,null,null,null,null,null,null,null,"Moderately hard standard water",null,null,"20 ± 1°C",null,null,null,null,null,"7.5 - 8.3"]
[null,"*","If the selected answer option does not work try clicking on any other cell first and then click back on the answer option again.",null,null,{"$f":"IF(AC3=\"\",0,1)","v":1},null,null,null,null,null,null,null,null,"Dunaliella tertiolecta",null,null,"not stated",null,null,"96 hrs",null,null,"NOEC",null,null,"Growth inhibition: growth rate",null,null,null,null,null,null,null,null,null,null,null,"N.A.",null,null,"21-24",null,null,null,null,null,"7.7-7.9"]
{"$rows_left_out":70}
{"sheet":"FW nonmetal plant_WS","index":8,"n_rows":42,"n_cols":22,"rows_kept":42,"cut":false,"hidden":false,"merged":[]}
[]
["Question No.",1,2,3,4,5,6,7,8,9,10,11,12,13,14,15,16.10,17,18,"Total Score","Quality Score","Comment "]
["Short Questions","Duration of the exposure ","Biological endpoint","Biological effect stated or not","Biological effect quantified or not","Appropriate controls","Control & contaminant concentration","Test acceptability criteria","Characteristics of the test organism"," Type of test media","Type of exposure","Contaminant concentrations","Parallel reference toxicant toxicity tests","Concentration–response relationship","Determine the toxicity","NOEC/LOEC or LC/EC/BEC","pH","Temperature","Grade or purity"]
["Category","Freshwater/non-metal/plant","Paper and data unique identifier(eg. 1-1,10-150)","287-2"]
["Scores",10,5,5,5,5,5,2,5,5,4,4,0,4,4,4,0,3,3,73,0.70873786407766992]
["Answers","96 h","Cell Count; Total cell volume","EC50","EC50","EPA procedures and Table 3 shows control results","EPA procedures so assume yes","EPA procedures so inferred","EPA procedures so assumed. Does state lab culture. ","Yes - algal assay medium","EPA procedures - algal tests static","Yes - reverse phase liquid chromatographic methodolgy","No - not stated","Table 3. ","Described","95% CI's provided",null,"24 +/- 2oC","99.93% (polycarbonate grade bisphenol)"]
["Category","Freshwater/non-metal/plant","Paper and data unique identifier(eg. 1-1,10-150)","287-1"]
["Scores",10,5,5,5,5,5,2,5,5,0,4,0,4,4,4,0,3,3,69,0.66990291262135926]
["Answers","96 h","Total Cell Volume","EC50","EC50","EPA procedures","EPA procedures so assume yes","EPA procedures so inferred","EPA procedures so assumed. Does state lab culture. ","Yes - algal assay medium","EPA procedures - algal tests static","Yes - reverse phase liquid chromatographic methodolgy","No - not stated","Table 3. ","","95% CI's provided","","24 +/- 2oC","99.93% (polycarbonate grade bisphenol A)"]
["Category","Freshwater","Paper and data unique identifier(eg. 1-1,10-150)","733-1"]
{"$rows_left_out":32}