{"text_format":"1","workbook":"xlsx","n_sheets":8,"sheets":["Copyright","Cover","Instruction","All Result","Sheet1","FW nonmetal nonplant","FW nonmetal nonplant_WS","FW metal plant_WS"],"not_rendered":{"charts":0,"images":1,"macros":1,"external_links":0,"defined_names":1,"comments":3,"pivot_tables":0},"unopened":[],"bounds":{"document_bytes":16777216,"sheet_cells":100000,"rows_first":2000,"rows_last":500,"rows_between":2000,"halvings":0,"cell_chars":16384,"cell_head_chars":4096},"cells_cut":0,"cells_raw":0,"read":"whole","date_system":"1900"}

{"sheet":"Copyright","index":0,"n_rows":0,"n_cols":0,"rows_kept":0,"cut":false,"hidden":false,"merged":[]}

{"sheet":"Cover","index":1,"n_rows":20,"n_cols":7,"rows_kept":20,"cut":false,"hidden":false,"merged":[[18,6,18,8],[14,6,14,8],[13,6,13,8],[4,4,4,10],[9,6,9,8],[12,6,12,8],[5,5,6,9]]}
[]
[]
[]
[]
[null,null,null,null,"Ecotoxicity Data Quality Assessment Method V2.4"]
[null,null,null,null,null,"To be used to assess the quality of data used for the Australian and New Zealand Guidelines for Fresh and Marine Water Quality (including sediment) and the Australian National Environment Protection (Assessment of Site Contamination) Measure"]
[]
[]
[]
[null,null,null,null,null,null,"Developed by "]
{"$rows_left_out":11}
{"sheet":"Instruction","index":2,"n_rows":21,"n_cols":10,"rows_kept":21,"cut":false,"hidden":false,"merged":[[27,6,27,16],[14,6,14,7],[5,4,5,7]]}
[]
[]
[null,"Click here to see \"All Result\" -->","All Result"]
[]
[]
[null,null,null,null,"Freshwater "]
[]
[null,"Tabs contain questionaries -->           ","Freshwater/metal/nonplant",null,"Freshwater/non-metal/non-plant ",null,null,"Freshwater/metal/plant",null,"Freshwater/non-metal/plant"]
[]
[]
{"$rows_left_out":12}
{"sheet":"All Result","index":3,"n_rows":43,"n_cols":32,"rows_kept":43,"cut":false,"hidden":false,"merged":[[3,0,3,20]]}
["Chemical:","Alpha-cypermethrin"]
["Medium:","Freshwater"]
[]
["Quality Assessment Scoring Sheets"]
["Category","Paper and data unique identier","Total score","Quality score","Comment ","Species name","Life stage","Exposure duration","Measure of toxicity","Toxicity endpoint","Toxicity value","Taxonomic group","Phylum","Class","Medium","Temperature","Acute or Chronic","pH","Salinity","Citation","Citation No.",null,null,null,null,null,null,null,null,null,null,"Olivia Formulation Check"]
["Freshwater/non-metal/non- plant","695-1",69,0.71399999999999997,"The highest possible grade for this datum is acceptable.","Paratya australiensis","Adult","96 hrs","LC50","Mortality","0.019 ug/L","Macroinvertebrate","Arthropoda","Malacostraca","NA","22.6-24.2oC","Acute ","7.7-7.9","N.A.","Kumar, A. R. Correll, S. Grocke and C. Bajet. 2010. Toxicity of selected pesticides to freshwater shrimp, Paratya australiensis (Decapoda: Atyidae): Use of time series toxicity data to predict chronic lethality. Ecotoxicology and Environmental Safety 73: 360-369.","695"]
["Freshwater/non-metal/non- plant","696-1",91,0.95599999999999996,"The highest possible grade for this datum is acceptable.","Ceriodaphnia dubia","Neonate","48 hrs","LC50","Mortality","0.23 ug/L","Microinvertebrate","Arthropoda","Branchiopoda","Moderately hard water","23-25oC","Acute ","8.0-8.1","N.A.","Shen, M.F., A. Kumar, S.Y. Ding and S. Grocke. 2012. Comparative study on the toxicity of pyrethroids, alpha-cypermethrin and deltamethrin to Ceriodaphnia dubia. Ecotoxicology and Environemental Safety 78: 9-13.","696"]
["Freshwater/non-metal/non- plant","696-2",91,0.95599999999999996,"The highest possible grade for this datum is acceptable.","Ceriodaphnia dubia","Neonate","192 hrs (8 days)","NOEC","Mortality","0.1 ug/L","Microinvertebrate","Arthropoda","Branchiopoda","Moderately hard water","23-25oC","Acute ","8.0-8.1","N.A.","Shen, M.F., A. Kumar, S.Y. Ding and S. Grocke. 2012. Comparative study on the toxicity of pyrethroids, alpha-cypermethrin and deltamethrin to Ceriodaphnia dubia. Ecotoxicology and Environemental Safety 78: 9-13.","696"]
["Freshwater/non-metal/non- plant","696-3",91,0.95599999999999996,"The highest possible grade for this datum is acceptable.","Ceriodaphnia dubia","Neonate","192 hrs (8 days)","LOEC","Mortality","0.25 ug/L","Microinvertebrate","Arthropoda","Branchiopoda","Moderately hard water","23-25oC","Acute ","8.0-8.1","N.A.","Shen, M.F., A. Kumar, S.Y. Ding and S. Grocke. 2012. Comparative study on the toxicity of pyrethroids, alpha-cypermethrin and deltamethrin to Ceriodaphnia dubia. Ecotoxicology and Environemental Safety 78: 9-13.","696"]
["Freshwater/non-metal/non- plant","696-4",91,0.95599999999999996,"The highest possible grade for this datum is acceptable.","Ceriodaphnia dubia","Neonate","192 hrs (8 days)","NOEC","Reproduction","0.05 ug/L","Microinvertebrate","Arthropoda","Branchiopoda","Moderately hard water","23-25oC","Acute ","8.0-8.1","N.A.","Shen, M.F., A. Kumar, S.Y. Ding and S. Grocke. 2012. Comparative study on the toxicity of pyrethroids, alpha-cypermethrin and deltamethrin to Ceriodaphnia dubia. Ecotoxicology and Environemental Safety 78: 9-13.","696"]
{"$rows_left_out":34}
{"sheet":"Sheet1","index":4,"n_rows":70,"n_cols":29,"rows_kept":70,"cut":false,"hidden":true,"merged":[]}
[]
[{"$f":"#REF!","v":{"$error":"#REF!"}},{"$f":"#REF!","v":{"$error":"#REF!"}},{"$f":"#REF!","v":{"$error":"#REF!"}},{"$f":"#REF!","v":{"$error":"#REF!"}},{"$f":"#REF!","v":{"$error":"#REF!"}},{"$f":"#REF!","v":{"$error":"#REF!"}},{"$f":"#REF!","v":{"$error":"#REF!"}},{"$f":"#REF!","v":{"$error":"#REF!"}},{"$f":"#REF!","v":{"$error":"#REF!"}},{"$f":"#REF!","v":{"$error":"#REF!"}},{"$f":"#REF!","v":{"$error":"#REF!"}},{"$f":"#REF!","v":{"$error":"#REF!"}},{"$f":"#REF!","v":{"$error":"#REF!"}},{"$f":"#REF!","v":{"$error":"#REF!"}},{"$f":"#REF!","v":{"$error":"#REF!"}},{"$f":"#REF!","v":{"$error":"#REF!"}},{"$f":"#REF!","v":{"$error":"#REF!"}},{"$f":"#REF!","v":{"$error":"#REF!"}},{"$f":"#REF!","v":{"$error":"#REF!"}},{"$f":"#REF!","v":{"$error":"#REF!"}},{"$f":"#REF!","v":{"$error":"#REF!"}},{"$f":"#REF!","v":{"$error":"#REF!"}},{"$f":"#REF!","v":{"$error":"#REF!"}},{"$f":"#REF!","v":{"$error":"#REF!"}},{"$f":"#REF!","v":{"$error":"#REF!"}},{"$f":"#REF!","v":{"$error":"#REF!"}}]
[{"$f":"#REF!","v":{"$error":"#REF!"}},{"$f":"#REF!","v":{"$error":"#REF!"}},{"$f":"#REF!","v":{"$error":"#REF!"}},{"$f":"#REF!","v":{"$error":"#REF!"}}]
[{"$f":"#REF!","v":{"$error":"#REF!"}},{"$f":"#REF!","v":{"$error":"#REF!"}},{"$f":"#REF!","v":{"$error":"#REF!"}},{"$f":"#REF!","v":{"$error":"#REF!"}},{"$f":"#REF!","v":{"$error":"#REF!"}},{"$f":"#REF!","v":{"$error":"#REF!"}},{"$f":"#REF!","v":{"$error":"#REF!"}},{"$f":"#REF!","v":{"$error":"#REF!"}},{"$f":"#REF!","v":{"$error":"#REF!"}},{"$f":"#REF!","v":{"$error":"#REF!"}},{"$f":"#REF!","v":{"$error":"#REF!"}},{"$f":"#REF!","v":{"$error":"#REF!"}},{"$f":"#REF!","v":{"$error":"#REF!"}},{"$f":"#REF!","v":{"$error":"#REF!"}},{"$f":"#REF!","v":{"$error":"#REF!"}},{"$f":"#REF!","v":{"$error":"#REF!"}},{"$f":"#REF!","v":{"$error":"#REF!"}},{"$f":"#REF!","v":{"$error":"#REF!"}},{"$f":"#REF!","v":{"$error":"#REF!"}},{"$f":"#REF!","v":{"$error":"#REF!"}},{"$f":"#REF!","v":{"$error":"#REF!"}},{"$f":"#REF!","v":{"$error":"#REF!"}},{"$f":"#REF!","v":{"$error":"#REF!"}},{"$f":"#REF!","v":{"$error":"#REF!"}},{"$f":"#REF!","v":{"$error":"#REF!"}},{"$f":"#REF!","v":{"$error":"#REF!"}}]
["Answers",{"$f":"IF(#REF!=0,\"\",#REF!)","v":{"$error":"#REF!"}},{"$f":"IF(#REF!=0,\"\",#REF!)","v":{"$error":"#REF!"}},{"$f":"IF(#REF!=0,\"\",#REF!)","v":{"$error":"#REF!"}},{"$f":"IF(#REF!=0,\"\",#REF!)","v":{"$error":"#REF!"}},{"$f":"IF(#REF!=0,\"\",#REF!)","v":{"$error":"#REF!"}},{"$f":"IF(#REF!=0,\"\",#REF!)","v":{"$error":"#REF!"}},{"$f":"IF(#REF!=0,\"\",#REF!)","v":{"$error":"#REF!"}},{"$f":"IF(#REF!=0,\"\",#REF!)","v":{"$error":"#REF!"}},{"$f":"IF(#REF!=0,\"\",#REF!)","v":{"$error":"#REF!"}},{"$f":"IF(#REF!=0,\"\",#REF!)","v":{"$error":"#REF!"}},{"$f":"IF(#REF!=0,\"\",#REF!)","v":{"$error":"#REF!"}},{"$f":"IF(#REF!=0,\"\",#REF!)","v":{"$error":"#REF!"}},{"$f":"IF(#REF!=0,\"\",#REF!)","v":{"$error":"#REF!"}},{"$f":"IF(#REF!=0,\"\",#REF!)","v":{"$error":"#REF!"}},{"$f":"IF(#REF!=0,\"\",#REF!)","v":{"$error":"#REF!"}},{"$f":"IF(#REF!=0,\"\",#REF!)","v":{"$error":"#REF!"}},{"$f":"IF(#REF!=0,\"\",#REF!)","v":{"$error":"#REF!"}},{"$f":"IF(#REF!=0,\"\",#REF!)","v":{"$error":"#REF!"}},{"$f":"IF(#REF!=0,\"\",#REF!)","v":{"$error":"#REF!"}},{"$f":"IF(#REF!=0,\"\",#REF!)","v":{"$error":"#REF!"}},{"$f":"IF(#REF!=0,\"\",#REF!)","v":{"$error":"#REF!"}},{"$f":"IF(#REF!=0,\"\",#REF!)","v":{"$error":"#REF!"}},{"$f":"IF(#REF!=0,\"\",#REF!)","v":{"$error":"#REF!"}}]
[{"$f":"#REF!","v":{"$error":"#REF!"}},{"$f":"#REF!","v":{"$error":"#REF!"}},{"$f":"#REF!","v":{"$error":"#REF!"}},{"$f":"#REF!","v":{"$error":"#REF!"}},{"$f":"#REF!","v":{"$error":"#REF!"}},{"$f":"#REF!","v":{"$error":"#REF!"}},{"$f":"#REF!","v":{"$error":"#REF!"}},{"$f":"#REF!","v":{"$error":"#REF!"}}]
[{"$f":"#REF!","v":{"$error":"#REF!"}},{"$f":"#REF!","v":{"$error":"#REF!"}},{"$f":"#REF!","v":{"$error":"#REF!"}},{"$f":"#REF!","v":{"$error":"#REF!"}},{"$f":"#REF!","v":{"$error":"#REF!"}},{"$f":"IF(#REF!=0,\"\",#REF!)","v":{"$error":"#REF!"}},{"$f":"IF(#REF!=0,\"\",#REF!)","v":{"$error":"#REF!"}},{"$f":"IF(#REF!=0,\"\",#REF!)","v":{"$error":"#REF!"}}]
[]
[]
[]
{"$rows_left_out":61}
{"sheet":"FW nonmetal nonplant","index":5,"n_rows":104,"n_cols":53,"rows_kept":104,"cut":false,"hidden":false,"merged":[[65,2,68,2],[65,7,68,7],[59,7,61,7],[52,2,54,2],[52,7,54,7],[56,7,58,7],[62,2,64,2],[62,7,64,7],[43,2,45,2],[43,7,45,7],[46,2,48,2],[46,7,48,7],[49,2,51,2],[49,7,51,7],[34,2,36,2],[34,7,36,7],[37,2,39,2],[37,7,39,7],[40,2,42,2],[40,7,42,7],[25,2,27,2],[25,7,27,7],[28,2,30,2],[28,7,30,7],[31,2,33,2],[31,7,33,7],[17,2,19,2],[17,7,19,7],[20,2,21,2],[20,7,21,7],[22,2,24,2],[22,7,24,7],[3,4,7,4],[9,2,9,4],[11,2,13,2],[11,7,13,7],[14,2,16,2],[14,7,16,7]]}
[null,1,"Fill in the blank cells below, based on information provided in the paper being assessed. You can either pick an option from the dropdown list or add the appropriate detail using the 'Add to list' button. ",null,null,null,null,null,null,null,null,null,null,null,"* All the text in RED are used for drop down list ,make changes with caution."]
[null,null,"Category",{"$f":"IF(AF3=\"\",0,1)","v":1},"Freshwater/non-metal/non- plant",{"$f":"IF(E3=\"\",0,1)","v":1},"Citation No.",{"$f":"IF(ISERROR(FIND(\"-\",E3)),E3,LEFT(E3,FIND(\"-\",E3)-1))","v":"3104"},null,"Taxonomic group",null,null,null,null,"Species",null,null,"Lifestage",null,null,"Exposure duration",null,null,"Measure of toxicity",null,null,"Toxicity endpoint",null,null,"Taxonomic group",null,null,"Phylum",null,null,"Class",null,null,"Media",null,null,"Temperature ",null,null,"Acute Or Chronic",null,null,"PH",null,null,"Salinity/Comdictivity"]
[null,null,"Paper and data unique identifier(eg. 1-1,10-150)",{"$f":"IF(AI3=\"\",0,1)","v":1},"3104-2",{"$f":"IF(E4=\"\",0,1)","v":1},"Species (Scientific name)",null,null,"Phylum",null,null,null,null,"Acanthocyclops robustus",31,{"$f":"IF(P3=0,\"\",INDEX(O3:O102,P3))","v":"Daphnia magna"},"<120 days post h atch",46,{"$f":"IF(S3=0,\"\",INDEX(R3:R102,S3))","v":"Neonate"},"10 day",51,{"$f":"IF(V3=0,\"\",INDEX(U3:U102,V3))","v":"21 days"},"EC10",15,{"$f":"IF(Y3=0,\"\",INDEX(X3:X102,Y3))","v":"LOEC"},"ability to cling",42,{"$f":"IF(AB3=0,\"\",INDEX(AA3:AA102,AB3))","v":"Reproduction"},"Amphibian",9,{"$f":"IF(AE3=0,\"\",INDEX(AD3:AD102,AE3))","v":"Macroinvertebrate"},"\tChytridiomycota",5,{"$f":"IF(AH3=0,\"\",INDEX(AG3:AG102,AH3))","v":"Arthropoda"},"\tOstracoda",6,{"$f":"IF(AK3=0,\"\",INDEX(AJ3:AJ102,AK3))","v":"Branchiopoda"},"algaltoxkit",58,{"$f":"IF(AN3=0,\"\",INDEX(AM3:AM102,AN3))","v":"NA"},8,75,{"$f":"IF(AQ3=0,\"\",INDEX(AP3:AP102,AQ3))","v":"NA"},"7.378-8.33",4,{"$f":"IF(AT3=0,\"\",INDEX(AS3:AS102,AT3))","v":"Chronic"},7,43,{"$f":"IF(AW3=0,\"\",INDEX(AV3:AV102,AW3))","v":"NA"},null,null,"N.A."]
[null,null,"Citation",{"$f":"IF(AL3=\"\",0,1)","v":1},"OPP Pesticide Ecotoxicity Database - Alpha-cypermethrin. Accessed 16 April 19",{"$f":"IF(H8=\"\",0,1)","v":1},"Lifestage",null,null,"Class",null,null,null,null,"Aedes aegypti",null,null,"<24h neonate f2 ",null,null,"11 hour",null,null,"EC50",null,null,"ability to swim",null,null,"Bacteria",null,null,"\tOomycota",null,null,"\tSordariomycetes",null,null,"artificial system water",null,null,10,null,null,"7.78-8.33",null,null,7.50]
[null,null,null,{"$f":"IF(AO3=\"\",0,1)","v":1},null,{"$f":"IF(W3=\"\",0,1)","v":1},"Exposure duration",null,null,"Media",null,null,null,null,"Aedes albopictus",null,null,"<24hr neonate",null,null,"1-2 weeks",null,null,"EC50",null,null,"ability to thrash when prodded",null,null,"Chordata",null,null,"\tRotifera",null,null,"Actinopterygii",null,null,"ATSM hardwater",null,null,12,null,null,"Acute ",null,null,7.50]
[null,null,null,{"$f":"IF(AR3=\"\",0,1)","v":1},null,{"$f":"IF(Q3=\"\",0,1)","v":1},"Measure of toxicity",null,null,"Temperature ",null,null,null,null,"Aedes albopictus",null,null,">23 days",null,null,"120hpf",null,null,"hatchability",null,null,"ability to walk/crawl",null,null,"Chromista",null,null,"Actinopterygii",null,null,"Amphibia",null,null,"Bore water",null,null,12,null,null,"Chronic",null,null,7.66]
[null,null,null,{"$f":"IF(AU3=\"\",0,1)","v":1},null,{"$f":"IF(T3=\"\",0,1)","v":1},"Toxicity endpoint",null,null,"Acute Or Chronic ",null,null,null,null,"Aedes albopictus HAmAal strain",null,null,">6 month ",null,null,"13 days",null,null,"IC25",null,null,"activity",null,null,"Fish",null,null,"Arthropoda",null,null,"Bivalvia",null,null,"CBS culture collection",null,null,12,null,null,"N.A.",null,null,7.67]
[null,null,null,null,null,{"$f":"IF(W3=\"\",0,1)","v":1},"Toxicity value","0.0744 ug/L",null,"PH",null,null,null,null,"Aedes albopictus Ikaken strain",null,null,"1 month",null,null,"14 days",null,null,"LC10",null,null,"Body length",null,null,"Fish",null,null,"Ascomycota",null,null,"Branchiopoda",null,null,"Clean river water",null,null,13,null,null,null,null,null,7.80]
[null,2,"Select the appropriate answer option to each question. Comments can be added to the cells in column H.",null,null,{"$f":"IF(Z3=\"\",0,1)","v":1},null,null,null,"Salinity/Conductivity","N.A.",null,null,null,"Aedes albopictus MAmAal strain",null,null,"1 year old",null,null,"19 days",null,null,"LC100",null,null,"Body weight",null,null,"Flagellate",null,null,"Basidiomycota",null,null,"Chlorophyceae  ",null,null,"Clean river watrer",null,null,13,null,null,null,null,null,8.10]
[null,"*","If the selected answer option does not work try clicking on any other cell first and then click back on the answer option again.",null,null,{"$f":"IF(AC3=\"\",0,1)","v":1},null,null,null,null,null,null,null,null,"Aedes albopictus SFmAal strain",null,null,"1st instar larvae",null,null,"21 day",null,null,"LC50",null,null,"Brood size",null,null,"Fungi",null,null,"Chlorophyta",null,null,"Chytridiomycetes",null,null,"Daphtoxkit",null,null,13,null,null,null,null,null,"6.5-7"]
{"$rows_left_out":95}
{"sheet":"FW nonmetal nonplant_WS","index":6,"n_rows":111,"n_cols":24,"rows_kept":111,"cut":false,"hidden":false,"merged":[]}
[]
["Question No.",1,2,3,4,5,6,7,8,9,10,11,12,13,14,15,16.10,16.60,17,18,"Total Score","Quality Score",null,"Comment "]
["Short Questions","Duration of the exposure ","Biological endpoint","Biological effect stated or not","Biological effect quantified or not","Appropriate controls","Control & contaminant concentration","Test acceptability criteria","Characteristics of the test organism"," Type of test media","Type of exposure","Contaminant concentrations","Parallel reference toxicant toxicity tests","Concentration–response relationship","Determine the toxicity","NOEC/LOEC or LC/EC/BEC","pH","Dissolved oxygen","Temperature","Grade or purity"]
["Category","Freshwater/non-metal/non- plant","Paper and data unique identifier(eg. 1-1,10-150)","695-1"]
["Scores",10,10,5,5,5,5,5,0,0,4,0,0,0,4,0,3,3,3,3,{"$f":"SUM(B5:T5)","v":65},{"$f":"U5/91","v":0.7142857142857143},null,""]
["Answers","96 hours","LC50. Mortality defined as lack of movement or response to gentle prodding","LC50","LC50","Control and solvent control","Three replicates (triplicate)","Tests were considered valid if mortality in each of the water and solvent controls was not less than 10% and the DO level in all the test solutions > 60% saturation","Field collected organisms acclimated for at least 2 weeks prior to testing ","Not stated","Static renewal - every 24 hours","Not measured","Not stated ","Not stated or observed","Spearman Karber method","Not stated","7.7-7.9","> 80% saturation","23 +/- 0.8oC",">97% purity "]
["Category","Freshwater/non-metal/non- plant","Paper and data unique identifier(eg. 1-1,10-150)","696-1"]
["Scores",10,10,5,5,5,5,5,5,5,4,0,4,4,4,4,3,3,3,3,{"$f":"SUM(B8:T8)","v":87},{"$f":"U8/91","v":0.95604395604395609},null,""]
["Answers","48 hours","LC50. - Immobilization defined as the failure to move within 15 s of the beaker being gently swirled","LC50","LC50","Water control, acetone control (negative control) and copper sulphate (positive control)","Four replicates per treatment","Mortality in the controls (water and solvent controls) was < 10% and the reference toxiccant LC50 was within the normal range","Newborn (neonates)","Moderately hard water","Static renewal - every 24 hours","Not measured","Copper sulphate","Stated and in Figure 1","Trimmed Spearman Karber method","95% CI","8.0-8.1","5.5-5.9 mg/L","23-25 oC","Purchased from Sigma Aldrich (assume technical grade)"]
["Category","Freshwater/non-metal/non- plant","Paper and data unique identifier(eg. 1-1,10-150)","696-2"]
{"$rows_left_out":102}
{"sheet":"FW metal plant_WS","index":7,"n_rows":14,"n_cols":25,"rows_kept":14,"cut":false,"hidden":false,"merged":[]}
[]
["Question No.",1,2,3,4,5,6,7,8,9,10,11,12,13,14,15,16.10,16.20,16.30,16.40,17,18,"Total Score","Quality Score"]
["Short Questions","Duration of the exposure ","Biological endpoint","Biological effect stated or not","Biological effect quantified or not","Appropriate controls","Control & contaminant concentration","Test acceptability criteria","Characteristics of the test organism"," Type of test media","Type of exposure","Contaminant concentrations","Parallel reference toxicant toxicity tests","Concentration–response relationship","Determine the toxicity","NOEC/LOEC or LC/EC/BEC","pH","Hardness","Alkalinity ","Organic carbon concentration","Temperature","Grade or purity"]
["Marks Awarded ","10 or 0","10,5 or 0","5 or 0 ","5 or 0 ","5 or 0 ","5 or 0 ","5 or 0 ","5 or 0 ","5 or 0 ","4 or 0","4 or 2 or 0","4 or 2","4 or 2","4 or 2","4 or 2","3 or 1 or 0","3 or 1 or 0","3 or 1 or 0","3 or 1 or 0","3 or 0","3 or 0 "]
["Max. Possible Score",10,10,5,5,5,5,5,5,5,4,4,4,4,4,4,3,3,3,3,3,3,{"$f":"SUM(B5:V5)","v":97}]
["Category","Freshwater/metal/plant","Paper and data unique identifier(eg. 1-1,10-150)","3105-1"]
["Scores",10,10,5,0,5,5,2,5,5,4,0,0,0,4,0,0,0,0,0,0,3,58,0.59793814432989689,"The highest possible grade for this datum is acceptable."]
["Answers","96 hrs","Based on guideline - endpoint is population growth (cell density). Based on yeild, growth rate and area under the growth curve","NOEC","NOEC","Based on guideline - appropriate controls required","Based on guideline - minimum of 4 replicates","USEPA Guideline 122-2 (superceded by USEPA (2012) OCSPP 850.4500)","Based on guideline - 10,000 cells/ml","Based on guideline - synthetic growth medium","Static","Not stated","Not stated","Not stated","Based on guideline - appropriate statistics required","Not stated","Not stated","Not stated","Not stated","Not stated","Not stated","99.2% purity "]
["Category","Freshwater/metal/plant","Paper and data unique identifier(eg. 1-1,10-150)","3107-1"]
["Scores",10,10,5,0,5,5,2,5,5,4,0,0,0,4,0,0,0,0,0,0,3,58,0.59793814432989689,"The highest possible grade for this datum is acceptable."]
{"$rows_left_out":4}